harmony-alerts mailing list archives

Site index · List index
Message view « Date » · « Thread »
Top « Date » · « Thread »
From nom...@intel.com
Subject [build-test alert] FAILED Linux x86: tomcat-scenario
Date Wed, 29 Aug 2007 10:50:22 GMT
svn.revision=570360
BUILD FAILED:
	Ant Error Message:
/export/users2/cc/cc-suites/scripts/cc-exec-adaptor.xml:101: The following error occurred
while executing this line: /export/users2/cc/cc-suites/adaptors/tomcat-scenario/adaptor.xml:105:
Tomcat server startup timeout exceeded

Date of build:	08/29/2007 17:45:16
Time to build:	5 minutes 1 second
Last changed:	08/29/2007 14:15:15
Last log entry:	snapshot

***********************************************************
Errors/Warnings:	(1)
            
The execution FAILED with the following exception:
The following error occurred while executing this line:
/export/users2/cc/cc-suites/adaptors/tomcat-scenario/adaptor.xml:105: Tomcat server startup
timeout exceeded

***********************************************************
Unit Tests: (0)
        
No Tests Run: This project doesn't have any tests

***********************************************************
Modifications since last successful build:	(1)
            
add cc-snapshot log20070829141515Lbuild.15 08/29/2007 14:15:15snapshot

begin 644 execution_log.zip
M4$L#! H    ( $F.'3=<?EQ))@$  $,"   2    97AE8W5T:6]N7VQO9RYH
M=&ULK9)!2P,Q$(7O^ROF(CUUTXH5B>N"4 7!8V\BDB:SW4@V"9.)W?KK3=<*
M@B >A$ .;_*]Q^0U/0^N;;;!'-HF$K:-@L0'AS>S+GB>)_N.$JX69]>SMM(.
ME9<5 #P9=,CX#.OC;?U.@L Q!F*1$U(Z%UJ7,T_9,B:QS=8909BRXR0X#%H5
MM$:OR 9AO<&Q+D'^G?R:XLLO:%A!9QTFZ"@,?[!Q=IN$BDKW.#]97=:+>GDA
M7-BEJJ)<ME-M>@0<46>VP</][</CW1KVEGO@HG3!N; _FN.H,1YGY/3DFT 4
M"(+6F0@-[/N2\8M89.YM F<]RNJWR,JHR(%^+N4DU./@Y'*QDK"9!J PWI#*
M[ROB'('M@"'S%!,-FJH1JFW$U!'QV1<QE><#4$L! A0#"@    @ 28X=-UQ^
M7$DF 0  0P(  !(              *2!     &5X96-U=&EO;E]L;V<N:'1M
7;%!+!08      0 ! $    !6 0     ! 
end

Mime
View raw message