harmony-alerts mailing list archives

Site index · List index
Message view « Date » · « Thread »
Top « Date » · « Thread »
From nom...@intel.com
Subject [build-test alert] FAILED Linux x86: jdktools-test
Date Wed, 29 Aug 2007 10:42:57 GMT
svn.revision=570360
BUILD FAILED:
	Ant Error Message:
/export/users2/cc/cc-suites/scripts/cc-exec-adaptor.xml:101: The following error occurred
while executing this line: /export/users2/cc/cc-suites/adaptors/jdktools-test/adaptor.xml:31:
The following error occurred while executing this line: /export/users2/cc/cc-suites/scripts/framework.xml:1069:
Java returned: 1

Date of build:	08/29/2007 17:42:42
Time to build:	10 seconds
Last changed:	08/29/2007 14:15:15
Last log entry:	snapshot

***********************************************************
Errors/Warnings:	(9)
            
[junit] Tests FAILED
[junit] Tests FAILED
BUILD FAILED
/export/users2/cc/cc-suites/build/checkouts/hdk/working_jdktools/build.xml:242: The following
error occurred while executing this line:
/export/users2/cc/cc-suites/build/checkouts/hdk/working_jdktools/make/build-test.xml:60: The
following error occurred while executing this line:
/export/users2/cc/cc-suites/build/checkouts/hdk/working_jdktools/make/properties.xml:319:
The following error occurred while executing this line:
/export/users2/cc/cc-suites/build/checkouts/hdk/working_jdktools/modules/samsa/build.xml:136:
exec returned: 1
Total time: 3 seconds
The execution FAILED with the following exception:
The following error occurred while executing this line:
/export/users2/cc/cc-suites/adaptors/jdktools-test/adaptor.xml:31: The following error occurred
while executing this line:
/export/users2/cc/cc-suites/scripts/framework.xml:1069: Java returned: 1

***********************************************************
Unit Tests: (0)
        
No Tests Run: This project doesn't have any tests

***********************************************************
Modifications since last successful build:	(1)
            
add cc-snapshot log20070829141515Lbuild.15 08/29/2007 14:15:15snapshot

begin 644 execution_log.zip
M4$L#! H    ( %N-'3<!V5#RM@0  .L3   2    97AE8W5T:6]N7VQO9RYH
M=&UL[5AK;]LV%/WN7W$Q8&@+1)+MK&ZK)0&R)EU;)%O1=L&V(C!HZMJB39$"
M2?FQ7[]+2F[B-G+2-.U:8$X,ZW%U'X>']Y#:RUTA#_9&.EL=[)4&#_886+>2
MN']OK)6+K/@'4WC<_?'G>P>=R**KRFB:S9S6TD8+FW8Z455FS.'F5?"?=[A$
M?@Z'#@S.A15:P<-'W=U!-^YT3*765E,V9^?P2R5D-A:2HHW\8;PLY(;!QHE#
MZS:?;R+R7']@>OG&_@T_K0[>4ERA)K N%D9",2/0QG%\MU$W3KA$IB)?M(UT
MY<KJX^+?92C1X3D<^5^?8R8,<J?-"A)<EMJXI+)H;#_AG/XC6PERF 2P$YXC
MGY%GF^39+%EH,R,/PW65C9&//S3H76U)59>K:&HP\F-ITRV&>:&SFUDV+K>8
M^-0B\E=]Y"D<%C,"XQR>&B2F9AZ9]*N"$DSK\6MG[5-=E$+ZD7OYZN@PE&3;
M7=)<+1F!ATLNJPS;W09GC15(0?/FUJ5SR:R58I1D6$J]:FS7@,13:@1Q$ZD]
M<9KYUR'QNE)J"PZ738'X/JHF$S3P\NQT_U,JLXJ5-M<NE#CU7X,)S>?$1[D^
M('[A@.^FE1+N @QM)C$K&;F+<V8*K58UX &?>)HMROA,&%<Q>4I&0F%\1BE1
MT_4]J]7[B6:9]X[&:/-)Q&BM)L,QJZ1+B"@3/IR@BJU.H5)TG;+*P*Z*D98I
M#/_N#_1H.A1V6# S&XXDX[.A4$/'1A)?]7NOF'&"R>%KG"/]_#Z:4C]KK>37
MI\3ND6'4[SA32CL8$=^I/,Q2N)Q+JX?GIW\=_WE\TAWTC^&%<F@4DW!V6F.3
MPC-&?2H#IX&'/@(OR0/=;_7W[/#%R?&1?T"HN9X%PGRL$FMK/TRV>>8+D.&Y
MEMGQ')6S__/A^^;#IO#IBN?1F%*I#-H@I=MD,EB'_*^WO9#4+58WEJ$WAZ=O
MOI(.65;8JX7('W&M."-\?].4C:B7<V$% DQEH#0H*MR/*R[=#F3:WR?VT"2:
MW(FHU4!L5S5_-Z;Y$^>ZP,_6F&TI^97L>PV":%Y+!A'T2Z^/FCSJ'4+H9/"\
M[F1PPBI%YP92N,\?T+JH7!DQR1WTGCSI[4"_VQW 6[)O'GNCQVY!'(1GFIH*
M<SY_ZEV"9H\4')4ELN\ H_$M2[K@F\F5:_602H!AC<(/O?AAW/WAROU$L";V
M1TR6.:-4?8?AM(3SJW ?WQ]3,A2M]7$[5[ /IMX4[<#]PVH"_<>^P$</=N!$
MJ&J9"+;;3R:<PVY,?SNTE:*]@,5Z2=GJ.7>N3)-DK0V-5)!JW)@+_+\BP_>O
M0.M*;J] :P]WI4!K?]<KT.:>_(\7)T=72=#=T,%O\=/^3_TTS.:QEE(O+D9>
M<UX90^4M<JH2? %5:-;4BOW,5A^(S6?G5+ 9)A<[M9#=H/LM)5<:72(Q$&U(
M;K?WY%O)KMYY)T%Y+PUN;W>0AO#4MEQEE"=^KYUO;[4C?CM18 J[8)&D.K.=
MCB^QJ8&Z4</AA7 YU;-1_))CZ6W2SFU1V88$RUCI2$O>+S0"3=:7FQ&Y_8!L
M"VVY$26!/S:L0(]^C6YW0 0(<_XRO'L).]A+PKN\I'ZOEX27?/\"4$L! A0#
M"@    @ 6XT=-P'94/*V!   ZQ,  !(              *2!     &5X96-U
C=&EO;E]L;V<N:'1M;%!+!08      0 ! $    #F!      ! 
end

Mime
View raw message