harmony-alerts mailing list archives

Site index · List index
Message view « Date » · « Thread »
Top « Date » · « Thread »
From nom...@intel.com
Subject [build-test alert] FAILED Linux x86: dacapo
Date Wed, 29 Aug 2007 07:25:10 GMT
svn.revision=570360
BUILD FAILED:
	Ant Error Message:
/export/users2/cc/cc-suites/scripts/cc-exec-adaptor.xml:101: The following error occurred
while executing this line: /export/users2/cc/cc-suites/adaptors/dacapo/adaptor.xml:102: Not
all workloads completed successfully

Date of build:	08/29/2007 14:25:05
Time to build:	1 second
Last changed:	08/29/2007 14:15:15
Last log entry:	snapshot

***********************************************************
Errors/Warnings:	(12)
            
java version "1.5.0"
pre-alpha : not complete or compatible
svn = r570360, (Aug 28 2007), Linux/ia32/gcc 3.3.3, release build
http://harmony.apache.org
Loading error /export/users2/cc/cc-suites/build/checkouts/snapshot/hdk/jdk/jre/bin/default/libgc_gen.so:
undefined symbol: _Z26obj_is_mark_black_in_tableP21Partial_Reveal_Object
GC library cannot be loaded: libgc_gen.so
HMYEXEL062E Internal VM error: Failed to create Java VM
FAILED to invoke JVM.
Number of tests: (...........)
N of runned tests(${number.of.runned.tests})
The execution FAILED with the following exception:
The following error occurred while executing this line:
/export/users2/cc/cc-suites/adaptors/dacapo/adaptor.xml:102: Not all workloads completed successfully

***********************************************************
Unit Tests: (0)
        
No Tests Run: This project doesn't have any tests

***********************************************************
Modifications since last successful build:	(1)
            
add cc-snapshot log20070829141515Lbuild.15 08/29/2007 14:15:15snapshot

begin 644 execution_log.zip
M4$L#! H    ( "1S'3<&7-GHG (  (<$   2    97AE8W5T:6]N7VQO9RYH
M=&ULA51M;]HP$/[.KSA-FUHD&@-5:9M1I*JC:R?HJFZJ]J(JNC@78C!V9#N\
M;-I_GQU8UWS9 A$D]]S+\]R=AX5;RM$PU=EV-"P-C88(UFTE71SD6KDC*WY0
M#&?=-V\/1BU3J;@%X?I.&^)/<%DB+PANT"RUVL($*^6?#<1PR-MPI<NM$;/"
M0>_\O->!?K<[@,\>OW?[I'.W1D-PK2N5H1-:@38@G 4I."FKC>T 6L"R]"\P
ME10UTL]QA; B8X/GJUYT$G5?00/A&1VA+ OT)2GM@.ME*<E1R!/^^Z0^:L/%
MKA1<@#DY[1X/NATXO*QFT#\+Q9^V.S 1JMHP@<=]-N,<CB/_Z8 A26@)TDK(
MK!&M<*Z,&2MV"D58,X^TF350$XV94#,@8WQAC#:E-HY5UE/K,\[]]\A6PI%E
M=0;F8_"%KIQE5F%I"^U8D2W8/-R&6"H4RRC'2CHF13KCR8Q49'4,7F?*A:(,
M[':9:AE#\JT_T.D\$399HEDDJ42^2(1*7-#[OM^[1^,$RN2!5N1_/J9SXJY1
M_?LKWZ_4H-D"1Q5D3@FDIT19#"_S-[QNIE_'7\:3[J _AEOER"B4\#C=:1##
M-0KIRW0:N"'T'?L0FOTX;<2XOKR=C-\%D% KO?"@QVES1![(>A5BZ.W?<C^3
M3_5D!KU[D/LLP?__FILZDF49<BR?J?!"/\%=M4S]U.L</-Q9/_W1WZO=A :4
MWZ/0@AI\^/JGJMTCG4<[0U0;?K5;K; L@4=5[\:>[5JX IRWY%I*O:[G9L.I
M#)BX=GEAJ =*<UX9XS.NBT!W']&;72'"KBF*6_\2 #,LG5_&/?<_S]%F*>->
MMQ_#G>\Y2@EK;1:A\?9YT?R@59R3M7DEY;8U9#@:LOJ<8;LSA]4'T&]02P$"
M% ,*    "  D<QTW!ES9Z)P"  "'!   $@              I($     97AE
E8W5T:6]N7VQO9RYH=&UL4$L%!@     !  $ 0    ,P"      $! 
end

Mime
View raw message