harmony-alerts mailing list archives

Site index · List index
Message view « Date » · « Thread »
Top « Date » · « Thread »
From nom...@intel.com
Subject [build-test alert] FAILED Linux x86: drlvm-reg-test debug
Date Tue, 28 Aug 2007 19:24:49 GMT

BUILD FAILED:
	Ant Error Message:
/export/users/cc/cc-common/scripts/cc-exec-adaptor.xml:101: The following error occurred while
executing this line: /export/users/cc/cc-common/adaptors/drlvm-reg-test/adaptor.xml:73: There
were drlvm-reg-test failures

Date of build:	08/29/2007 02:23:15
Time to build:	23 seconds
Last changed:	08/29/2007 01:16:55
Last log entry:	hdk

***********************************************************
Errors/Warnings:	(10)
            
[cc] /export/users/cc/cc-common/build/checkouts/hdk/working_vm/src/test/regression/H4511/GCTagged.cpp:10:
error: integer
[cc]    constant is too large for "long" type
BUILD FAILED
/export/users/cc/cc-common/build/checkouts/hdk/working_vm/build/make/build.xml:472: The following
error occurred while executing this line:
/export/users/cc/cc-common/build/checkouts/hdk/working_vm/build/make/targets/reg.test.xml:128:
The following error occurred while executing this line:
/export/users/cc/cc-common/build/checkouts/hdk/working_vm/build/make/targets/reg.test.xml:169:
gcc failed with return code 1
Total time: 20 seconds
Warning: skipping zip archive /export/users/cc/cc-common/build/results/drlvm-reg-test_20070829_0224.zip
because no files were included.
The execution FAILED with the following exception:
The following error occurred while executing this line:
/export/users/cc/cc-common/adaptors/drlvm-reg-test/adaptor.xml:73: There were drlvm-reg-test
failures

***********************************************************
Unit Tests: (0)
        
No Tests Run: This project doesn't have any tests

***********************************************************
Modifications since last successful build:	(10)
            
add cc-hdk log20070829011655Lbuild.161 08/29/2007 01:16:55hdk
add cc-hdk log20070829011655Lbuild.161 08/29/2007 01:16:55hdk
added xli  /harmony/enhanced/drlvm/trunk/src/test/regression/H4511 08/28/2007 20:10:44 Harmony-4511:
test case for tagged object reclamation
added xli  /harmony/enhanced/drlvm/trunk/src/test/regression/H4511/run.test.xml 08/28/2007
20:10:44 Harmony-4511: test case for tagged object reclamation
added xli  /harmony/enhanced/drlvm/trunk/src/test/regression/H4511/GCTagged.java 08/28/2007
20:10:44 Harmony-4511: test case for tagged object reclamation
added xli  /harmony/enhanced/drlvm/trunk/src/test/regression/H4511/GCTagged.cpp 08/28/2007
20:10:44 Harmony-4511: test case for tagged object reclamation
added xli  /harmony/enhanced/drlvm/trunk/src/test/regression/H4511 08/28/2007 20:10:44 Harmony-4511:
test case for tagged object reclamation
added xli  /harmony/enhanced/drlvm/trunk/src/test/regression/H4511/run.test.xml 08/28/2007
20:10:44 Harmony-4511: test case for tagged object reclamation
added xli  /harmony/enhanced/drlvm/trunk/src/test/regression/H4511/GCTagged.java 08/28/2007
20:10:44 Harmony-4511: test case for tagged object reclamation
added xli  /harmony/enhanced/drlvm/trunk/src/test/regression/H4511/GCTagged.cpp 08/28/2007
20:10:44 Harmony-4511: test case for tagged object reclamation

begin 644 execution_log.zip
M4$L#! H    ( !83'3<(]&J%-P0  /L?   2    97AE8W5T:6]N7VQO9RYH
M=&UL[5E1;]LV$'[/KS@4&[H]6))E.[8U-T#;;&N&;!B:#!L0! 9-G67&$BF0
ME.VTZ'_?D;87N%FD--NP/$@P8$LZ'N^^[SLRX4T6MLA/)C.5WIY,2HTG$P;&
MWN;XZN5<2=LQX@,F,(J^_N[ER9&N9'($ %<IYFCQ&D[=MY 9C'HP%SD:F&M5
M0(B;4FD;5@:U"3FG3X>KHE RG%4B3T.-ILJM"5.=KXJ.QJQCT5CGFIS?L!6[
MAC?.T/E,H&!+W X,-D5^8'5PDU),W ;*!$SS1< WFX#/L^3A 4(*&U12;)IL
MUD+6F!BT@<%"F" 5VC08XL:BEBROLROS*A,R8-)RXD"+6;,M+TO+S++.J\OD
M\/7V-_*%NH:W2LY%5FEFA9(/F_GKG3*>]9_H-;R";C (HFET#-]<5!)^%EPK
M<VLL%@;.) ^^K77&<V9,+F:@E;+DK%$[?(%\J2I2SR)=AFNEEQ3*=.^F/O"[
M2QF:ZUS(:O.X$4Y1-$*P7OS(*4A^-"#C_+'V\XSL4YQ56?T(LY*@<24,$44C
MOOI(#X+]@T]-LQ&6I9(HK?&SE;FZ?5@R5)F!J\P:53E_5*5_%;'IT"I2,HWW
M-715+*E 2&H:F<44Z"9Y*M^K8O<ZEYNI8V5*2$\]>J&OQ7 ?.SEUVD#S;.*1
M5&,K_!)(;VH(:!I*S_^&"O>3NZIW]GX%/P:C*LUQMY!;];]2LXOO%V5I [A0
M!=+R559V%QQ%!$J#6J'6(D5@3LD:N:?Q]:]G08/#][@#"M;"+J#S!T%@D[T/
M5U=S<D_["1.Y";X$[BVWST?[VWC"=Q%=X53-;NZO#W3'"9DN46Y9?D?_#/?Y
MI??QW(^ZL$S[O8 07-8O)%C,R%/!I)C?6U*> T1Q=]!M(:J':#0>MQ#50S2.
MCUN(:B'J1?&PA:@!HF&_A:@>HFZOW=$:(.IUVT)K@JC?;OH-$/6C=BUJ@&@0
M#5J(ZB$Z'H]:B.HA&K8[6B-$HW8M:H!H-&XA:H!H'+7_QC9!-(I;B&HAZ@^Z
M_\F?CD]/P6@>NAA=L!J-ZP?LPOSQ[27+,IJ5EV72C1) K17!):3%#/6#L8!K
M&$ACF;0@7 H*<J8S].>C+W(ELQ=@;\N:P^PWOYV=G\(/K\_.OS\]>/%/F3KL
M"B;]89S Y<)%EN=J[23F<P3%>:4UZ6.]< >^N$%>>07:!65$,OSLM/9?B<LZ
MD.R=:GR(W7CT[$,\'B>N9P5SYD2Z/1[7:"LM20@I0O=AIB^]UJTH,($X H.D
MG/3P:-\W#-_[YF^R=P57'T1Y#;\S+2G(!,Q2E*5+GA[[MAL5VU,[RM,XBH;1
M*!Y/HSCN!\[C##ES[0.I=F6Y1NV:"SRO4E>51XZ@'0-*[H2[Q<$>4K?A6&Z;
MI4_EM"8KEK+2*OUY0OOGGJQAS\N)PO<Y'%IZ!BN"Y6@2LI-)Z'O[X;;/'_JF
M_Y]02P$"% ,*    "  6$QTW"/1JA3<$  #['P  $@              I($ 
K    97AE8W5T:6]N7VQO9RYH=&UL4$L%!@     !  $ 0    &<$      $! 
end

Mime
View raw message