harmony-alerts mailing list archives

Site index · List index
Message view « Date » · « Thread »
Top « Date » · « Thread »
From nom...@intel.com
Subject [build-test alert] FAILED Linux x86: stress
Date Tue, 28 Aug 2007 18:46:36 GMT
svn.revision=569620
BUILD FAILED:
	Ant Error Message:
/export/users2/cc/cc-suites/scripts/cc-exec-adaptor.xml:101: The following error occurred
while executing this line: /export/users2/cc/cc-suites/adaptors/stress/adaptor.xml:100: The
following error occurred while executing this line: /export/users2/cc/cc-suites/adaptors/stress/adaptor.xml:116:
The following error occurred while executing this line: /export/users2/cc/cc-suites/scripts/framework.xml:1069:
Java returned: 1

Date of build:	08/29/2007 00:12:43
Time to build:	93 minutes 46 seconds
Last changed:	08/28/2007 12:07:47
Last log entry:	snapshot

***********************************************************
Errors/Warnings:	(4)
            
BUILD FAILED
/export/users2/cc/cc-suites/tests/stress/qa/build.xml:169: Java returned: 255
Total time: 93 minutes 43 seconds
The execution FAILED with the following exception:
The following error occurred while executing this line:
/export/users2/cc/cc-suites/adaptors/stress/adaptor.xml:100: The following error occurred
while executing this line:
/export/users2/cc/cc-suites/adaptors/stress/adaptor.xml:116: The following error occurred
while executing this line:
/export/users2/cc/cc-suites/scripts/framework.xml:1069: Java returned: 1

***********************************************************
Unit Tests: (193)
        
error: test stress.org.apache.harmony.test.stress.classloader.MixThreads.ConstantPool.testCPLmt1
error: test stress.org.apache.harmony.test.stress.classloader.MixThreads.ConstantPool.testCPLmt2
error: test stress.org.apache.harmony.test.stress.classloader.MixThreads.FieldsLmt.testFieldsLmt1
error: test stress.org.apache.harmony.test.stress.classloader.MixThreads.FieldsLmt.testFieldsLmt2
error: test stress.org.apache.harmony.test.stress.classloader.MixThreads.LargeClassName.testLargeClassName_W1
error: test stress.org.apache.harmony.test.stress.classloader.MixThreads.WrongClasses.testNECLoad1
error: test stress.org.apache.harmony.test.stress.classloader.MixThreads.WrongClasses.testNECLoad2
error: test stress.org.apache.harmony.test.stress.classloader.MixThreads.WrongClasses.testWCLoad1
error: test stress.org.apache.harmony.test.stress.classloader.MixThreads.WrongClasses.testWCLoad2
error: test stress.org.apache.harmony.test.stress.classloader.NotSynchThreads.ConstantPool.testCPLmt
error: test stress.org.apache.harmony.test.stress.classloader.NotSynchThreads.SupIntf.testManySupIntf1
error: test stress.org.apache.harmony.test.stress.classloader.NotSynchThreads.SupIntf.testManySupIntf2
error: test stress.org.apache.harmony.test.stress.classloader.NotSynchThreads.WrongClasses.testWCLoad
error: test stress.org.apache.harmony.test.stress.classloader.OneThread.MethodNameLmt.testMethodNameLmt
error: test stress.org.apache.harmony.test.stress.classloader.OneThread.SupIntf.testManySupIntf1
error: test stress.org.apache.harmony.test.stress.classloader.OneThread.WrongClasses.testWCLoad
error: test stress.org.apache.harmony.test.stress.classloader.SynchThreads.ConstantPool.testCPLmt1
error: test stress.org.apache.harmony.test.stress.classloader.SynchThreads.ConstantPool.testCPLmt2
error: test stress.org.apache.harmony.test.stress.classloader.SynchThreads.FieldsLmt.testFieldsLmt1
error: test stress.org.apache.harmony.test.stress.classloader.SynchThreads.FieldsLmt.testFieldsLmt2
error: test stress.org.apache.harmony.test.stress.classloader.SynchThreads.LargeClassName.testLargeClassName_R1
error: test stress.org.apache.harmony.test.stress.classloader.SynchThreads.LargeClassName.testLargeClassName_W1
error: test stress.org.apache.harmony.test.stress.classloader.SynchThreads.MethodArgs.testMethodArgs1
error: test stress.org.apache.harmony.test.stress.classloader.SynchThreads.SupIntf.testManySupIntf1
error: test stress.org.apache.harmony.test.stress.classloader.SynchThreads.SupIntf.testManySupIntf2
error: test stress.org.apache.harmony.test.stress.classloader.SynchThreads.SupIntf.testManySupIntf3
error: test stress.org.apache.harmony.test.stress.classloader.SynchThreads.SupIntf.testManySupIntf4
error: test stress.org.apache.harmony.test.stress.classloader.SynchThreads.WrongClasses.testNECLoad1
error: test stress.org.apache.harmony.test.stress.classloader.SynchThreads.WrongClasses.testNECLoad2
error: test stress.org.apache.harmony.test.stress.classloader.SynchThreads.WrongClasses.testWCLoad1
error: test stress.org.apache.harmony.test.stress.classloader.SynchThreads.WrongClasses.testWCLoad2
error: test stress.org.apache.harmony.test.stress.gc.frag.FragmentationSimpleTest2.FragmentationSimpleTest2
error: test stress.org.apache.harmony.test.stress.jni.stack.StackTest12
error: test stress.org.apache.harmony.test.stress.jni.stack.StackTest4
error: test stress.org.apache.harmony.test.stress.jni.strings.StringsTest2
error: test stress.org.apache.harmony.test.stress.jni.strings.StringsTest3
Unit Test Error Details:	(36)
                
Test: testClass: stress.org.apache.harmony.test.stress.classloader.MixThreads.ConstantPool.testCPLmt1java
version "1.5.0" 
pre-alpha : not complete or compatible
svn = r569620, (Aug 25 2007), Linux/ia32/gcc 3.3.3, release build
http://harmony.apache.org

Apache Harmony Launcher : (c) Copyright 1991, 2006 The Apache Software Foundation or its licensors,
as applicable.
[debug] started null(org.apache.harmony.test.share.stress.ReliabilityRunner)
[debug] timeToWork = 30, timeToAbort = 30
[debug] started null(org.apache.harmony.test.share.stress.generator.Thread)
[debug] Thread.setContext  { org.apache.harmony.test.stress.classloader.MixThreads.ConstantPool.testCPLmt
{} }
[debug] Starting 1 threads
[debug] ThreadToRun.run()
[debug] completed null(org.apache.harmony.test.share.stress.generator.Thread)
[debug] Generator.execute()
[debug] class = org.apache.harmony.test.stress.classloader.MixThreads.ConstantPool.testCPLmt
[debug] org.apache.harmony.test.stress.classloader.MixThreads.ConstantPool.testCPLmt { }
[debug] started test(org.apache.harmony.test.stress.classloader.MixThreads....
Test: testClass: stress.org.apache.harmony.test.stress.classloader.MixThreads.ConstantPool.testCPLmt2java
version "1.5.0" 
pre-alpha : not complete or compatible
svn = r569620, (Aug 25 2007), Linux/ia32/gcc 3.3.3, release build
http://harmony.apache.org

Apache Harmony Launcher : (c) Copyright 1991, 2006 The Apache Software Foundation or its licensors,
as applicable.
[debug] started null(org.apache.harmony.test.share.stress.ReliabilityRunner)
[debug] timeToWork = 30, timeToAbort = 30
[debug] started null(org.apache.harmony.test.share.stress.generator.Thread)
[debug] Thread.setContext  { org.apache.harmony.test.stress.classloader.MixThreads.ConstantPool.testCPLmt
{} }
[debug] Starting 1 threads
[debug] ThreadToRun.run()
[debug] completed null(org.apache.harmony.test.share.stress.generator.Thread)
[debug] Generator.execute()
[debug] class = org.apache.harmony.test.stress.classloader.MixThreads.ConstantPool.testCPLmt
[debug] org.apache.harmony.test.stress.classloader.MixThreads.ConstantPool.testCPLmt { }
[debug] started test(org.apache.harmony.test.stress.classloader.MixThreads....
Test: testClass: stress.org.apache.harmony.test.stress.classloader.MixThreads.FieldsLmt.testFieldsLmt1java
version "1.5.0" 
pre-alpha : not complete or compatible
svn = r569620, (Aug 25 2007), Linux/ia32/gcc 3.3.3, release build
http://harmony.apache.org

Apache Harmony Launcher : (c) Copyright 1991, 2006 The Apache Software Foundation or its licensors,
as applicable.
[debug] started null(org.apache.harmony.test.share.stress.ReliabilityRunner)
[debug] timeToWork = 30, timeToAbort = 30
[debug] started null(org.apache.harmony.test.share.stress.generator.Thread)
[debug] Thread.setContext  { org.apache.harmony.test.stress.classloader.MixThreads.FieldsLmt.testFieldsLmt
{} }
[debug] Starting 1 threads
[debug] ThreadToRun.run()
[debug] completed null(org.apache.harmony.test.share.stress.generator.Thread)
[debug] Generator.execute()
[debug] class = org.apache.harmony.test.stress.classloader.MixThreads.FieldsLmt.testFieldsLmt
[debug] org.apache.harmony.test.stress.classloader.MixThreads.FieldsLmt.testFieldsLmt { }
[debug] started test(org.apache.harmony.test.stress.classloader.MixThrea...
Test: testClass: stress.org.apache.harmony.test.stress.classloader.MixThreads.FieldsLmt.testFieldsLmt2java
version "1.5.0" 
pre-alpha : not complete or compatible
svn = r569620, (Aug 25 2007), Linux/ia32/gcc 3.3.3, release build
http://harmony.apache.org

Apache Harmony Launcher : (c) Copyright 1991, 2006 The Apache Software Foundation or its licensors,
as applicable.
[debug] started null(org.apache.harmony.test.share.stress.ReliabilityRunner)
[debug] timeToWork = 30, timeToAbort = 30
[debug] started null(org.apache.harmony.test.share.stress.generator.Thread)
[debug] Thread.setContext  { org.apache.harmony.test.stress.classloader.MixThreads.FieldsLmt.testFieldsLmt
{} }
[debug] Starting 1 threads
[debug] ThreadToRun.run()
[debug] completed null(org.apache.harmony.test.share.stress.generator.Thread)
[debug] Generator.execute()
[debug] class = org.apache.harmony.test.stress.classloader.MixThreads.FieldsLmt.testFieldsLmt
[debug] org.apache.harmony.test.stress.classloader.MixThreads.FieldsLmt.testFieldsLmt { }
[debug] started test(org.apache.harmony.test.stress.classloader.MixThrea...
Test: testClass: stress.org.apache.harmony.test.stress.classloader.MixThreads.LargeClassName.testLargeClassName_W1java
version "1.5.0" 
pre-alpha : not complete or compatible
svn = r569620, (Aug 25 2007), Linux/ia32/gcc 3.3.3, release build
http://harmony.apache.org

Apache Harmony Launcher : (c) Copyright 1991, 2006 The Apache Software Foundation or its licensors,
as applicable.
[debug] started null(org.apache.harmony.test.share.stress.ReliabilityRunner)
[debug] timeToWork = 30, timeToAbort = 30
[debug] started null(org.apache.harmony.test.share.stress.generator.Thread)
[debug] Thread.setContext  { org.apache.harmony.test.stress.classloader.MixThreads.LargeClassName.testLCN
{} }
[debug] Starting 1 threads
[debug] ThreadToRun.run()
[debug] completed null(org.apache.harmony.test.share.stress.generator.Thread)
[debug] Generator.execute()
[debug] class = org.apache.harmony.test.stress.classloader.MixThreads.LargeClassName.testLCN
[debug] org.apache.harmony.test.stress.classloader.MixThreads.LargeClassName.testLCN { }
[debug] started test(org.apache.harmony.test.stress.classloader.MixThreads....
Test: testClass: stress.org.apache.harmony.test.stress.classloader.MixThreads.WrongClasses.testNECLoad1java
version "1.5.0" 
pre-alpha : not complete or compatible
svn = r569620, (Aug 25 2007), Linux/ia32/gcc 3.3.3, release build
http://harmony.apache.org

Apache Harmony Launcher : (c) Copyright 1991, 2006 The Apache Software Foundation or its licensors,
as applicable.
[debug] started null(org.apache.harmony.test.share.stress.ReliabilityRunner)
[debug] timeToWork = 30, timeToAbort = 30
[debug] started null(org.apache.harmony.test.share.stress.generator.Thread)
[debug] Thread.setContext  { org.apache.harmony.test.stress.classloader.MixThreads.WrongClasses.testNECLoad_MT
{} }
[debug] Starting 1 threads
[debug] ThreadToRun.run()
[debug] completed null(org.apache.harmony.test.share.stress.generator.Thread)
[debug] Generator.execute()
[debug] class = org.apache.harmony.test.stress.classloader.MixThreads.WrongClasses.testNECLoad_MT
[debug] org.apache.harmony.test.stress.classloader.MixThreads.WrongClasses.testNECLoad_MT
{ }
[debug] started test(org.apache.harmony.test.stress.classloa...
Test: testClass: stress.org.apache.harmony.test.stress.classloader.MixThreads.WrongClasses.testNECLoad2java
version "1.5.0" 
pre-alpha : not complete or compatible
svn = r569620, (Aug 25 2007), Linux/ia32/gcc 3.3.3, release build
http://harmony.apache.org

Apache Harmony Launcher : (c) Copyright 1991, 2006 The Apache Software Foundation or its licensors,
as applicable.
[debug] started null(org.apache.harmony.test.share.stress.ReliabilityRunner)
[debug] timeToWork = 30, timeToAbort = 30
[debug] started null(org.apache.harmony.test.share.stress.generator.Thread)
[debug] Thread.setContext  { org.apache.harmony.test.stress.classloader.MixThreads.WrongClasses.testNECLoad_MT
{} }
[debug] Starting 1 threads
[debug] ThreadToRun.run()
[debug] completed null(org.apache.harmony.test.share.stress.generator.Thread)
[debug] Generator.execute()
[debug] class = org.apache.harmony.test.stress.classloader.MixThreads.WrongClasses.testNECLoad_MT
[debug] org.apache.harmony.test.stress.classloader.MixThreads.WrongClasses.testNECLoad_MT
{ }
[debug] started test(org.apache.harmony.test.stress.classloa...
Test: testClass: stress.org.apache.harmony.test.stress.classloader.MixThreads.WrongClasses.testWCLoad1java
version "1.5.0" 
pre-alpha : not complete or compatible
svn = r569620, (Aug 25 2007), Linux/ia32/gcc 3.3.3, release build
http://harmony.apache.org

Apache Harmony Launcher : (c) Copyright 1991, 2006 The Apache Software Foundation or its licensors,
as applicable.
[debug] started null(org.apache.harmony.test.share.stress.ReliabilityRunner)
[debug] timeToWork = 30, timeToAbort = 30
[debug] started null(org.apache.harmony.test.share.stress.generator.Thread)
[debug] Thread.setContext  { org.apache.harmony.test.stress.classloader.MixThreads.WrongClasses.testWCLoad_MT
{} }
[debug] Starting 1 threads
[debug] ThreadToRun.run()
[debug] completed null(org.apache.harmony.test.share.stress.generator.Thread)
[debug] Generator.execute()
[debug] class = org.apache.harmony.test.stress.classloader.MixThreads.WrongClasses.testWCLoad_MT
[debug] org.apache.harmony.test.stress.classloader.MixThreads.WrongClasses.testWCLoad_MT {
}
[debug] started test(org.apache.harmony.test.stress.classloader...
Test: testClass: stress.org.apache.harmony.test.stress.classloader.MixThreads.WrongClasses.testWCLoad2java
version "1.5.0" 
pre-alpha : not complete or compatible
svn = r569620, (Aug 25 2007), Linux/ia32/gcc 3.3.3, release build
http://harmony.apache.org

Apache Harmony Launcher : (c) Copyright 1991, 2006 The Apache Software Foundation or its licensors,
as applicable.
[debug] started null(org.apache.harmony.test.share.stress.ReliabilityRunner)
[debug] timeToWork = 30, timeToAbort = 30
[debug] started null(org.apache.harmony.test.share.stress.generator.Thread)
[debug] Thread.setContext  { org.apache.harmony.test.stress.classloader.MixThreads.WrongClasses.testWCLoad_MT
{} }
[debug] Starting 1 threads
[debug] ThreadToRun.run()
[debug] completed null(org.apache.harmony.test.share.stress.generator.Thread)
[debug] Generator.execute()
[debug] class = org.apache.harmony.test.stress.classloader.MixThreads.WrongClasses.testWCLoad_MT
[debug] org.apache.harmony.test.stress.classloader.MixThreads.WrongClasses.testWCLoad_MT {
}
[debug] started test(org.apache.harmony.test.stress.classloader...
Test: testClass: stress.org.apache.harmony.test.stress.classloader.NotSynchThreads.ConstantPool.testCPLmtjava
version "1.5.0" 
pre-alpha : not complete or compatible
svn = r569620, (Aug 25 2007), Linux/ia32/gcc 3.3.3, release build
http://harmony.apache.org

Apache Harmony Launcher : (c) Copyright 1991, 2006 The Apache Software Foundation or its licensors,
as applicable.
[debug] started null(org.apache.harmony.test.share.stress.ReliabilityRunner)
[debug] timeToWork = 30, timeToAbort = 30
[debug] started null(org.apache.harmony.test.share.stress.generator.Thread)
[debug] Thread.setContext  { org.apache.harmony.test.stress.classloader.NotSynchThreads.ConstantPool.testCPLmt
{} }
[debug] Starting 1 threads
[debug] ThreadToRun.run()
[debug] completed null(org.apache.harmony.test.share.stress.generator.Thread)
[debug] Generator.execute()
[debug] class = org.apache.harmony.test.stress.classloader.NotSynchThreads.ConstantPool.testCPLmt
[debug] org.apache.harmony.test.stress.classloader.NotSynchThreads.ConstantPool.testCPLmt
{ }
[debug] started test(org.apache.harmony.test.stress.classloa...
Test: testClass: stress.org.apache.harmony.test.stress.classloader.NotSynchThreads.SupIntf.testManySupIntf1java
version "1.5.0" 
pre-alpha : not complete or compatible
svn = r569620, (Aug 25 2007), Linux/ia32/gcc 3.3.3, release build
http://harmony.apache.org

Apache Harmony Launcher : (c) Copyright 1991, 2006 The Apache Software Foundation or its licensors,
as applicable.
[debug] started null(org.apache.harmony.test.share.stress.ReliabilityRunner)
[debug] timeToWork = 30, timeToAbort = 30
[debug] started null(org.apache.harmony.test.share.stress.generator.Thread)
[debug] Thread.setContext  { org.apache.harmony.test.stress.classloader.NotSynchThreads.SupIntf.testManySupIntf1
{} }
[debug] Starting 1 threads
[debug] ThreadToRun.run()
[debug] completed null(org.apache.harmony.test.share.stress.generator.Thread)
[debug] Generator.execute()
[debug] class = org.apache.harmony.test.stress.classloader.NotSynchThreads.SupIntf.testManySupIntf1
[debug] org.apache.harmony.test.stress.classloader.NotSynchThreads.SupIntf.testManySupIntf1
{ }
[debug] started test(org.apache.harmony.test.stress.cl...
Test: testClass: stress.org.apache.harmony.test.stress.classloader.NotSynchThreads.SupIntf.testManySupIntf2java
version "1.5.0" 
pre-alpha : not complete or compatible
svn = r569620, (Aug 25 2007), Linux/ia32/gcc 3.3.3, release build
http://harmony.apache.org

Apache Harmony Launcher : (c) Copyright 1991, 2006 The Apache Software Foundation or its licensors,
as applicable.
[debug] started null(org.apache.harmony.test.share.stress.ReliabilityRunner)
[debug] timeToWork = 30, timeToAbort = 30
[debug] started null(org.apache.harmony.test.share.stress.generator.Thread)
[debug] Thread.setContext  { org.apache.harmony.test.stress.classloader.NotSynchThreads.SupIntf.testManySupIntf2
{} }
[debug] Starting 1 threads
[debug] ThreadToRun.run()
[debug] completed null(org.apache.harmony.test.share.stress.generator.Thread)
[debug] Generator.execute()
[debug] class = org.apache.harmony.test.stress.classloader.NotSynchThreads.SupIntf.testManySupIntf2
[debug] org.apache.harmony.test.stress.classloader.NotSynchThreads.SupIntf.testManySupIntf2
{ }
[debug] started test(org.apache.harmony.test.stress.cl...
Test: testClass: stress.org.apache.harmony.test.stress.classloader.NotSynchThreads.WrongClasses.testWCLoadjava
version "1.5.0" 
pre-alpha : not complete or compatible
svn = r569620, (Aug 25 2007), Linux/ia32/gcc 3.3.3, release build
http://harmony.apache.org

Apache Harmony Launcher : (c) Copyright 1991, 2006 The Apache Software Foundation or its licensors,
as applicable.
[debug] started null(org.apache.harmony.test.share.stress.ReliabilityRunner)
[debug] timeToWork = 30, timeToAbort = 30
[debug] started null(org.apache.harmony.test.share.stress.generator.Thread)
[debug] Thread.setContext  { org.apache.harmony.test.stress.classloader.NotSynchThreads.WrongClasses.testWCLoad_NST
{} }
[debug] Starting 1 threads
[debug] ThreadToRun.run()
[debug] completed null(org.apache.harmony.test.share.stress.generator.Thread)
[debug] Generator.execute()
[debug] class = org.apache.harmony.test.stress.classloader.NotSynchThreads.WrongClasses.testWCLoad_NST
[debug] org.apache.harmony.test.stress.classloader.NotSynchThreads.WrongClasses.testWCLoad_NST
{ }
[debug] started test(org.apache.harmony.test....
Test: testClass: stress.org.apache.harmony.test.stress.classloader.OneThread.MethodNameLmt.testMethodNameLmtjava
version "1.5.0" 
pre-alpha : not complete or compatible
svn = r569620, (Aug 25 2007), Linux/ia32/gcc 3.3.3, release build
http://harmony.apache.org

Apache Harmony Launcher : (c) Copyright 1991, 2006 The Apache Software Foundation or its licensors,
as applicable.
[debug] started null(org.apache.harmony.test.share.stress.ReliabilityRunner)
[debug] timeToWork = 30, timeToAbort = 30
[debug] started null(org.apache.harmony.test.share.stress.generator.Thread)
[debug] Thread.setContext  { org.apache.harmony.test.stress.classloader.OneThread.MethodNameLmt.testMethodNameLmt
{} }
[debug] Starting 1 threads
[debug] ThreadToRun.run()
[debug] completed null(org.apache.harmony.test.share.stress.generator.Thread)
[debug] Generator.execute()
[debug] class = org.apache.harmony.test.stress.classloader.OneThread.MethodNameLmt.testMethodNameLmt
[debug] org.apache.harmony.test.stress.classloader.OneThread.MethodNameLmt.testMethodNameLmt
{ }
[debug] started test(org.apache.harmony.test.stress...
Test: testClass: stress.org.apache.harmony.test.stress.classloader.OneThread.SupIntf.testManySupIntf1java
version "1.5.0" 
pre-alpha : not complete or compatible
svn = r569620, (Aug 25 2007), Linux/ia32/gcc 3.3.3, release build
http://harmony.apache.org

Apache Harmony Launcher : (c) Copyright 1991, 2006 The Apache Software Foundation or its licensors,
as applicable.
[debug] started null(org.apache.harmony.test.share.stress.ReliabilityRunner)
[debug] timeToWork = 30, timeToAbort = 30
[debug] started null(org.apache.harmony.test.share.stress.generator.Thread)
[debug] Thread.setContext  { org.apache.harmony.test.stress.classloader.OneThread.SupIntf.testManySupIntf1
{} }
[debug] Starting 1 threads
[debug] ThreadToRun.run()
[debug] completed null(org.apache.harmony.test.share.stress.generator.Thread)
[debug] Generator.execute()
[debug] class = org.apache.harmony.test.stress.classloader.OneThread.SupIntf.testManySupIntf1
[debug] org.apache.harmony.test.stress.classloader.OneThread.SupIntf.testManySupIntf1 { }
[debug] started test(org.apache.harmony.test.stress.classloader.OneThrea...
Test: testClass: stress.org.apache.harmony.test.stress.classloader.OneThread.WrongClasses.testWCLoadjava
version "1.5.0" 
pre-alpha : not complete or compatible
svn = r569620, (Aug 25 2007), Linux/ia32/gcc 3.3.3, release build
http://harmony.apache.org

Apache Harmony Launcher : (c) Copyright 1991, 2006 The Apache Software Foundation or its licensors,
as applicable.
[debug] started null(org.apache.harmony.test.share.stress.ReliabilityRunner)
[debug] timeToWork = 30, timeToAbort = 30
[debug] started null(org.apache.harmony.test.share.stress.generator.Thread)
[debug] Thread.setContext  { org.apache.harmony.test.stress.classloader.OneThread.WrongClasses.testWCLoad
{} }
[debug] Starting 1 threads
[debug] ThreadToRun.run()
[debug] completed null(org.apache.harmony.test.share.stress.generator.Thread)
[debug] Generator.execute()
[debug] class = org.apache.harmony.test.stress.classloader.OneThread.WrongClasses.testWCLoad
[debug] org.apache.harmony.test.stress.classloader.OneThread.WrongClasses.testWCLoad { }
[debug] started test(org.apache.harmony.test.stress.classloader.OneThread.W...
Test: testClass: stress.org.apache.harmony.test.stress.classloader.SynchThreads.ConstantPool.testCPLmt1java
version "1.5.0" 
pre-alpha : not complete or compatible
svn = r569620, (Aug 25 2007), Linux/ia32/gcc 3.3.3, release build
http://harmony.apache.org

Apache Harmony Launcher : (c) Copyright 1991, 2006 The Apache Software Foundation or its licensors,
as applicable.
[debug] started null(org.apache.harmony.test.share.stress.ReliabilityRunner)
[debug] timeToWork = 30, timeToAbort = 30
[debug] started null(org.apache.harmony.test.share.stress.generator.Thread)
[debug] Thread.setContext  { org.apache.harmony.test.stress.classloader.SynchThreads.ConstantPool.testCPLmt
{} }
[debug] Starting 1 threads
[debug] ThreadToRun.run()
[debug] completed null(org.apache.harmony.test.share.stress.generator.Thread)
[debug] Generator.execute()
[debug] class = org.apache.harmony.test.stress.classloader.SynchThreads.ConstantPool.testCPLmt
[debug] org.apache.harmony.test.stress.classloader.SynchThreads.ConstantPool.testCPLmt { }
[debug] started test(org.apache.harmony.test.stress.classloader.Synch...
Test: testClass: stress.org.apache.harmony.test.stress.classloader.SynchThreads.ConstantPool.testCPLmt2java
version "1.5.0" 
pre-alpha : not complete or compatible
svn = r569620, (Aug 25 2007), Linux/ia32/gcc 3.3.3, release build
http://harmony.apache.org

Apache Harmony Launcher : (c) Copyright 1991, 2006 The Apache Software Foundation or its licensors,
as applicable.
[debug] started null(org.apache.harmony.test.share.stress.ReliabilityRunner)
[debug] timeToWork = 30, timeToAbort = 30
[debug] started null(org.apache.harmony.test.share.stress.generator.Thread)
[debug] Thread.setContext  { org.apache.harmony.test.stress.classloader.SynchThreads.ConstantPool.testCPLmt
{} }
[debug] Starting 1 threads
[debug] ThreadToRun.run()
[debug] completed null(org.apache.harmony.test.share.stress.generator.Thread)
[debug] Generator.execute()
[debug] class = org.apache.harmony.test.stress.classloader.SynchThreads.ConstantPool.testCPLmt
[debug] org.apache.harmony.test.stress.classloader.SynchThreads.ConstantPool.testCPLmt { }
[debug] started test(org.apache.harmony.test.stress.classloader.Synch...
Test: testClass: stress.org.apache.harmony.test.stress.classloader.SynchThreads.FieldsLmt.testFieldsLmt1java
version "1.5.0" 
pre-alpha : not complete or compatible
svn = r569620, (Aug 25 2007), Linux/ia32/gcc 3.3.3, release build
http://harmony.apache.org

Apache Harmony Launcher : (c) Copyright 1991, 2006 The Apache Software Foundation or its licensors,
as applicable.
[debug] started null(org.apache.harmony.test.share.stress.ReliabilityRunner)
[debug] timeToWork = 30, timeToAbort = 30
[debug] started null(org.apache.harmony.test.share.stress.generator.Thread)
[debug] Thread.setContext  { org.apache.harmony.test.stress.classloader.SynchThreads.FieldsLmt.testFieldsLmt
{} }
[debug] Starting 1 threads
[debug] ThreadToRun.run()
[debug] completed null(org.apache.harmony.test.share.stress.generator.Thread)
[debug] Generator.execute()
[debug] class = org.apache.harmony.test.stress.classloader.SynchThreads.FieldsLmt.testFieldsLmt
[debug] org.apache.harmony.test.stress.classloader.SynchThreads.FieldsLmt.testFieldsLmt {
}
[debug] started test(org.apache.harmony.test.stress.classloader.Sy...
Test: testClass: stress.org.apache.harmony.test.stress.classloader.SynchThreads.FieldsLmt.testFieldsLmt2java
version "1.5.0" 
pre-alpha : not complete or compatible
svn = r569620, (Aug 25 2007), Linux/ia32/gcc 3.3.3, release build
http://harmony.apache.org

Apache Harmony Launcher : (c) Copyright 1991, 2006 The Apache Software Foundation or its licensors,
as applicable.
[debug] started null(org.apache.harmony.test.share.stress.ReliabilityRunner)
[debug] timeToWork = 30, timeToAbort = 30
[debug] started null(org.apache.harmony.test.share.stress.generator.Thread)
[debug] Thread.setContext  { org.apache.harmony.test.stress.classloader.SynchThreads.FieldsLmt.testFieldsLmt
{} }
[debug] Starting 1 threads
[debug] ThreadToRun.run()
[debug] completed null(org.apache.harmony.test.share.stress.generator.Thread)
[debug] Generator.execute()
[debug] class = org.apache.harmony.test.stress.classloader.SynchThreads.FieldsLmt.testFieldsLmt
[debug] org.apache.harmony.test.stress.classloader.SynchThreads.FieldsLmt.testFieldsLmt {
}
[debug] started test(org.apache.harmony.test.stress.classloader.Sy...
Test: testClass: stress.org.apache.harmony.test.stress.classloader.SynchThreads.LargeClassName.testLargeClassName_R1java
version "1.5.0" 
pre-alpha : not complete or compatible
svn = r569620, (Aug 25 2007), Linux/ia32/gcc 3.3.3, release build
http://harmony.apache.org

Apache Harmony Launcher : (c) Copyright 1991, 2006 The Apache Software Foundation or its licensors,
as applicable.
[debug] started null(org.apache.harmony.test.share.stress.ReliabilityRunner)
[debug] timeToWork = 30, timeToAbort = 30
[debug] started null(org.apache.harmony.test.share.stress.generator.Thread)
[debug] Thread.setContext  { org.apache.harmony.test.stress.classloader.SynchThreads.LargeClassName.testLCN
{} }
[debug] Starting 1 threads
[debug] ThreadToRun.run()
[debug] completed null(org.apache.harmony.test.share.stress.generator.Thread)
[debug] Generator.execute()
[debug] class = org.apache.harmony.test.stress.classloader.SynchThreads.LargeClassName.testLCN
[debug] org.apache.harmony.test.stress.classloader.SynchThreads.LargeClassName.testLCN { }
[debug] started test(org.apache.harmony.test.stress.classloader.Synch...
Test: testClass: stress.org.apache.harmony.test.stress.classloader.SynchThreads.LargeClassName.testLargeClassName_W1java
version "1.5.0" 
pre-alpha : not complete or compatible
svn = r569620, (Aug 25 2007), Linux/ia32/gcc 3.3.3, release build
http://harmony.apache.org

Apache Harmony Launcher : (c) Copyright 1991, 2006 The Apache Software Foundation or its licensors,
as applicable.
[debug] started null(org.apache.harmony.test.share.stress.ReliabilityRunner)
[debug] timeToWork = 30, timeToAbort = 30
[debug] started null(org.apache.harmony.test.share.stress.generator.Thread)
[debug] Thread.setContext  { org.apache.harmony.test.stress.classloader.SynchThreads.LargeClassName.testLCN
{} }
[debug] Starting 1 threads
[debug] ThreadToRun.run()
[debug] completed null(org.apache.harmony.test.share.stress.generator.Thread)
[debug] Generator.execute()
[debug] class = org.apache.harmony.test.stress.classloader.SynchThreads.LargeClassName.testLCN
[debug] org.apache.harmony.test.stress.classloader.SynchThreads.LargeClassName.testLCN { }
[debug] started test(org.apache.harmony.test.stress.classloader.Synch...
Test: testClass: stress.org.apache.harmony.test.stress.classloader.SynchThreads.MethodArgs.testMethodArgs1java
version "1.5.0" 
pre-alpha : not complete or compatible
svn = r569620, (Aug 25 2007), Linux/ia32/gcc 3.3.3, release build
http://harmony.apache.org

Apache Harmony Launcher : (c) Copyright 1991, 2006 The Apache Software Foundation or its licensors,
as applicable.
[debug] started null(org.apache.harmony.test.share.stress.ReliabilityRunner)
[debug] timeToWork = 30, timeToAbort = 30
[debug] started null(org.apache.harmony.test.share.stress.generator.Thread)
[debug] Thread.setContext  { org.apache.harmony.test.stress.classloader.SynchThreads.MethodArgs.testMethodArgs
{} }
[debug] Starting 1 threads
[debug] ThreadToRun.run()
[debug] completed null(org.apache.harmony.test.share.stress.generator.Thread)
[debug] Generator.execute()
[debug] class = org.apache.harmony.test.stress.classloader.SynchThreads.MethodArgs.testMethodArgs
[debug] org.apache.harmony.test.stress.classloader.SynchThreads.MethodArgs.testMethodArgs
{ }
[debug] started test(org.apache.harmony.test.stress.classloa...
Test: testClass: stress.org.apache.harmony.test.stress.classloader.SynchThreads.SupIntf.testManySupIntf1java
version "1.5.0" 
pre-alpha : not complete or compatible
svn = r569620, (Aug 25 2007), Linux/ia32/gcc 3.3.3, release build
http://harmony.apache.org

Apache Harmony Launcher : (c) Copyright 1991, 2006 The Apache Software Foundation or its licensors,
as applicable.
[debug] started null(org.apache.harmony.test.share.stress.ReliabilityRunner)
[debug] timeToWork = 30, timeToAbort = 30
[debug] started null(org.apache.harmony.test.share.stress.generator.Thread)
[debug] Thread.setContext  { org.apache.harmony.test.stress.classloader.SynchThreads.SupIntf.testManySupIntf1
{} }
[debug] Starting 1 threads
[debug] ThreadToRun.run()
[debug] completed null(org.apache.harmony.test.share.stress.generator.Thread)
[debug] Generator.execute()
[debug] class = org.apache.harmony.test.stress.classloader.SynchThreads.SupIntf.testManySupIntf1
[debug] org.apache.harmony.test.stress.classloader.SynchThreads.SupIntf.testManySupIntf1 {
}
[debug] started test(org.apache.harmony.test.stress.classloader...
Test: testClass: stress.org.apache.harmony.test.stress.classloader.SynchThreads.SupIntf.testManySupIntf2java
version "1.5.0" 
pre-alpha : not complete or compatible
svn = r569620, (Aug 25 2007), Linux/ia32/gcc 3.3.3, release build
http://harmony.apache.org

Apache Harmony Launcher : (c) Copyright 1991, 2006 The Apache Software Foundation or its licensors,
as applicable.
[debug] started null(org.apache.harmony.test.share.stress.ReliabilityRunner)
[debug] timeToWork = 30, timeToAbort = 30
[debug] started null(org.apache.harmony.test.share.stress.generator.Thread)
[debug] Thread.setContext  { org.apache.harmony.test.stress.classloader.SynchThreads.SupIntf.testManySupIntf1
{} }
[debug] Starting 1 threads
[debug] ThreadToRun.run()
[debug] completed null(org.apache.harmony.test.share.stress.generator.Thread)
[debug] Generator.execute()
[debug] class = org.apache.harmony.test.stress.classloader.SynchThreads.SupIntf.testManySupIntf1
[debug] org.apache.harmony.test.stress.classloader.SynchThreads.SupIntf.testManySupIntf1 {
}
[debug] started test(org.apache.harmony.test.stress.classloader...
Test: testClass: stress.org.apache.harmony.test.stress.classloader.SynchThreads.SupIntf.testManySupIntf3java
version "1.5.0" 
pre-alpha : not complete or compatible
svn = r569620, (Aug 25 2007), Linux/ia32/gcc 3.3.3, release build
http://harmony.apache.org

Apache Harmony Launcher : (c) Copyright 1991, 2006 The Apache Software Foundation or its licensors,
as applicable.
[debug] started null(org.apache.harmony.test.share.stress.ReliabilityRunner)
[debug] timeToWork = 30, timeToAbort = 30
[debug] started null(org.apache.harmony.test.share.stress.generator.Thread)
[debug] Thread.setContext  { org.apache.harmony.test.stress.classloader.SynchThreads.SupIntf.testManySupIntf2
{} }
[debug] Starting 1 threads
[debug] ThreadToRun.run()
[debug] completed null(org.apache.harmony.test.share.stress.generator.Thread)
[debug] Generator.execute()
[debug] class = org.apache.harmony.test.stress.classloader.SynchThreads.SupIntf.testManySupIntf2
[debug] org.apache.harmony.test.stress.classloader.SynchThreads.SupIntf.testManySupIntf2 {
}
[debug] started test(org.apache.harmony.test.stress.classloader...
Test: testClass: stress.org.apache.harmony.test.stress.classloader.SynchThreads.SupIntf.testManySupIntf4java
version "1.5.0" 
pre-alpha : not complete or compatible
svn = r569620, (Aug 25 2007), Linux/ia32/gcc 3.3.3, release build
http://harmony.apache.org

Apache Harmony Launcher : (c) Copyright 1991, 2006 The Apache Software Foundation or its licensors,
as applicable.
[debug] started null(org.apache.harmony.test.share.stress.ReliabilityRunner)
[debug] timeToWork = 30, timeToAbort = 30
[debug] started null(org.apache.harmony.test.share.stress.generator.Thread)
[debug] Thread.setContext  { org.apache.harmony.test.stress.classloader.SynchThreads.SupIntf.testManySupIntf2
{} }
[debug] Starting 1 threads
[debug] ThreadToRun.run()
[debug] completed null(org.apache.harmony.test.share.stress.generator.Thread)
[debug] Generator.execute()
[debug] class = org.apache.harmony.test.stress.classloader.SynchThreads.SupIntf.testManySupIntf2
[debug] org.apache.harmony.test.stress.classloader.SynchThreads.SupIntf.testManySupIntf2 {
}
[debug] started test(org.apache.harmony.test.stress.classloader...
Test: testClass: stress.org.apache.harmony.test.stress.classloader.SynchThreads.WrongClasses.testNECLoad1java
version "1.5.0" 
pre-alpha : not complete or compatible
svn = r569620, (Aug 25 2007), Linux/ia32/gcc 3.3.3, release build
http://harmony.apache.org

Apache Harmony Launcher : (c) Copyright 1991, 2006 The Apache Software Foundation or its licensors,
as applicable.
[debug] started null(org.apache.harmony.test.share.stress.ReliabilityRunner)
[debug] timeToWork = 30, timeToAbort = 30
[debug] started null(org.apache.harmony.test.share.stress.generator.Thread)
[debug] Thread.setContext  { org.apache.harmony.test.stress.classloader.SynchThreads.WrongClasses.testNECLoad_ST
{} }
[debug] Starting 1 threads
[debug] completed null(org.apache.harmony.test.share.stress.generator.Thread)
[debug] ThreadToRun.run()
[debug] Generator.execute()
[debug] class = org.apache.harmony.test.stress.classloader.SynchThreads.WrongClasses.testNECLoad_ST
[debug] org.apache.harmony.test.stress.classloader.SynchThreads.WrongClasses.testNECLoad_ST
{ }
[debug] started test(org.apache.harmony.test.stress.cl...
Test: testClass: stress.org.apache.harmony.test.stress.classloader.SynchThreads.WrongClasses.testNECLoad2java
version "1.5.0" 
pre-alpha : not complete or compatible
svn = r569620, (Aug 25 2007), Linux/ia32/gcc 3.3.3, release build
http://harmony.apache.org

Apache Harmony Launcher : (c) Copyright 1991, 2006 The Apache Software Foundation or its licensors,
as applicable.
[debug] started null(org.apache.harmony.test.share.stress.ReliabilityRunner)
[debug] timeToWork = 30, timeToAbort = 30
[debug] started null(org.apache.harmony.test.share.stress.generator.Thread)
[debug] Thread.setContext  { org.apache.harmony.test.stress.classloader.SynchThreads.WrongClasses.testNECLoad_ST
{} }
[debug] Starting 1 threads
[debug] ThreadToRun.run()
[debug] completed null(org.apache.harmony.test.share.stress.generator.Thread)
[debug] Generator.execute()
[debug] class = org.apache.harmony.test.stress.classloader.SynchThreads.WrongClasses.testNECLoad_ST
[debug] org.apache.harmony.test.stress.classloader.SynchThreads.WrongClasses.testNECLoad_ST
{ }
[debug] started test(org.apache.harmony.test.stress.cl...
Test: testClass: stress.org.apache.harmony.test.stress.classloader.SynchThreads.WrongClasses.testWCLoad1java
version "1.5.0" 
pre-alpha : not complete or compatible
svn = r569620, (Aug 25 2007), Linux/ia32/gcc 3.3.3, release build
http://harmony.apache.org

Apache Harmony Launcher : (c) Copyright 1991, 2006 The Apache Software Foundation or its licensors,
as applicable.
[debug] started null(org.apache.harmony.test.share.stress.ReliabilityRunner)
[debug] timeToWork = 30, timeToAbort = 30
[debug] started null(org.apache.harmony.test.share.stress.generator.Thread)
[debug] Thread.setContext  { org.apache.harmony.test.stress.classloader.SynchThreads.WrongClasses.testWCLoad_ST
{} }
[debug] Starting 1 threads
[debug] completed null(org.apache.harmony.test.share.stress.generator.Thread)
[debug] ThreadToRun.run()
[debug] Generator.execute()
[debug] class = org.apache.harmony.test.stress.classloader.SynchThreads.WrongClasses.testWCLoad_ST
[debug] org.apache.harmony.test.stress.classloader.SynchThreads.WrongClasses.testWCLoad_ST
{ }
[debug] started test(org.apache.harmony.test.stress.class...
Test: testClass: stress.org.apache.harmony.test.stress.classloader.SynchThreads.WrongClasses.testWCLoad2java
version "1.5.0" 
pre-alpha : not complete or compatible
svn = r569620, (Aug 25 2007), Linux/ia32/gcc 3.3.3, release build
http://harmony.apache.org

Apache Harmony Launcher : (c) Copyright 1991, 2006 The Apache Software Foundation or its licensors,
as applicable.
[debug] started null(org.apache.harmony.test.share.stress.ReliabilityRunner)
[debug] timeToWork = 30, timeToAbort = 30
[debug] started null(org.apache.harmony.test.share.stress.generator.Thread)
[debug] Thread.setContext  { org.apache.harmony.test.stress.classloader.SynchThreads.WrongClasses.testWCLoad_ST
{} }
[debug] Starting 1 threads
[debug] ThreadToRun.run()
[debug] completed null(org.apache.harmony.test.share.stress.generator.Thread)
[debug] Generator.execute()
[debug] class = org.apache.harmony.test.stress.classloader.SynchThreads.WrongClasses.testWCLoad_ST
[debug] org.apache.harmony.test.stress.classloader.SynchThreads.WrongClasses.testWCLoad_ST
{ }
[debug] started test(org.apache.harmony.test.stress.class...
Test: testClass: stress.org.apache.harmony.test.stress.gc.frag.FragmentationSimpleTest2.FragmentationSimpleTest2java
version "1.5.0" 
pre-alpha : not complete or compatible
svn = r569620, (Aug 25 2007), Linux/ia32/gcc 3.3.3, release build
http://harmony.apache.org

Apache Harmony Launcher : (c) Copyright 1991, 2006 The Apache Software Foundation or its licensors,
as applicable.
[debug] started null(org.apache.harmony.test.share.stress.ReliabilityRunner)
[debug] timeToWork = 30, timeToAbort = 30
[debug] started null(org.apache.harmony.test.share.stress.generator.Thread)
[debug] Thread.setContext  { org.apache.harmony.test.stress.gc.frag.share.FragmentationSimpleTest
{} }
[debug] Starting 1 threads
[debug] ThreadToRun.run()
[debug] completed null(org.apache.harmony.test.share.stress.generator.Thread)
[debug] Generator.execute()
[debug] class = org.apache.harmony.test.stress.gc.frag.share.FragmentationSimpleTest
[debug] org.apache.harmony.test.stress.gc.frag.share.FragmentationSimpleTest { }
[debug] started test(org.apache.harmony.test.stress.gc.frag.share.FragmentationSimpleTest)
[debug] ...
Test: testClass: stress.org.apache.harmony.test.stress.jni.stack.StackTest12java version "1.5.0"

pre-alpha : not complete or compatible
svn = r569620, (Aug 25 2007), Linux/ia32/gcc 3.3.3, release build
http://harmony.apache.org

Apache Harmony Launcher : (c) Copyright 1991, 2006 The Apache Software Foundation or its licensors,
as applicable.
[debug] started null(org.apache.harmony.test.share.stress.ReliabilityRunner)
[debug] timeToWork = 30, timeToAbort = 30
[debug] started null(org.apache.harmony.test.share.stress.generator.Thread)
[debug] Thread.setContext  { org.apache.harmony.test.stress.jni.stack.StackTest12 {} }
[debug] Starting 1 threads
[debug] ThreadToRun.run()
[debug] completed null(org.apache.harmony.test.share.stress.generator.Thread)
[debug] Generator.execute()
[debug] class = org.apache.harmony.test.stress.jni.stack.StackTest12
[debug] org.apache.harmony.test.stress.jni.stack.StackTest12 { }
[debug] started test(org.apache.harmony.test.stress.jni.stack.StackTest12)
[debug] Main thread: Padding memory...
[debug] Main thread: Memory fille...
Test: testClass: stress.org.apache.harmony.test.stress.jni.stack.StackTest4java version "1.5.0"

pre-alpha : not complete or compatible
svn = r569620, (Aug 25 2007), Linux/ia32/gcc 3.3.3, release build
http://harmony.apache.org

Apache Harmony Launcher : (c) Copyright 1991, 2006 The Apache Software Foundation or its licensors,
as applicable.
[debug] started null(org.apache.harmony.test.share.stress.ReliabilityRunner)
[debug] timeToWork = 30, timeToAbort = 30
[debug] started null(org.apache.harmony.test.share.stress.generator.Thread)
[debug] Thread.setContext  { org.apache.harmony.test.stress.jni.stack.StackTest4 {} }
[debug] Starting 1 threads
[debug] ThreadToRun.run()
[debug] completed null(org.apache.harmony.test.share.stress.generator.Thread)
[debug] Generator.execute()
[debug] class = org.apache.harmony.test.stress.jni.stack.StackTest4
[debug] org.apache.harmony.test.stress.jni.stack.StackTest4 { }
[debug] started test(org.apache.harmony.test.stress.jni.stack.StackTest4)
[debug] Main thread: Padding memory...
[debug] Main thread: Memory filled (8...
Test: testClass: stress.org.apache.harmony.test.stress.jni.strings.StringsTest2java version
"1.5.0" 
pre-alpha : not complete or compatible
svn = r569620, (Aug 25 2007), Linux/ia32/gcc 3.3.3, release build
http://harmony.apache.org

Apache Harmony Launcher : (c) Copyright 1991, 2006 The Apache Software Foundation or its licensors,
as applicable.
[debug] started null(org.apache.harmony.test.share.stress.ReliabilityRunner)
[debug] timeToWork = 30, timeToAbort = 30
[debug] started null(org.apache.harmony.test.share.stress.generator.Thread)
[debug] Thread.setContext  { org.apache.harmony.test.stress.jni.strings.StringsTest2 {} }
[debug] Starting 1 threads
[debug] ThreadToRun.run()
[debug] completed null(org.apache.harmony.test.share.stress.generator.Thread)
[debug] Generator.execute()
[debug] class = org.apache.harmony.test.stress.jni.strings.StringsTest2
[debug] org.apache.harmony.test.stress.jni.strings.StringsTest2 { }
[debug] started test(org.apache.harmony.test.stress.jni.strings.StringsTest2)
Native code: Performing calculations on 100 strings
i=0
[deb...
Test: testClass: stress.org.apache.harmony.test.stress.jni.strings.StringsTest3java version
"1.5.0" 
pre-alpha : not complete or compatible
svn = r569620, (Aug 25 2007), Linux/ia32/gcc 3.3.3, release build
http://harmony.apache.org

Apache Harmony Launcher : (c) Copyright 1991, 2006 The Apache Software Foundation or its licensors,
as applicable.
[debug] started null(org.apache.harmony.test.share.stress.ReliabilityRunner)
[debug] timeToWork = 30, timeToAbort = 30
[debug] started null(org.apache.harmony.test.share.stress.generator.Thread)
[debug] Thread.setContext  { org.apache.harmony.test.stress.jni.strings.StringsTest3 {} }
[debug] Starting 1 threads
[debug] ThreadToRun.run()
[debug] completed null(org.apache.harmony.test.share.stress.generator.Thread)
[debug] Generator.execute()
[debug] class = org.apache.harmony.test.stress.jni.strings.StringsTest3
[debug] org.apache.harmony.test.stress.jni.strings.StringsTest3 { }
[debug] started test(org.apache.harmony.test.stress.jni.strings.StringsTest3)
[debug] Main thread: Creating 100 threads
[debug] Main threa...

***********************************************************
Modifications since last successful build:	(1)
            
add cc-snapshot log20070828120747Lbuild.14 08/28/2007 12:07:47snapshot

begin 644 execution_log.zip
M4$L#! H    ( ,\-'3= 425X* L  *&*   2    97AE8W5T:6]N7VQO9RYH
M=&ULU9W]4]LX&L=_IG^%9N=NELZT<9R00'PL,Q3"E2YOD]#E;FXZC+"51,61
M7$F&9&_V?S])CDD<XKRT]/1 "[$E6_KHJT>/WI)X?Z"&\<'^'8_&!_N)( ?[
M&$DUCLEOO_8X4^\E_9,$:*_Z]W_\>O!&I"QX@Q#Z3T1BHL@7=&Q>*>LC?\]'
M/1H3B7J"#Y%'1@D7RDLE$;+FA:'^_UZF5!'IW:4TCCQ!9!HKZ4FECZ1)5"?[
M%3_@+^B#N< D%B![;64TC L7%$[" 0GO*R%G/=H/"C'9,0D'_ LZLO&IP(IR
M%J#\)V:C6XKKM=M^&);>^\=YQH'^]M^'X22GOP(4D;NT7WK3-9&*1.B3CD!:
M-D6'1-^O;&AE$O!7.:_Y62VB+3M/C8P,)W+ E3>([KVOYE<0[XXRSR2]*)<1
M";^@PP3K)-!'+(:<C=$93ID^%RA V^%;K5DR%K0_4,AOM?QWJ%:M-M&UOGYR
M6Y?WU",6!)WPE$566<0%HDJBF(:$22[D.X0EPDFB _!=3"JE*"8$/>B"FE1^
M\2N-2O475'JU-M3W.$X&6*,RKE#(AXFQ2)._.=8P.K?2V^4#0[\AT6BVFK7J
M.[1]F/91K6$*N/OV'3JC+!UYQBP\;1:H7M'_WB&A31U+DIE":<H#I9+ \P:9
MHA5LE:IP46XH6GRF6P *9RW4MB5M+X,LLA+V^C]@+,;J\I;F?<.>3LW\WA+V
M\*QMS:;;'H5Q&I$<YANND"RD$E.I7A@H3]ID5M[:=<NIV+L799X=&PLUEZ")
M>$]6126J5HP15QM^$VV?XS'RFYE9ORU/3:<TJ:+@'%.V9=O<(8L^)]KD2>97
MMM\&Z(I+:8P.419R(4BHT ..4ZV>MLF8LGND.,K:OS71^6+^O$P%Z1%!6$AR
M1[1^OOH&D\V1(#K;HHD&Z/+W]1.2"@O5';.C 6:,Q";1K@E"<JQ=CN!,=S/:
ME=M(I.O*F YJZ9^ULCBFXH2RB(BMGGXQB6L/,#!EEP2+<&!UE\8 -K%**4(;
MYFVLU[7-[E&KK@%B72LD,G*A;<45CK4[K:]G<,=4ZH(8EVQ2/N,AMLI5 [\6
M-.JHDS(4F\"*O<N4UWBA5.F>4^>Q5A9=Q07I$'DH/WW>PE&4XZ-'[;AUIFBB
MAW9A7N;-<N>6:3.)_LJHAX7 8^D=VA>3AH_0]M5AM]L^7J^X/Y.E!HBE 8BE
M"8BE!8C%K[J$Z:=#PI3AF1S9E)P!:>\=WGM=\]=QNYXCJ8,AV=$D[4[GLN,:
MQ*%SF2-QZ%KF2!PZEOFF4X-B)SZ<MN/ON$01E/6EAK&O)I5=4#1[H&B<NOYG
M-"X;TS.8.B08I[W ,QJ'/8&='^D9L/3L]*FCCQRV*C(*26)FS](+LXE=Y@4_
MLT<]<=5RG6,VOKS[JJ>,%E,NCW8TJ7GA4CCR_B]<"D>]QLI2G#))(W+*J%I4
MB&*LJTG/BQ;"D>M[T3(X<I@O6@:H#6(1.>0NH8S7T5#LNWFAMLLR7D?VBQ-J
M-^V\&+.^IT<N7O>VDZ_@F_1NJ_Z"(#BP9EMP ?"BX VA2Y?#Z_6@MO=L.=RN
MOP\QPWT2V7V0E 6HO@=0GUI)L.-*I3P/$@1'1$CO2%]OUT@[-F#^_$901437
MWF,SAL9_11,23=AGCL%S9W.I"?CL"0SR?NCU!.Y[)_J/6:ZV&X1V@K(@"!AB
M?4$0(,0N->]LZ& 6\:'M]5=$ T9OKH@&C-Y:$0T(_9]')Y3AF/Y)%ECW7"0@
M[*F8M=((D+CUT@A N)G!EOH/F)YC@3',1#A9;5U!N]##P?1MI5X-FC^;C(L7
MV>Y,C#/@1-]MQF1#',?9:N!''/>N;"@T,D!4US1?/ 4FUQ0, M20#+,*-&_#
MGAY=D+[;'F8YEZ,%_95<CE:@RKE &I?;H=82*'#F#MG6P9G5A,NM99V3(1?C
M;-BNC]U;U12HF0,Y&BNJ@5ELLDM-^K2;RH2PR*3C,7YY>=[6+]W+]O-H5TO/
M1=Y3IH@0::)FB1^I&DR9"Y>X6EM=@WI6YR(S"*5O,%477-'>N%SJXC4PM%[,
M/2OV'#4(M:^S,[]FH1>$O=06RDXSV/'7VT+9;;K3XQ.G=HG6"P>8LL76EU\#
MP^X6$\_:W1,O"(M[XHVSW8;E$H/HK$J0%VKL: XPU[O&A"3E[O,I&H8%/Z,M
MC 2>6!U9[Y#*T#O2@\Q#T7>X!68Q[)L(+A^(Z,7\T37+F(4=$J;VLX^.68H]
MJQN0,,92QCS;034?.IQTH]X9%GUR9&(O\)#8>XI!MQW?R6+SCQ [<AP_@'SS
MZD2^@2:R>4>JQ9M\F'7FW)%S_AY4:*H><2859NJ*\]C><71U-E3 K'4QI)M-
MLE+($TKB2&HN>_G3&3 I2RB!:=E-[^;;SS0(6A/JILDI4[T94GONYA,SFU*Z
M^63GII3 &E$));!&=",XZ\\VHXOVT9F^#IB899C0U;QY%6+>O"(M'6U6;(KI
M:%.L?+1)U(!'9H$@<TA/I\!L\UH0,JOFS#FT ?P25&BCCZRZS90M']050EX9
M+@!#N.#J>U907A_UIJ91LKOB![N!7UUO<\7W=UZ/0#>OLEHAK-O,4R]9#X$'
MNWBQP7E7.H\)=J:T)JC[(>D\:-E$!)Z)E@Q,X2LZG3,!4[1T# T/=<G8%![L
MBN&>>^!S.GI= [W-@ $,!C8"!K!/MADO+(%A[Y&M!PI+4:C[8RL1W8^O9A#!
M[HVM9@2EXY*M)CA-9LE.$WA(6%YRR=0)#B3<;:8U($&U;K!;3*L97X..L+PD
MW,VEV6':LJVE5X )RU/"W@!;#Q26HO WO]:'?:'O"_.#VEY0?_[XC,7[,8V:
M*V$N&<F$>27+&)OP0E@5F/(N?3,=+%"@6QI31*@K[RL) 70P4T; J^U32-#K
M[/-:+EMA=_"U[4F$O:_18^+)D# L*/>N/W;:A\=5O^IEW";5JK/'T#SG.V^?
M7W;^7:WZ,Q]:K[KZU-<2_?R"?G#X<OUJ!?U</9>J7+]:03\X?+E^]8)^KIYB
M4LZW4^!S]6B3<KY&@<_5@R+*^9H%/E>/CBCGVRWPN7I8S'.^]A_MBVOCGML/
MA"EHWGE"5YNE@^-;)G2M63I7#XU:8'FG_VH?VXZ7CD@$K68G=+59.C@U.^G5
MJH51 2#U<KY"KPM(O\L/G]I'UZ97R[X5#UJOENM7+^@'9U20Z]<HZ >GU\WU
MVRGH!Z=^<_V:!?W@C IR_1H%_>#4;Z[?;D$_.*.67+]F03\X]9OKMU?0S]5#
M^<KUVRWH!Z=^<_U:!?W@C*UR_?8*^FU:OZ4[#3N-8,UOU?);52!2M I2P*FJ
MD\[A>=N,Y$X$'A)H [D)76V6#LXP;D)7GZ7;=)!4\H1[:[V7OY<FH>RE]LGW
M6XVJ7WH=0HE9.HZV_,;NDHMZF,;ZHO+&@A 1@HNMK7KY]]0A).]IDNATZM7R
M!P(AE+)[QA_9DMR..2,5U"4$J8'5 @F2<*$0938DHD)[/2[&I2EL>61D[O!2
M282L>6&H_[^7*=7">7<IC2-/UVH:*SFIWZ65)1$9D3 UWX^.%!V28*OJF^<C
MU7<09A%JM?:&2Q(PE93=AEIU-*0LU1!HQT>2A)Q%Q3L+)Q\^GYX=HY/#T[/V
M<2%B6>FL:>16^PUGI:V,AG'@-UL!^J03T'*J5-M?%*!:HU&>?QEZ_0G]S;6N
MCJDX&2HRW[QF*ZK'XY@_4M9'3T\,"^PM,Q'&KA /PU0([;D?!]H2\Q1UM!I0
MB6+*2/!F6:%QA!-M$$_EGIQGQ:Y6==OZ?V?J-W].IC(4--$5W#,^YY&+^TD9
M%]2M_V;?PP?[7B*(_GO'H[%^&:AA?/ _4$L! A0#"@    @ SPT=-T!1)7@H
M"P  H8H  !(              *2!     &5X96-U=&EO;E]L;V<N:'1M;%!+
4!08      0 ! $    !8"P     ! 
end

Mime
View raw message