harmony-alerts mailing list archives

Site index · List index
Message view « Date » · « Thread »
Top « Date » · « Thread »
From nom...@intel.com
Subject [build-test alert] FAILED Linux x86: ega . (Eclipse x 48h)
Date Mon, 27 Aug 2007 07:59:15 GMT

BUILD FAILED:
	Ant Error Message:
/export/users/cc/cc-EGAx48/scripts/cc-exec-adaptor.xml:101: The following error occurred while
executing this line: /export/users/cc/cc-EGAx48/adaptors/ega/adaptor.xml:58: EGA scenario
failed.

Date of build:	08/27/2007 14:43:33
Time to build:	15 minutes 35 seconds
Last changed:	08/27/2007 14:43:03
Last log entry:	snapshot

***********************************************************
Errors/Warnings:	(185)
            
[exec] Result: 25
[echo]
[echo]
[echo] ========================== EGA.log =======================
[echo]
[echo] --- Automated EGA scenario for Eclipse 3.2.1 ---
[echo]
[echo]
[echo] Eclipse Home = /export/users/cc/cc-EGAx48/build/libs/eclipse-3.2.l-lnx-x86/eclipse
[echo] Tested JRE Home = /export/users/cc/cc-EGAx48/build/checkouts/snapshot/hdk/jdk
[echo] OS_ARCH = x86
[echo]
[echo] Tested JRE options for Eclipse launching = -showversion -Xmx600M -Xms512M
[echo] Tested JRE options for debug step =
[echo]
[echo] Time frame for the scenario run = 48 hours
[echo] Delay factor = 2
[echo] Kill Eclipse if EGA scenario fails = 1
[echo] Start:
[echo] 	Run Eclipse
[echo] 	Select workspace
[echo] 	wait window 'Workspace Launcher' to appear ...
[echo] 	window 'Workspace Launcher' (29360183) appeared
[echo] 	Select /export/users/cc/cc-EGAx48/tests/ega/workspace as workspace
[echo] 	Press 'OK' button
[echo] 	wait window (29360183) to close ...
[echo] 	window (29360183) successfully closed
[echo]
[echo] Prepare Eclipse environment:
[echo] 	Close Welcome page
[echo] 	wait window 'Java - Eclipse SDK' to appear ...
[echo] 	window 'Java - Eclipse SDK' (29360616) appeared
[echo] 	Uncheck Project->Build Automatically
[echo] 	Select Window->Preferences
[echo] 	wait window 'Preferences' to appear ...
[echo] 	window 'Preferences' (29362392) appeared
[echo] 	Select Java->Build Path->Classpath Variables
[echo] 	Create M2_REPO variable
[echo] 	wait window 'New Variable Entry' to appear ...
[echo] 	window 'New Variable Entry' (29363552) appeared
[echo] 	Set M2_REPO value to /export/users/cc/cc-EGAx48/tests/ega/project/.m2/repository
[echo] 	Press OK button
[echo] 	wait window (29363552) to close ...
[echo] 	window (29363552) successfully closed
[echo] 	Press OK button to apply new preferences
[echo] 	wait window (29362392) to close ...
[echo] 	window (29362392) successfully closed
[echo] 	wait window 'Java - Eclipse SDK' to appear ...
[echo] 	window 'Java - Eclipse SDK' (29360616) appeared
[echo]
[echo] Import geronimo modules into workspace:
[echo] 	Select File->Import...
[echo] 	wait window 'Import' to appear ...
[echo] 	window 'Import' (29364907) appeared
[echo] 	Select import existing project
[echo] 	Type path to search projects: /export/users/cc/cc-EGAx48/tests/ega/project/geronimo-1.2-beta/modules
[echo] 	Uncheck all builders
[echo] 	Import
[echo] 	wait window (29364907) to close ...
[echo] 	window (29364907) successfully closed
[echo]
[echo] Import testsupport module into workspace:
[echo] 	wait window 'Java - Eclipse SDK' to appear ...
[echo] 	window 'Java - Eclipse SDK' (29360616) appeared
[echo] 	Select File->Import...
[echo] 	wait window 'Import' to appear ...
[echo] 	window 'Import' (29378397) appeared
[echo] 	Select import existing project
[echo] 	Type path to search projects: /export/users/cc/cc-EGAx48/tests/ega/project/geronimo-1.2-beta/testsupport
[echo] 	Import
[echo] 	wait window (29378397) to close ...
[echo] 	window (29378397) successfully closed
[echo]
[echo] Start repetable part:
[echo]
[echo] -------------------- Iteration 1 start ------------------
[echo]
[echo] Clean all Geronimo modules:
[echo] 	wait window 'Java - Eclipse SDK' to appear ...
[echo] 	window 'Java - Eclipse SDK' (29360616) appeared
[echo] 	Select Project->Clean...
[echo] 	wait window 'Clean' to appear ...
[echo] 	window 'Clean' (29381691) appeared
[echo] 	Uncheck start build immediatelly
[echo] 	wait window (29381691) to close ...
[echo] 	window (29381691) successfully closed
[echo] 	window 'Cleaning selected projects' (29381997) appeared
[echo] 	wait window (29381997) to close ...
[echo] 	window (29381997) successfully closed
[echo]
[echo] Build all Geronimo modules:
[echo] 	wait window 'Java - Eclipse SDK' to appear ...
[echo] 	window 'Java - Eclipse SDK' (29360616) appeared
[echo] 	Select Project->Build All
[echo] 	wait window 'Building Workspace' to appear ...
[echo] 	window 'Building Workspace' (29383231) appeared
[echo] 	wait window (29383231) to close ...
[echo] 	window (29383231) successfully closed
[echo] 	wait window 'Java - Eclipse SDK' to appear ...
[echo] 	window 'Java - Eclipse SDK' (29360616) appeared
[echo]
[echo] Open Navigator view:
[echo]
[echo] Fix org.apache.geronimo.common.propertyeditor.PropertyEditorsTest:
[echo] 	Select 'Navigate->Open Resource'
[echo] 	wait window 'Open Resource' to appear ...
[echo] 	window 'Open Resource' (29384865) appeared
[echo] 	Type PropertyEditorsTest.java into 'Open Resource' dialog
[echo] 	wait window (29384865) to close ...
[echo] 	window (29384865) successfully closed
[echo] 	wait window 'Java - PropertyEditorsTest.java - Eclipse SDK' to appear ...
[echo] 	window 'Java - PropertyEditorsTest.java - Eclipse SDK' (29360616) appeared
[echo] 	Go to line 'protected void setUp() throws Exception {'
[echo] 	wait window 'Go to Line' to appear ...
[echo] 	window 'Go to Line' (29388910) appeared
[echo] 	wait window (29388910) to close ...
[echo] 	window (29388910) successfully closed
[echo] 	wait window 'Java - PropertyEditorsTest.java - Eclipse SDK' to appear ...
[echo] 	window 'Java - PropertyEditorsTest.java - Eclipse SDK' (29360616) appeared
[echo] 	Add line Class.forName("org.apache.geronimo.common.propertyeditor.PropertyEditors");
to setUp() method
[echo] 	Save PropertyEditorsTest.java
[echo] 	Close PropertyEditorsTest.java
[echo] 	wait window 'Java - Eclipse SDK' to appear ...
[echo] 	window 'Java - Eclipse SDK' (29360616) appeared
[echo]
[echo] Run JUnit tests from geronimo-common module:
[echo] 	Select geronimo-common module
[echo] 	Open Run->Run
[echo] 	wait window 'Run' to appear ...
[echo] 	window 'Run' (29393693) appeared
[echo] 	Create new JUnit run configuration
[echo] 	Run
[echo] 	wait window (29393693) to close ...
[echo] 	window (29393693) successfully closed
[echo]
[echo] Modify GBeanData class from geronimo-kernel module:
[echo] 	wait window 'Java - Eclipse SDK' to appear ...
[echo] 	window 'Java - Eclipse SDK' (29360616) appeared
[echo] 	Select geronimo-kernel module
[echo] 	Select Navigate->Go Into
[echo] 	Open GBeanData.java
[echo] 	wait window 'Java - GBeanData.java - Eclipse SDK' to appear ...
[echo]
[echo] ERROR: Window 'Java - GBeanData.java - Eclipse SDK' didn't appear for 200 sec!
[echo]
[echo] Print error screen picture:
[echo] 	Picture was saved to /export/users/cc/cc-EGAx48/build/results/ega/20070827_0243/error.xwd
[echo] 	Please, use command 'xwud -in ./error.xwd' to view the error screen picture
[echo]
[echo] Kill Eclipse:
[echo] 	Found 1 Eclipse processes
[echo] 	Process 0:
[echo] 	Eclipse process was killed
[echo]
[echo]
[echo] EGA FAILED!
[echo]
[echo] ======================= eclipse.log =======================
[echo] Apache Harmony Launcher : (c) Copyright 1991, 2006 The Apache Software Foundation or
its licensors, as applicable.
[echo] java version "1.5.0"
[echo] pre-alpha : not complete or compatible
[echo] svn = r569620, (Aug 25 2007), Linux/ia32/gcc 3.3.3, release build
[echo] http://harmony.apache.org
[echo] Install location:
[echo]     file:/export/users/cc/cc-EGAx48/build/libs/eclipse-3.2.l-lnx-x86/eclipse/
[echo] Configuration file:
[echo]     file:/export/users/cc/cc-EGAx48/build/libs/eclipse-3.2.l-lnx-x86/eclipse/configuration/config.ini
loaded
[echo] Configuration location:
[echo]     file:/export/users/cc/cc-EGAx48/build/libs/eclipse-3.2.l-lnx-x86/eclipse/configuration/
[echo] Framework located:
[echo]     file:/export/users/cc/cc-EGAx48/build/libs/eclipse-3.2.l-lnx-x86/eclipse/plugins/org.eclipse.osgi_3.2.1.R32x_v20060919.jar
[echo] Framework classpath:
[echo]     file:/export/users/cc/cc-EGAx48/build/libs/eclipse-3.2.l-lnx-x86/eclipse/plugins/org.eclipse.osgi_3.2.1.R32x_v20060919.jar
[echo] Debug options:
[echo]     file:/export/users/cc/cc-EGAx48/tests/ega/.options not found
[echo] Time to load bundles: 412
[echo] Starting application: 8943
[echo] Application Started: 44911
[echo]
[echo] ===========================================================
BUILD FAILED
/export/users/cc/cc-EGAx48/tests/ega/build.xml:464: EGA FAILED!
Total time: 15 minutes 34 seconds
The execution FAILED with the following exception:
The following error occurred while executing this line:
/export/users/cc/cc-EGAx48/adaptors/ega/adaptor.xml:58: EGA scenario failed.

***********************************************************
Unit Tests: (0)
        
No Tests Run: This project doesn't have any tests

***********************************************************
Modifications since last successful build:	(11)
            
add cc-snapshot log20070827144303Lbuild.11 08/27/2007 14:43:03snapshot
add cc-snapshot log20070824101650Lbuild.10 08/24/2007 10:16:50snapshot
add cc-snapshot log20070823163047Lbuild.9 08/23/2007 16:30:47snapshot
add cc-snapshot log20070821203252Lbuild.8 08/21/2007 20:32:52snapshot
add cc-snapshot log20070816185144Lbuild.7 08/16/2007 18:51:44snapshot
add cc-snapshot log20070810185923Lbuild.6 08/10/2007 18:59:23snapshot
add cc-snapshot log20070806193341Lbuild.5 08/06/2007 19:33:41snapshot
add cc-snapshot log20070801153819Lbuild.4 08/01/2007 15:38:19snapshot
add cc-snapshot log20070730185843Lbuild.3 07/30/2007 18:58:43snapshot
add cc-snapshot log20070724161107Lbuild.2 07/24/2007 16:11:07snapshot
add cc-snapshot log20070720165026Lbuild.1 07/20/2007 16:50:26snapshot

begin 644 execution_log.zip
M4$L#! H    ( &5W&S>Z_)XV3 H  ,,Z   2    97AE8W5T:6]N7VQO9RYH
M=&ULY5OK;MNX$OZ]>0IN@8.T0"SY%M?VI@'2)FW36P*GW2Y0% $CT38;211$
MRI>>ES_#H>3(L25+7F^;[O$N"COB#&>&WUQ(CH[&RO>.CVZ$.S\^"B-V?$2)
M5'.//=L?BD#5)/_.^J1;_\\?^\=[41ST]XC^?/E&)_0K>1YSSQUR#X;<Z*_6
MS/>6!BS]6"$WWYDS%E])37_(( [(V:L3(AT6T(@+(@*BQHP,A>>)*0]&Q!'!
MD(_BB"H.SY JE^=')A5SR9O!&7E&;#8+1:3L6+)(VHX#_]=@JEF[:Z/LMC-F
MSJV(E;1E0$,Y%LH>N[?V-_<V=X(SQ^.A9.2U\%F9*3Q^(VUFB&HMJVEY-2^8
MU6;=3OK7?.MEY[U*S<,52RP1Q/X-BT"(^F8J6 BB.(K<[N8./V4>G9,A=930
M?)NY ]]RSUN8@@_O%F](N2>!M%%.J\QRB5 K)6'=HP5GC\:!,]88>$9JL#S3
M"5@90?"7/^O4Z^_U%WG8:+ZO/ ,@SF4W\0B@ST)@7XS2+3_Y1D#D6316@JO^
MIF'Z^\9!"9K*CK,24VX</_&MQ'!%0X4?0DRP%%C;<CPJY5JWGS'G*SD)*7 F
MKVGDBV!.WN$: X[[Y+'SA+P0X3SBH[$BC5ZO<4":]7J'?(3Q"=F5&*HIC1AY
M*>+ -8X Z\F5)!X'%$H1R0-"):%A"'^@-R!5KBCZ+R3%U*.&=6C5'ZU% HZ&
M6%FC7CBF(&H@%"KM,<7T_/H[" .SY9++20 XBPX[O4ZS?D >GP#XFH=:P:=/
M#L@['L0SF]-6TQXY#FE9\-\!B9C'*#@"QI)<SF.EPKYMCXU%+8J6LD0T*K&V
MZ 2[6V%TF1<@=*"]-O7CY0AN62LK\L5EVI(8@9C2I"Z/F Y#\UV$6'M) !LL
MLW #(4?\X4CCB(A9$*MUJ'XX4L4A.-I/EL>23.E)Y$8Q^O_ [.:7Q0.>[R'&
M2IFE1!*H8 J\:CT-R++B7%]&<?"=AU" S$(:N-K<&]6DD3->J'EU^A95;=0\
M'6IJ(W5K*1I9H^]$B6J\KI4?:MJ5 / %D$NCC(PEUF(=8\*#,C+E+^,N0%)*
MXS3D#9@O)MF0-Q71K81 S'88[G3L!85'U%YPSX_!$:/(.6(R]B [WLVP1B#R
MQ;^% 0D9U$OPHX2)$MXHDLYC]6[SZ76]V6[E%Z1@1+54[^<.O<34=T D8W]#
M$AN&69X88=7G,J7KT]Q$.D N?4C+^?7_8' QZ)///'#%E.R_T15$C;QZ#AGO
ME"J*M1K\(84!>-T^&-,-]I6N2!A@6PL"(H)>SN^$*F)IH:]3H*&+6J$'U4S 
MR--.U\J/'F$$?F+IDMORF91TQ/)S<NZ#_"?/<C\D-6K>\^IBZ*W@"93#/L)O
M:4.8W1&@>7!P]2E^UIXN.U5F.U)VMBTVJ1=7UR>#%Z^!^YI8N-D>/VU75FY'
MEL]5;W"'$=7_ C=]BB"S&V"]]R5C$4<RG\?]+7#^R/M[X&7,IOO@@AV]#H7]
M_.>_X<E(PC]_U!6D$$=E\DW^T"GE,#")7)\7!.D.;%\7 DF06I<C[O@4L'C<
M[+4Z]4:W]21AQ=;N6Y9DKY;R].:NC+:7D!,DV;^  'P3*P7X+&>9C 9@#\<3
M<FT.7S%'AD[&C@.3#V//FQL.[A9P!@5"O=--,<"""8]$X+.@$#8O4.+/S'-T
M@ DA*Y2%Q)LUN:LB)-:Q,(;I-#IE(/$IP'@'RHMO@(W:,1XXIJD!-O3:I!L1
M9=)S[1A,.&01"V URAHA0U)9^R5:5+O9ZC4K>((V7ZKR)57CVO$+O=4.X2OY
M$P*+/LXHTL24;^1]\WIP=GE!)@E)6=T_L.EB&G(6J&A>V03K6* E6H>')2VA
M,O)[,=NP/;F+$*&!C&WY3:@'0R$YEKN;(L3%VR0^5 @/1IGJX<'050H/]Z5,
M%@0H S!U6!G@&5A6E]_059/_H868W ?GOL88&3$(LMP7Q!=NK-T--Z.+C%,4
M>A,O?LD]5CLV[$"ELK8Q!)7MD9*A#=J]^M,*\88;E=F,2]PL)BY4(/''>:B3
M"L0C$%,RO4E.J63ACG'53U-#UQI6LW8#6S,[M?CF] !IP!R*LJ)B[K=D22MX
MAC%@=<\P=+M)_(G4:+$XQ._&,A6@^-"\[N?[QM-NJ_<+^T86#3L$?&*5RH!/
MZ'8#>',J!#D;%-5U0UB\,ZIT5T?.%Q>F#=A:ZHDV7-25F@KO.# ,O;J7+WY%
MKUQ4VZA6!;_$\97%3JBTI-U&I]>HLC$P2XBQ'US49RZ'BK=X4W ?\\F<E3&?
MT%4L?[(ZZS@BT>1 DX:&U!"]<N%I59O>5AZ<T.W&@\V6Y5_G#LGF$]0JJ002
MZ%5>G(U45F(="URO5K-5RE-6 &((JP/$T/U+J_V+D 7D YWP$=5'?1/.IMND
MG)=\1O1=:7+IGN9MRQ&^+P(+?#QDD9I#F()9K,ODYQG^E/H8M,1^8C\1$PHG
ME'K I(@CC8N2ZW"/JN(2W*-&:+2[G<,R6,22:(W6YIX$R]G[_"&@ZZN%"O@V
MPE3'MZ'[^_C.U6\GT"_+O5*@>R6T-'C'M \8528C301W(3^I3^%CL.<X$E-)
MSF8.PR-Z\M_2>#/<WP'WRDIG27&1NKU&?:NH9PBKH\+0_5^BXL1U#2;PU-$:
MBN@#]=GC1UL'N$=/_C![(0,IGZFQ*++C%9T4A(M-9]Y;$/XRZ4I?!KWY%/#D
M6( ,(^$OCJIJ9C&2DJM$1EE/6$!G8G0<U(ZU("7M"4,K&Q!IM,7 9KU2ETC)
MF;<^#34&TE=]RQUGQ7=LY6-*(E/EF)+0[:;4?B]</IS?M1P0[,:[!XA;%@7,
M*P&(A^8 *PA=TF0SLN]*)<@DYU!?;,#TO<Z-:H8J;OLH9[G<!SON--GF_A'J
M,\*B"-A()V)@K9 [*HX* 75IAI IE41".'=+M9?E]^_@_-9L6GA%DK0*Q=AK
MZOLT<,G^;!J[I,8#W6"3\L!%T:4^-@>L4VT+.V4; 8HL@QW+I+%8,4B=.AP4
MGG=?FC&D7L3X'D,T_2T(M55XR<?CJQ/R\N3\W=EI 9BJMQ.1M/EQJWZBA]%,
MCJ*@/Y9I)L?1VS>3(_D_TDR.G,LUDV<IS@.I],F/)QPT87X3FO[@NT.[Z-#-
M/YI=ROTXWX^1**]G&"Q#W8*<MRSP#S;CLM#YYQRZK4K?/!GYF/N#Q N]>,0#
MN=*SGS1*#EK-V?5$^W6]U^A!3LQOT;W3P$E[*GXY'4ZQ06[MVQI5I;^[<TK?
M_L X--21,)<Q=MCI@P, -,21P,4#WG8C_TTQO-K1IYE)"$5DDVZOH$?XY&ZD
M(0>PD7:[UVCD*UPUZY3Y+/%<^O'\T_F[TR09+CTH9>_%>Y/]=J?=S^;5_!D_
M"@BQ^ 9?GS0.B0\!'AB25EL7=R)PEWN:L59,FYD;>WLZY>D.YQAM:B:#6E9?
M5"Z]:<G2LYX^DF0>8*4D'">.H'@GTS& *^4(C]682SPXZ.\56("Z--3[<C1"
M\@/-<-CMKW9/,M?:.[+I\9&-[ZC:YGU5&U]>_1]02P$"% ,*    " !E=QLW
MNOR>-DP*  ##.@  $@              I($     97AE8W5T:6]N7VQO9RYH
9=&UL4$L%!@     !  $ 0    'P*      $! 
end

Mime
View raw message