harmony-alerts mailing list archives

Site index · List index
Message view « Date » · « Thread »
Top « Date » · « Thread »
From nom...@intel.com
Subject [build-test alert] FAILED Linux x86: JettyScenario
Date Fri, 24 Aug 2007 10:47:57 GMT
Jetty server JRE:

Apache Harmony Launcher : (c) Copyright 1991, 2006 The Apache Software Foundation or its licensors,
as applicable.
java version "1.5.0" 
pre-alpha : not complete or compatible
svn = r568614, (Aug 23 2007), Linux/ia32/gcc 3.3.3, release build
http://harmony.apache.org

Scenario framework JRE:

Apache Harmony Launcher : (c) Copyright 1991, 2006 The Apache Software Foundation or its licensors,
as applicable.
java version "1.5.0" 
pre-alpha : not complete or compatible
svn = r568614, (Aug 23 2007), Linux/ia32/gcc 3.3.3, release build
http://harmony.apache.org

================================================================================
Scenario results:

Testsuite: org.apache.harmony.test.jetty.JettyScenario
Tests run: 5, Failures: 1, Errors: 0, Time elapsed: 36.559 sec
------------- Standard Output ---------------
Setup completed.

==============================================================testInitialPage===
Starting initial page test case.
Loading page from server: http://localhost:7070/test/
Getting resource with name: initial_page.html
Found resource: /export/users2/cc/cc-suites/tests/JettyScenario/resources/JettyScenario/initial_page.html
Saving content of downloaded page to: /export/users2/cc/cc-suites/build/results/JettyScenario/JettyScenario/initial_page.html
Comparing page content with etalon: initial_page.html
Page is equal to etalon.
Initial page test case passed.

============================================================testStaticContent===
Starting static content page test case.
Loading page from server: http://localhost:7070/test/data.txt
Getting resource with name: static_content.txt
Found resource: /export/users2/cc/cc-suites/tests/JettyScenario/resources/JettyScenario/static_content.txt
Saving content of downloaded page to: /export/users2/cc/cc-suites/build/results/JettyScenario/JettyScenario/static_content.txt
Comparing page content with etalon: static_content.txt
Page have different number of lines than etalon.

=======================================================testSessionDumpServlet===
Starting servlet test case.
Loading page from server: http://localhost:7070/test/session/
Getting resource with name: session_dump.html
Found resource: /export/users2/cc/cc-suites/tests/JettyScenario/resources/JettyScenario/session_dump.html
Saving content of downloaded page to: /export/users2/cc/cc-suites/build/results/JettyScenario/JettyScenario/session_dump.html
Comparing page content with etalon: session_dump.html
Page is equal to etalon.
Session dump servlet page is OK.
Getting resource with name: session_dump_new.html
Found resource: /export/users2/cc/cc-suites/tests/JettyScenario/resources/JettyScenario/session_dump_new.html
Saving content of downloaded page to: /export/users2/cc/cc-suites/build/results/JettyScenario/JettyScenario/session_dump_new.html
Comparing page content with etalon: session_dump_new.html
Page is equal to etalon.
Session create page is OK.
Getting resource with name: session_dump_set.html
Found resource: /export/users2/cc/cc-suites/tests/JettyScenario/resources/JettyScenario/session_dump_set.html
Saving content of downloaded page to: /export/users2/cc/cc-suites/build/results/JettyScenario/JettyScenario/session_dump_set.html
Comparing page content with etalon: session_dump_set.html
Page is equal to etalon.
Session set page is OK.
Getting resource with name: session_dump_remove.html
Found resource: /export/users2/cc/cc-suites/tests/JettyScenario/resources/JettyScenario/session_dump_remove.html
Saving content of downloaded page to: /export/users2/cc/cc-suites/build/results/JettyScenario/JettyScenario/session_dump_remove.html
Comparing page content with etalon: session_dump_remove.html
Page is equal to etalon.
Session remove page is OK.
Getting resource with name: session_dump_invalidate.html
Found resource: /export/users2/cc/cc-suites/tests/JettyScenario/resources/JettyScenario/session_dump_invalidate.html
Saving content of downloaded page to: /export/users2/cc/cc-suites/build/results/JettyScenario/JettyScenario/session_dump_invalidate.html
Comparing page content with etalon: session_dump_invalidate.html
Page is equal to etalon.
Session invalidate page is OK.
Servlet test case passed.

===========================================================testRequestDumpJSP===
Starting JSP test case.
Loading page from server: http://localhost:7070/test/snoop.jsp
Getting resource with name: request_dump_JSP.html
Found resource: /export/users2/cc/cc-suites/tests/JettyScenario/resources/JettyScenario/request_dump_JSP.html
Saving content of downloaded page to: /export/users2/cc/cc-suites/build/results/JettyScenario/JettyScenario/request_dump_JSP.html
Comparing page content with etalon: request_dump_JSP.html
Page is equal to etalon.
JSP test case passed.

=====================================================testGZippedStaticContent===
Starting gzipped static content test case.
Loading page from server: http://localhost:7070/test/data.txt.gz
Unpacking content from archive.
Getting resource with name: static_content_ungzipped.txt
Found resource: /export/users2/cc/cc-suites/tests/JettyScenario/resources/JettyScenario/static_content_ungzipped.txt
Saving content of downloaded page to: /export/users2/cc/cc-suites/build/results/JettyScenario/JettyScenario/static_content_ungzipped.txt
Comparing page content with etalon: static_content_ungzipped.txt
Page is equal to etalon.
Gzipped static content test case passed.
------------- ---------------- ---------------

Testcase: testInitialPage took 9.17 sec
Testcase: testStaticContent took 5.318 sec
	FAILED
Content is not correct.
junit.framework.AssertionFailedError: Content is not correct.
	at org.apache.harmony.test.jetty.JettyScenario.testStaticContent(Unknown Source)
	at java.lang.reflect.VMReflection.invokeMethod(VMReflection.java)

Testcase: testSessionDumpServlet took 1.501 sec
Testcase: testRequestDumpJSP took 9.92 sec
Testcase: testGZippedStaticContent took 10.271 sec

================================================================================
Jetty server output:

2007-08-24 17:46:16.139::INFO:  Logging to STDERR via org.mortbay.log.StdErrLog
2007-08-24 17:46:17.418::INFO:  Statistics on = false for SelectChannelConnector @ 0.0.0.0:7070
2007-08-24 17:46:17.689::INFO:  jetty-6.1.2rc1
2007-08-24 17:46:18.140::INFO:  Deploy /export/users2/cc/cc-suites/build/libs/jetty-6.1.2rc1/contexts/test.xml
-> org.mortbay.jetty.webapp.WebAppContext@10a54e29{/test,/export/users2/cc/cc-suites/build/libs/jetty-6.1.2rc1/webapps/test}
2007-08-24 17:46:18.333::INFO:  Deploy /export/users2/cc/cc-suites/build/libs/jetty-6.1.2rc1/contexts/javadoc.xml
-> org.mortbay.jetty.servlet.Context@10a803ce{/javadoc,file:/export/users2/cc/cc-suites/build/libs/jetty-6.1.2rc1/javadoc/}
2007-08-24 17:46:46.458::WARN:  Unknown realm: Test JAAS Realm
2007-08-24 17:47:01.213::INFO:  Started SelectChannelConnector @ 0.0.0.0:7070
2007-08-24 17:47:17.544::WARN:  EXCEPTION 
java.nio.channels.CancelledKeyException
	at org.apache.harmony.nio.internal.SelectionKeyImpl.checkValid(SelectionKeyImpl.java:90)
	at org.apache.harmony.nio.internal.SelectionKeyImpl.interestOps(SelectionKeyImpl.java:55)
	at org.apache.harmony.nio.internal.SelectorImpl.prepareChannels(SelectorImpl.java:222)
	at org.apache.harmony.nio.internal.SelectorImpl.selectInternal(SelectorImpl.java:185)
	at org.apache.harmony.nio.internal.SelectorImpl.select(SelectorImpl.java:167)
	at org.mortbay.io.nio.SelectorManager$SelectSet.doSelect(SelectorManager.java:394)
	at org.mortbay.io.nio.SelectorManager.doSelect(SelectorManager.java:175)
	at org.mortbay.jetty.nio.SelectChannelConnector.accept(SelectChannelConnector.java:124)
	at org.mortbay.jetty.AbstractConnector$Acceptor.run(AbstractConnector.java:498)
	at org.mortbay.thread.BoundedThreadPool$PoolThread.run(BoundedThreadPool.java:442)
2007-08-24 17:47:17.561::WARN:  EXCEPTION 
java.lang.ArrayIndexOutOfBoundsException
	at org.apache.harmony.nio.internal.SelectorImpl.processSelectResult(SelectorImpl.java:259)
	at org.apache.harmony.nio.internal.SelectorImpl.selectInternal(SelectorImpl.java:199)
	at org.apache.harmony.nio.internal.SelectorImpl.select(SelectorImpl.java:167)
	at org.mortbay.io.nio.SelectorManager$SelectSet.doSelect(SelectorManager.java:394)
	at org.mortbay.io.nio.SelectorManager.doSelect(SelectorManager.java:175)
	at org.mortbay.jetty.nio.SelectChannelConnector.accept(SelectChannelConnector.java:124)
	at org.mortbay.jetty.AbstractConnector$Acceptor.run(AbstractConnector.java:498)
	at org.mortbay.thread.BoundedThreadPool$PoolThread.run(BoundedThreadPool.java:442)

================================================================================

BUILD FAILED:
	Ant Error Message:
/export/users2/cc/cc-suites/scripts/cc-exec-adaptor.xml:101: The following error occurred
while executing this line: /export/users2/cc/cc-suites/adaptors/JettyScenario/adaptor.xml:186:
Jetty scenario failed

Date of build:	08/24/2007 17:46:08
Time to build:	1 minute 41 seconds
Last changed:	08/23/2007 16:34:26
Last log entry:	snapshot

***********************************************************
Errors/Warnings:	(2)
            
The execution FAILED with the following exception:
The following error occurred while executing this line:
/export/users2/cc/cc-suites/adaptors/JettyScenario/adaptor.xml:186: Jetty scenario failed

***********************************************************
Unit Tests: (5)
        
failure: testStaticContent org.apache.harmony.test.jetty.JettyScenario
Unit Test Error Details:	(1)
                
Test: testStaticContentClass: org.apache.harmony.test.jetty.JettyScenariojunit.framework.AssertionFailedError:
Content is not correct.
	at org.apache.harmony.test.jetty.JettyScenario.testStaticContent(Unknown Source)
	at java.lang.reflect.VMReflection.invokeMethod(VMReflection.java)

***********************************************************
Modifications since last successful build:	(1)
            
add cc-snapshot log20070823163426Lbuild.13 08/23/2007 16:34:26snapshot

begin 644 execution_log.zip
M4$L#! H    ( /F-&#?#URC"F@$   (#   2    97AE8W5T:6]N7VQO9RYH
M=&ULE5+!:MPP$+W[*^92<EE;2<N&Q'4,H4V@H:?NWL(>%'D<*Y4E,QIU=_/U
M':]CR&:AT,$&V:/WYO'>5!WWKJZ>0K.OJX&PKC1$WCN\.6N#YSS:5RSAZOS3
MU[,ZRTWH!^LPMVWN$1MLRBRCY,L,QGI$TX4-W+PON&WTP(&@E?<!F?<K@UZ3
M#27\2AZ*XH!]['\WEC;PC5 S-B ?)2C<#8%8I8@4/RMCY,ECLHQ1/27K&D48
MD^.HCHB/Q*Q8$UO_/,T&8?J#-(U\2=[R9E3AQPN!G@L]:--AT6GJ@]\7,HB+
MEQ%8G$Z8\6NY%&%T 98+N-?6)9%5PL4"[H@"R?%\ 6O;(Z#30Q33X,MEL5Q>
MBQIS0O4_.N#^]L?/N^_9A"<<W1(6TCZ*W3VP#!4A4GW,IO1"Q-P'MJTUFFWX
M$-V*PS"<N)6M.]&^0Y-&Q-M0V%KN@*73!N?"=D3ASN PL:Z/&Z,1$(Q)1)+N
MMI,EFAFES9V-X*S',OM7YGI:I0]QS[^+7>_*BZO+<A8_F]1*)-ADE=)UI0XK
MKJ9U5X?=_PM02P$"% ,*    " #YC1@WP]<HPIH!   " P  $@          
M    I($     97AE8W5T:6]N7VQO9RYH=&UL4$L%!@     !  $ 0    ,H!
$      $! 
end

Mime
View raw message