harmony-alerts mailing list archives

Site index · List index
Message view « Date » · « Thread »
Top « Date » · « Thread »
From nom...@intel.com
Subject [build-test alert] FAILED Linux x86: ega . (Eclipse x 48h)
Date Fri, 24 Aug 2007 03:43:27 GMT

BUILD FAILED:
	Ant Error Message:
/export/users/cc/cc-EGAx48/scripts/cc-exec-adaptor.xml:101: The following error occurred while
executing this line: /export/users/cc/cc-EGAx48/adaptors/ega/adaptor.xml:58: EGA scenario
failed.

Date of build:	08/24/2007 10:28:00
Time to build:	15 minutes 19 seconds
Last changed:	08/24/2007 10:16:50
Last log entry:	snapshot

***********************************************************
Errors/Warnings:	(185)
            
[exec] Result: 25
[echo]
[echo]
[echo] ========================== EGA.log =======================
[echo]
[echo] --- Automated EGA scenario for Eclipse 3.2.1 ---
[echo]
[echo]
[echo] Eclipse Home = /export/users/cc/cc-EGAx48/build/libs/eclipse-3.2.l-lnx-x86/eclipse
[echo] Tested JRE Home = /export/users/cc/cc-EGAx48/build/checkouts/snapshot/hdk/jdk
[echo] OS_ARCH = x86
[echo]
[echo] Tested JRE options for Eclipse launching = -showversion -Xmx600M -Xms512M
[echo] Tested JRE options for debug step =
[echo]
[echo] Time frame for the scenario run = 48 hours
[echo] Delay factor = 2
[echo] Kill Eclipse if EGA scenario fails = 1
[echo] Start:
[echo] 	Run Eclipse
[echo] 	Select workspace
[echo] 	wait window 'Workspace Launcher' to appear ...
[echo] 	window 'Workspace Launcher' (29360183) appeared
[echo] 	Select /export/users/cc/cc-EGAx48/tests/ega/workspace as workspace
[echo] 	Press 'OK' button
[echo] 	wait window (29360183) to close ...
[echo] 	window (29360183) successfully closed
[echo]
[echo] Prepare Eclipse environment:
[echo] 	Close Welcome page
[echo] 	wait window 'Java - Eclipse SDK' to appear ...
[echo] 	window 'Java - Eclipse SDK' (29360616) appeared
[echo] 	Uncheck Project->Build Automatically
[echo] 	Select Window->Preferences
[echo] 	wait window 'Preferences' to appear ...
[echo] 	window 'Preferences' (29362418) appeared
[echo] 	Select Java->Build Path->Classpath Variables
[echo] 	Create M2_REPO variable
[echo] 	wait window 'New Variable Entry' to appear ...
[echo] 	window 'New Variable Entry' (29363569) appeared
[echo] 	Set M2_REPO value to /export/users/cc/cc-EGAx48/tests/ega/project/.m2/repository
[echo] 	Press OK button
[echo] 	wait window (29363569) to close ...
[echo] 	window (29363569) successfully closed
[echo] 	Press OK button to apply new preferences
[echo] 	wait window (29362418) to close ...
[echo] 	window (29362418) successfully closed
[echo] 	wait window 'Java - Eclipse SDK' to appear ...
[echo] 	window 'Java - Eclipse SDK' (29360616) appeared
[echo]
[echo] Import geronimo modules into workspace:
[echo] 	Select File->Import...
[echo] 	wait window 'Import' to appear ...
[echo] 	window 'Import' (29364920) appeared
[echo] 	Select import existing project
[echo] 	Type path to search projects: /export/users/cc/cc-EGAx48/tests/ega/project/geronimo-1.2-beta/modules
[echo] 	Uncheck all builders
[echo] 	Import
[echo] 	wait window (29364920) to close ...
[echo] 	window (29364920) successfully closed
[echo]
[echo] Import testsupport module into workspace:
[echo] 	wait window 'Java - Eclipse SDK' to appear ...
[echo] 	window 'Java - Eclipse SDK' (29360616) appeared
[echo] 	Select File->Import...
[echo] 	wait window 'Import' to appear ...
[echo] 	window 'Import' (29376507) appeared
[echo] 	Select import existing project
[echo] 	Type path to search projects: /export/users/cc/cc-EGAx48/tests/ega/project/geronimo-1.2-beta/testsupport
[echo] 	Import
[echo] 	wait window (29376507) to close ...
[echo] 	window (29376507) successfully closed
[echo]
[echo] Start repetable part:
[echo]
[echo] -------------------- Iteration 1 start ------------------
[echo]
[echo] Clean all Geronimo modules:
[echo] 	wait window 'Java - Eclipse SDK' to appear ...
[echo] 	window 'Java - Eclipse SDK' (29360616) appeared
[echo] 	Select Project->Clean...
[echo] 	wait window 'Clean' to appear ...
[echo] 	window 'Clean' (29379722) appeared
[echo] 	Uncheck start build immediatelly
[echo] 	wait window (29379722) to close ...
[echo] 	window (29379722) successfully closed
[echo] 	window 'Cleaning selected projects' (29380028) appeared
[echo] 	wait window (29380028) to close ...
[echo] 	window (29380028) successfully closed
[echo]
[echo] Build all Geronimo modules:
[echo] 	wait window 'Java - Eclipse SDK' to appear ...
[echo] 	window 'Java - Eclipse SDK' (29360616) appeared
[echo] 	Select Project->Build All
[echo] 	wait window 'Building Workspace' to appear ...
[echo] 	window 'Building Workspace' (29381325) appeared
[echo] 	wait window (29381325) to close ...
[echo] 	window (29381325) successfully closed
[echo] 	wait window 'Java - Eclipse SDK' to appear ...
[echo] 	window 'Java - Eclipse SDK' (29360616) appeared
[echo]
[echo] Open Navigator view:
[echo]
[echo] Fix org.apache.geronimo.common.propertyeditor.PropertyEditorsTest:
[echo] 	Select 'Navigate->Open Resource'
[echo] 	wait window 'Open Resource' to appear ...
[echo] 	window 'Open Resource' (29382945) appeared
[echo] 	Type PropertyEditorsTest.java into 'Open Resource' dialog
[echo] 	wait window (29382945) to close ...
[echo] 	window (29382945) successfully closed
[echo] 	wait window 'Java - PropertyEditorsTest.java - Eclipse SDK' to appear ...
[echo] 	window 'Java - PropertyEditorsTest.java - Eclipse SDK' (29360616) appeared
[echo] 	Go to line 'protected void setUp() throws Exception {'
[echo] 	wait window 'Go to Line' to appear ...
[echo] 	window 'Go to Line' (29386999) appeared
[echo] 	wait window (29386999) to close ...
[echo] 	window (29386999) successfully closed
[echo] 	wait window 'Java - PropertyEditorsTest.java - Eclipse SDK' to appear ...
[echo] 	window 'Java - PropertyEditorsTest.java - Eclipse SDK' (29360616) appeared
[echo] 	Add line Class.forName("org.apache.geronimo.common.propertyeditor.PropertyEditors");
to setUp() method
[echo] 	Save PropertyEditorsTest.java
[echo] 	Close PropertyEditorsTest.java
[echo] 	wait window 'Java - Eclipse SDK' to appear ...
[echo] 	window 'Java - Eclipse SDK' (29360616) appeared
[echo]
[echo] Run JUnit tests from geronimo-common module:
[echo] 	Select geronimo-common module
[echo] 	Open Run->Run
[echo] 	wait window 'Run' to appear ...
[echo] 	window 'Run' (29391780) appeared
[echo] 	Create new JUnit run configuration
[echo] 	Run
[echo] 	wait window (29391780) to close ...
[echo] 	window (29391780) successfully closed
[echo]
[echo] Modify GBeanData class from geronimo-kernel module:
[echo] 	wait window 'Java - Eclipse SDK' to appear ...
[echo] 	window 'Java - Eclipse SDK' (29360616) appeared
[echo] 	Select geronimo-kernel module
[echo] 	Select Navigate->Go Into
[echo] 	Open GBeanData.java
[echo] 	wait window 'Java - GBeanData.java - Eclipse SDK' to appear ...
[echo]
[echo] ERROR: Window 'Java - GBeanData.java - Eclipse SDK' didn't appear for 200 sec!
[echo]
[echo] Print error screen picture:
[echo] 	Picture was saved to /export/users/cc/cc-EGAx48/build/results/ega/20070824_1028/error.xwd
[echo] 	Please, use command 'xwud -in ./error.xwd' to view the error screen picture
[echo]
[echo] Kill Eclipse:
[echo] 	Found 1 Eclipse processes
[echo] 	Process 0:
[echo] 	Eclipse process was killed
[echo]
[echo]
[echo] EGA FAILED!
[echo]
[echo] ======================= eclipse.log =======================
[echo] Apache Harmony Launcher : (c) Copyright 1991, 2006 The Apache Software Foundation or
its licensors, as applicable.
[echo] java version "1.5.0"
[echo] pre-alpha : not complete or compatible
[echo] svn = r568614, (Aug 23 2007), Linux/ia32/gcc 3.3.3, release build
[echo] http://harmony.apache.org
[echo] Install location:
[echo]     file:/export/users/cc/cc-EGAx48/build/libs/eclipse-3.2.l-lnx-x86/eclipse/
[echo] Configuration file:
[echo]     file:/export/users/cc/cc-EGAx48/build/libs/eclipse-3.2.l-lnx-x86/eclipse/configuration/config.ini
loaded
[echo] Configuration location:
[echo]     file:/export/users/cc/cc-EGAx48/build/libs/eclipse-3.2.l-lnx-x86/eclipse/configuration/
[echo] Framework located:
[echo]     file:/export/users/cc/cc-EGAx48/build/libs/eclipse-3.2.l-lnx-x86/eclipse/plugins/org.eclipse.osgi_3.2.1.R32x_v20060919.jar
[echo] Framework classpath:
[echo]     file:/export/users/cc/cc-EGAx48/build/libs/eclipse-3.2.l-lnx-x86/eclipse/plugins/org.eclipse.osgi_3.2.1.R32x_v20060919.jar
[echo] Debug options:
[echo]     file:/export/users/cc/cc-EGAx48/tests/ega/.options not found
[echo] Time to load bundles: 319
[echo] Starting application: 8137
[echo] Application Started: 37891
[echo]
[echo] ===========================================================
BUILD FAILED
/export/users/cc/cc-EGAx48/tests/ega/build.xml:464: EGA FAILED!
Total time: 15 minutes 17 seconds
The execution FAILED with the following exception:
The following error occurred while executing this line:
/export/users/cc/cc-EGAx48/adaptors/ega/adaptor.xml:58: EGA scenario failed.

***********************************************************
Unit Tests: (0)
        
No Tests Run: This project doesn't have any tests

***********************************************************
Modifications since last successful build:	(10)
            
add cc-snapshot log20070824101650Lbuild.10 08/24/2007 10:16:50snapshot
add cc-snapshot log20070823163047Lbuild.9 08/23/2007 16:30:47snapshot
add cc-snapshot log20070821203252Lbuild.8 08/21/2007 20:32:52snapshot
add cc-snapshot log20070816185144Lbuild.7 08/16/2007 18:51:44snapshot
add cc-snapshot log20070810185923Lbuild.6 08/10/2007 18:59:23snapshot
add cc-snapshot log20070806193341Lbuild.5 08/06/2007 19:33:41snapshot
add cc-snapshot log20070801153819Lbuild.4 08/01/2007 15:38:19snapshot
add cc-snapshot log20070730185843Lbuild.3 07/30/2007 18:58:43snapshot
add cc-snapshot log20070724161107Lbuild.2 07/24/2007 16:11:07snapshot
add cc-snapshot log20070720165026Lbuild.1 07/20/2007 16:50:26snapshot

begin 644 execution_log.zip
M4$L#! H    ( &M5&#<S9+,:2PH  &DZ   2    97AE8W5T:6]N7VQO9RYH
M=&ULY5M[;]LX$O^[^13< H>D0"Q9=N+8WC1 VJ1M^DK@M-<#BB)@)-IF(XF"
M2/G1^_(W'$J.7Y(E;[9-][R+PHXXY,SP-R]R=#Q4@7]R?"N\Z<EQ%+.38TJD
MFOKL^6Y?A*HF^0_6)>WZO_[</=F)D["[0_3GZW<ZHM_(BX3[7I_[,.16?[4F
M@;\P8.''"KGYSMRA^$9J^D-Z24C.7Y\2Z;*0QEP0$1(U9*0O?%^,>3@@K@C[
M?)#$5'%XAE2Y<WYB4C&/O.V=D^?$9I-(Q,I.)(NE[;KP?PV6FART;>3==H?,
MO1.)DK8,:22'0ME#[\[^[MWE+G#N^CR2C+P1 2NSA,]OI<T,4:UI-2R_YH>3
MVJ3=ROZ:K[WY=:\S]7#%4DV$27#+8F"BOID*-H(HCBP?M'.'GS&?3DF?NDKH
M>1NY ]]QWY^I@O?O-Z]/N2^!U"DGU=QVB4@+)6'?X]G,/DU"=Z@Q\)S48'O&
M(] R@N _P:15KW_07^2AT_A0>05 G,=NDP% GT4P?3%*M_SD*P&19]%$":ZZ
MFX;I[QL'I6@J.\Y*5;EQ_"BP4L45#15!!#[!4J!MR_6IE&O-?L+<;^0THC S
M>4/C0(13\A[W&'#<)7ON,_)21-.8#X:*.)V.LT\:]7J+?(+Q*=FUZ*LQC1EY
M)9+0,X8 ^\F5)#X'%$H1RWU"):%1!'^@M\!5+BOZ+R3#U%/'.K3J3]<B 4>#
MKZQ1/QI28#44"H7VF6)Z??T=F('5<LGE* 2<Q8>M=LLYV"=[IP"^1E,+>/1L
MG[SG83*Q.6TV[('KDJ8%_^V3F/F,@B&@+\F=>:A4U+7MH=&H15%3EH@')?86
MC>#A=AA-YB4P'6JKS>QXT8-;ULJ.?/68UB1Z(*8TJ<=CIMW0]"%<K+W @ V:
MF9F!D /^>+AQ1<PL\-7:53\>KI((#.T7\V-)IO0B<B,;W;]A=?/+XB'/MQ"C
MI;FM1!+(8 JL:CT-\+)B7%\'2?B#1Y" 3"(:>EK=&\6DL3N<B7E]]@Y%=6J^
M=C6U@;JS%(VMP0^B1+6Y;E00:=H5!_ 5D$OC.1Y+[,6ZB0D/R_"4OXT/ 9)2
M$F<NK\<",9IW>6,1WTEPQ&R=N[OWE#&C:#HQDXD/,>S>A-:1?0WN8$!*!ED-
M_"@A2#JWS0;4UM&FWFX<W#CU1GX>> VBJH6L/'?H%0:H?2(9^PN<V##,\L4 
M<S./*9U%YH:['L[2)8W#_"R]U[OL=<D7'GIB3';?ZCA?(Z]?0%PZHXIB1@5_
MR#8+;&,7E.F%NTKG#0P0J!D!%D$N]P]"%;$TTS<9'-"0K,B'G"-DY*C5MO)M
M/(H!S99.C*V 24D'+#]RYC[(?_(\]T,RI>8]K\Z&+MA.(6D-$'X+9=M\WH[J
MP<'5E_A5E=?\4G-%0]G5MB@E+Z]O3GLOW\#L:SS69GW\LMJI7-V4/ZLN0_LQ
MU?_";+K6E_-EJJY0R5 DL<R?8[E0S1^Y7*DN8C:K5@OJ;NT*N_G/G^#Y13I_
M_JAKB#NNFHL*^4/'E,/ U'-]F1%D==*N#M>IDRH*+4^*IMAK=)JMNM-N/DNG
M8FNKBP7>"TQ %P7&J]\+""58&6FO("9(LGL)#O@V40KP64XS<Q* /EQ?R.)(
M^V253B:N"XOW$]^?FAF\+> , D2Z'LTPP,(1CT48L+ 0-B^1XR_,=[6#B2 J
ME(7$VS6QJR(DUDUA%--R6F4@\3E$?P?"B^^ C=H)'@MFH0'*;JW2C8@RX;EV
M BKLLYB%L!MEE3!'4EGZ!5H4NW'@M"M8@E9?)O(55</:R4M=$$?PE?P;'(L^
M="B2Q*1OY$/CIG=^=4E&*4E9V3^R\6P9<AZJ>%I9!>NF0$TT#UN=<II0<_S[
M"=M01-Q[B,A QK:"!N2#D9 <T]U-'N+R7>H?*K@'(TQU]V#H*KF'92[3#0'*
M$%0=50;X'"RK\V_HJO'_V%Q,[H.+0&.,#!@X61X($@@OT>:&)>,LXA2YWM2*
M7W&?U4[,="!26=T8@LKZR,A0!P>=1KV"O^%&9#;A$HO%U(0*./XTC710 7\$
M;$JF2]F,2A96C*MVFBFZYEB-VBV49G:F\<WA <* .;ID1<G<DW1+*UB&46!U
MRS!T#Q/X4ZY18TF$WXUF*D#QL5G=K[>-H]9A_>CWM8UY-#P@X%.M5 9\2O<P
M@#>G0A"S05"=-T3%E5&E&S5R,;O6=*"TU MMN$XKM13>1* ;>KT4+WY'JYQE
MVRA6!;O$\9793JD01YVC1J-*86"V$'T_F&C / X9;W%1L()YLV9US!NZBNG/
MO,S:CTA4.=!DKL$HHEVO-TJ5"LO2I(25I4GI'L:"3<GRCS.'M/@$L4H*@01Z
MEV=G(Y6%6#<%[I?3;!QN!1!#6!T@ANX?FNU?1BPD'^F(#Z@^ZAMQ-MXFY+SB
M$Z)O--.K\2QN6ZX( A%:8.,1B]44W!2L8EVE/\_QI]3'H"7JB=V434B<D.L>
MDR*)-2Y*[L,25<4M6*)&:#0Z!Z6PB"G1&JG-/0FFL\OS@T/75PL5\&V8J8YO
M0_?7\9TKWX- O^SLE1S=:Z&YP3NF7<"H,A%I)+@'\4E]CO9 G\-8C"4YG[@,
MC^C)?TOCS<S^'F:O+/0\*6Y2J],I=6ZT@@I#6!T5AN[_$A6GGF<P@:>.5E_$
M'VG ]IYN[>">/OO3U$(&4@%30U&DQVLZ*G 7F\Z\MR#\;<*5O@QZ^SGDZ;$ 
MZ<<BF!U5U<QFI"E7B8BRGK" SOCH)*R=:$9*ZA.&5E8@TFB-=9RC=JFCK/3,
M6Y^&&@7IJ[[%OK#B.[;R/B7EJ;)/2>D>)M7^(#S>G]ZW'!#LF5L"Q!V+0^:7
M ,1C,X 5A"Y(LAG9]ZD21)(+R"\V8'JI<Z.:HHK;/LII+O?! W>:;'/_"/D9
M87$,TT@W9J"MB+LJB0L!=66&D#&51(([]THU@>7W[^#ZUF1<>$62M@HEV!$:
M!#3TR.YDG'BDQD/=8)/-@9NB4WUL#E@GVA9ZFF\$*-(,]A439[9C$#JU.R@\
M[[XR8TB]:.*E"5'U=\#45NXE'X^O3\FKTXOWYV<%8*K>3D2R%L6M^HD>1\LW
MLH+V6*;E&T=OW_*-Y']+RS?.7*[E>Y[B(I1*G_SXPD45YC>AZ0^^X?,0?;3Y
M1[,+L1_7^SD<Y77V@F:H5Q#S%AG^R6I<9#K_G$.W5>F;)\,?\WX2>Y&?#'@H
M5SKKTT;)7K,QN1EINZYWG [$Q/Q&VGL)W*RGXK>3X0P;Y-:^4U&5^_L[I^P=
M#?1#?>T)<R?&#CM]< " !C\2>GC VW0ZQ5<[^C0S=:&(;-)VFD<%/GTVTI #
MV$CSJ-UQ\@6N&G7*?!;F7/CQXO/%^[,T&"X\**7OV=N-W8/607<^KN:O^$F 
MB\7W[+K$.20!.'B8D#A'.KD3H;?8TXRY8M;,[.SLZ)"G.YP3U*E9#')9?5&Y
M\#XDR\YZND@R]P S)>&Z20S).QD/ 5S9C/!8#;G$@X/N3H$&J$<C79>C$M(?
MJ(;#=G>U>Y)YULZQ34^.;7R3U#9OE=KXBNG_ %!+ 0(4 PH    ( &M5&#<S
M9+,:2PH  &DZ   2              "D@0    !E>&5C=71I;VY?;&]G+FAT
8;6Q02P4&      $  0!     >PH      
end

Mime
View raw message