harmony-alerts mailing list archives

Site index · List index
Message view « Date » · « Thread »
Top « Date » · « Thread »
From nom...@intel.com
Subject [build-test alert] FAILED Linux x86: axis2_app
Date Thu, 23 Aug 2007 10:37:20 GMT

BUILD FAILED:
	Ant Error Message:
/export/users2/cc/cc-suites/scripts/cc-exec-adaptor.xml:101: The following error occurred
while executing this line: /export/users2/cc/cc-suites/adaptors/axis2_app/adaptor.xml:75:
 The following error occurred while executing this line: /export/users2/cc/cc-suites/adaptors/axis2_app/adaptor.xml:184:
The following error occurred while executing this line: /export/users2/cc/cc-suites/adaptors/axis2_app/adaptor.xml:124:
java.io.FileNotFoundException: /export/users2/cc/cc-suites/build/results/axis2_app/Axis2-message.txt
(No such file or directory) The following error occurred while executing this line: /export/users2/cc/cc-suites/adaptors/axis2_app/adaptor.xml:184:
The following error occurred while executing this line: /export/users2/cc/cc-suites/adaptors/axis2_app/adaptor.xml:124:
java.io.FileNotFoundException: /export/users2/cc/cc-suites/build/results/axis2_app/Axis2-message.txt
(No such file or directory)

Date of build:	08/23/2007 17:32:07
Time to build:	5 minutes 1 second
Last changed:	08/23/2007 16:34:26
Last log entry:	snapshot

***********************************************************
Errors/Warnings:	(5)
            
BUILD FAILED
/export/users2/cc/cc-suites/tests/axis2_app/build.xml:85: java.io.FileNotFoundException: /export/users2/cc/cc-suites/build/results/axis2_app/SimpleAxis2Server.log
(No such file or directory)
Total time: 3 seconds
The execution FAILED with the following exception:
The following error occurred while executing this line:
/export/users2/cc/cc-suites/adaptors/axis2_app/adaptor.xml:75: 
The following error occurred while executing this line:
/export/users2/cc/cc-suites/adaptors/axis2_app/adaptor.xml:184: The following error occurred
while executing this line:
/export/users2/cc/cc-suites/adaptors/axis2_app/adaptor.xml:124: java.io.FileNotFoundException:
/export/users2/cc/cc-suites/build/results/axis2_app/Axis2-message.txt (No such file or directory)
The following error occurred while executing this line:
/export/users2/cc/cc-suites/adaptors/axis2_app/adaptor.xml:184: The following error occurred
while executing this line:
/export/users2/cc/cc-suites/adaptors/axis2_app/adaptor.xml:124: java.io.FileNotFoundException:
/export/users2/cc/cc-suites/build/results/axis2_app/Axis2-message.txt (No such file or directory)

***********************************************************
Unit Tests: (0)
        
No Tests Run: This project doesn't have any tests

***********************************************************
Modifications since last successful build:	(1)
            
add cc-snapshot log20070823163426Lbuild.13 08/23/2007 16:34:26snapshot

begin 644 execution_log.zip
M4$L#! H    ( *:,%S<J4B+WCP$  )8%   2    97AE8W5T:6]N7VQO9RYH
M=&UL[51+:]PP$+[[5\REI#W82K8I713'D) LI(0<\CB%4A1Y=JTB2T8SRGK[
MZRN[V[*&9&]M+A66L#3/[YMARH9;6Y5/OMY491>P*A40;RR>'BR]XYS,#Y0P
M/WQW<E!E^0H=!L68:VO0L<RR$)W,8%B/W]6S^@KGT=AZ:6RR>AI^B[ZU$X7)
MA5@%+@C#,P;YNMKYP]7U!2S.KJXO+R8"@7WG XN87-!,:)V^G*)A))$VDU"]
MH=DWU77B3SIR_DG"8%\87RQ2JC>>%SZZ^K+7V+'Q3NYU/#H2 2G:28 [TW86
MSX;[W8BHL'X%[V\\4-0-#*2 #U";@)I]V'QX'?"]9V6!39MH_ B$VKN:)AI?
MT@FW8PX2CK*=VE!L6Q4V\N6W^P8!>]1QP+FE%-:&&^ D67IK_=JX5=+YS<5H
MLB,((8'P6L<0L(9U,\#:>DQB;@R!-0YEMH]#5:LN<;!+W_9IK-#G5*&WB'LT
M/Y;P%G%GQW^E)<=FS%LD4BLLN.>][?B?\'],>"E458IQ[(I?(UB,\_@G4$L!
M A0#"@    @ IHP7-RI2(O>/ 0  E@4  !(              *2!     &5X
F96-U=&EO;E]L;V<N:'1M;%!+!08      0 ! $    "_ 0     ! 
end

Mime
View raw message