harmony-alerts mailing list archives

Site index · List index
Message view « Date » · « Thread »
Top « Date » · « Thread »
From nom...@intel.com
Subject [build-test alert] BUILD FAILED Linux x86: ega. (Eclipse x 48h)
Date Thu, 23 Aug 2007 09:38:34 GMT
BUILD FAILED:
	Ant Error Message:
/export/users/cc/cc-EGAx48/scripts/cc-exec-adaptor.xml:101: The following error occurred while
executing this line: /export/users/cc/cc-EGAx48/adaptors/ega/adaptor.xml:58: EGA scenario
failed.

Date of build:	08/23/2007 16:31:17
Time to build:	7 minutes 10 seconds
Last changed:	08/23/2007 16:30:47
Last log entry:	snapshot

***********************************************************
Errors/Warnings:	(139)
            
[exec] Result: 25
[echo]
[echo]
[echo] ========================== EGA.log =======================
[echo]
[echo] --- Automated EGA scenario for Eclipse 3.2.1 ---
[echo]
[echo]
[echo] Eclipse Home = /export/users/cc/cc-EGAx48/build/libs/eclipse-3.2.l-lnx-x86/eclipse
[echo] Tested JRE Home = /export/users/cc/cc-EGAx48/build/checkouts/snapshot/hdk/jdk
[echo] OS_ARCH = x86
[echo]
[echo] Tested JRE options for Eclipse launching = -showversion -Xmx600M -Xms512M
[echo] Tested JRE options for debug step =
[echo]
[echo] Time frame for the scenario run = 48 hours
[echo] Delay factor = 2
[echo] Kill Eclipse if EGA scenario fails = 1
[echo] Start:
[echo] 	Run Eclipse
[echo] 	Select workspace
[echo] 	wait window 'Workspace Launcher' to appear ...
[echo] 	window 'Workspace Launcher' (29360183) appeared
[echo] 	Select /export/users/cc/cc-EGAx48/tests/ega/workspace as workspace
[echo] 	Press 'OK' button
[echo] 	wait window (29360183) to close ...
[echo] 	window (29360183) successfully closed
[echo]
[echo] Prepare Eclipse environment:
[echo] 	Close Welcome page
[echo] 	wait window 'Java - Eclipse SDK' to appear ...
[echo] 	window 'Java - Eclipse SDK' (29360616) appeared
[echo] 	Uncheck Project->Build Automatically
[echo] 	Select Window->Preferences
[echo] 	wait window 'Preferences' to appear ...
[echo] 	window 'Preferences' (29362306) appeared
[echo] 	Select Java->Build Path->Classpath Variables
[echo] 	Create M2_REPO variable
[echo] 	wait window 'New Variable Entry' to appear ...
[echo] 	window 'New Variable Entry' (29363458) appeared
[echo] 	Set M2_REPO value to /export/users/cc/cc-EGAx48/tests/ega/project/.m2/repository
[echo] 	Press OK button
[echo] 	wait window (29363458) to close ...
[echo] 	window (29363458) successfully closed
[echo] 	Press OK button to apply new preferences
[echo] 	wait window (29362306) to close ...
[echo] 	window (29362306) successfully closed
[echo] 	wait window 'Java - Eclipse SDK' to appear ...
[echo] 	window 'Java - Eclipse SDK' (29360616) appeared
[echo]
[echo] Import geronimo modules into workspace:
[echo] 	Select File->Import...
[echo] 	wait window 'Import' to appear ...
[echo] 	window 'Import' (29364801) appeared
[echo] 	Select import existing project
[echo] 	Type path to search projects: /export/users/cc/cc-EGAx48/tests/ega/project/geronimo-1.2-beta/modules
[echo] 	Uncheck all builders
[echo] 	Import
[echo] 	wait window (29364801) to close ...
[echo] 	window (29364801) successfully closed
[echo]
[echo] Import testsupport module into workspace:
[echo] 	wait window 'Java - Eclipse SDK' to appear ...
[echo] 	window 'Java - Eclipse SDK' (29360616) appeared
[echo] 	Select File->Import...
[echo] 	wait window 'Import' to appear ...
[echo] 	window 'Import' (29376184) appeared
[echo] 	Select import existing project
[echo] 	Type path to search projects: /export/users/cc/cc-EGAx48/tests/ega/project/geronimo-1.2-beta/testsupport
[echo] 	Import
[echo] 	wait window (29376184) to close ...
[echo] 	window (29376184) successfully closed
[echo]
[echo] Start repetable part:
[echo]
[echo] -------------------- Iteration 1 start ------------------
[echo]
[echo] Clean all Geronimo modules:
[echo] 	wait window 'Java - Eclipse SDK' to appear ...
[echo] 	window 'Java - Eclipse SDK' (29360616) appeared
[echo] 	Select Project->Clean...
[echo] 	wait window 'Clean' to appear ...
[echo] 	window 'Clean' (29379184) appeared
[echo] 	Uncheck start build immediatelly
[echo] 	wait window (29379184) to close ...
[echo] 	window (29379184) successfully closed
[echo] 	window 'Cleaning selected projects' (29379490) appeared
[echo] 	wait window (29379490) to close ...
[echo] 	window (29379490) successfully closed
[echo]
[echo] Build all Geronimo modules:
[echo] 	wait window 'Java - Eclipse SDK' to appear ...
[echo] 	window 'Java - Eclipse SDK' (29360616) appeared
[echo] 	Select Project->Build All
[echo] 	wait window 'Building Workspace' to appear ...
[echo] 	window 'Building Workspace' (29380688) appeared
[echo]
[echo] ERROR: Unable to set focus to 'Building Workspace' window!
[echo]
[echo] Print error screen picture:
[echo] 	Picture was saved to /export/users/cc/cc-EGAx48/build/results/ega/20070823_0431/error.xwd
[echo] 	Please, use command 'xwud -in ./error.xwd' to view the error screen picture
[echo]
[echo] Kill Eclipse:
[echo] 	Found 1 Eclipse processes
[echo] 	Process 0:
[echo] 	Eclipse process was killed
[echo]
[echo]
[echo] EGA FAILED!
[echo]
[echo] ======================= eclipse.log =======================
[echo] Apache Harmony Launcher : (c) Copyright 1991, 2006 The Apache Software Foundation or
its licensors, as applicable.
[echo] java version "1.5.0"
[echo] pre-alpha : not complete or compatible
[echo] svn = r568614, (Aug 23 2007), Linux/ia32/gcc 3.3.3, release build
[echo] http://harmony.apache.org
[echo] Install location:
[echo]     file:/export/users/cc/cc-EGAx48/build/libs/eclipse-3.2.l-lnx-x86/eclipse/
[echo] Configuration file:
[echo]     file:/export/users/cc/cc-EGAx48/build/libs/eclipse-3.2.l-lnx-x86/eclipse/configuration/config.ini
loaded
[echo] Configuration location:
[echo]     file:/export/users/cc/cc-EGAx48/build/libs/eclipse-3.2.l-lnx-x86/eclipse/configuration/
[echo] Framework located:
[echo]     file:/export/users/cc/cc-EGAx48/build/libs/eclipse-3.2.l-lnx-x86/eclipse/plugins/org.eclipse.osgi_3.2.1.R32x_v20060919.jar
[echo] Framework classpath:
[echo]     file:/export/users/cc/cc-EGAx48/build/libs/eclipse-3.2.l-lnx-x86/eclipse/plugins/org.eclipse.osgi_3.2.1.R32x_v20060919.jar
[echo] Debug options:
[echo]     file:/export/users/cc/cc-EGAx48/tests/ega/.options not found
[echo] Time to load bundles: 404
[echo] Starting application: 8682
[echo] Application Started: 40441
[echo]
[echo] ===========================================================
BUILD FAILED
/export/users/cc/cc-EGAx48/tests/ega/build.xml:464: EGA FAILED!
Total time: 7 minutes 8 seconds
The execution FAILED with the following exception:
The following error occurred while executing this line:
/export/users/cc/cc-EGAx48/adaptors/ega/adaptor.xml:58: EGA scenario failed.

***********************************************************
Unit Tests: (0)
        
No Tests Run: This project doesn't have any tests

***********************************************************
Modifications since last successful build:	(9)
            
add cc-snapshot log20070823163047Lbuild.9 08/23/2007 16:30:47snapshot
add cc-snapshot log20070821203252Lbuild.8 08/21/2007 20:32:52snapshot
add cc-snapshot log20070816185144Lbuild.7 08/16/2007 18:51:44snapshot
add cc-snapshot log20070810185923Lbuild.6 08/10/2007 18:59:23snapshot
add cc-snapshot log20070806193341Lbuild.5 08/06/2007 19:33:41snapshot
add cc-snapshot log20070801153819Lbuild.4 08/01/2007 15:38:19snapshot
add cc-snapshot log20070730185843Lbuild.3 07/30/2007 18:58:43snapshot
add cc-snapshot log20070724161107Lbuild.2 07/24/2007 16:11:07snapshot
add cc-snapshot log20070720165026Lbuild.1 07/20/2007 16:50:26snapshot

begin 644 execution_log.zip
M4$L#! H    ( ,Z$%S=:<N=<NP@  .HN   2    97AE8W5T:6]N7VQO9RYH
M=&ULW5I];]LV$_][^12W 4-:();\%M?VDP;(DO1E;9? 2=<'"(J D6B;C20*
M(N67?OH=*<F1$E.6O+1IYQ:!;/&.=S_>*\F#J?2]PX,;[BX/#\*('AX0$'+I
MT9>[8Q[(AF!?Z1#ZS=__MWNX$\7!< ?4Y^H+F9'/\$?,/'?,/!QRHQZMA>\5
M!A2^/"!/GJDSY9^AH3XPB@,X?7T$PJ$!B1@''H"<4AASS^-S%DS X<&83>*(
M2(;O-)61YR45DKKPY^@47H)-%R&/I!T+&@G;<?!_ Z=:=/NVEMUVIM2YY;$4
MM@A(**9<VE/WUO[BWAHG.'4\%@H*;[A/JTSAL1MATX2HT;':EM?P@D5CT>]E
MOYK1R\][D<'#)$V1"&+_AD8H1',S%2X$2*9%[O:-PT^H1Y8P)H[DBF_;./ =
M\[P5%&Q\MWACPCR!I*UJ6N66BX=**8'K'JTX>R0.G*FR@9?0P.69SQ!E;03_
M]Q>]9O.#>A#[K?:'VC.@Q;GT)IZ@Z=,0V9=;Z98?,PC:\BP22\[D<-,P];QQ
M4&I-5<=9*90;Q\]\*P6N;"CW0XP)ED2T+<<C0JQU^P5U/H/Z!;*%_*UE[5O-
MW];"KT=C@&H0+YP2&$+ I9[)HY("+J)Z1E>X\:B17,P"7-QHO]?OM;I[\.P(
M5[S=@7:S^>+Y'KQG0;RP&>FT[8GC0,?"?WL048\2M#[MP$;.4RG#H6U/2>3S
M8&F1D"!>%H\F1HHC/03>)!3P7ALW.O 0GCG/X9B'RXA-IA):@T%K3XG8@TL<
MGY)=\+&<DXC"*QX';A(!$ ,F!7@,W4_P2.P!$4#"$'\@B(I586VU$SS>"FN7
M.4;\ N6UF1\7([AE6?=)KURJ%E5'("H5J<LBJL+0\C%"K%T0P,9%6KD!%Q/V
MXTCC\(A:&*M5J/YQI(I#M+<GEL<25*I)Q$8QAM]@]N2;Q0)F]I $I=Q2:A*L
M8$J\:CT-RO+ N:XF<?"5A5B +$(2N KNC6J2R)FNU+PX>:=5;34\%?4:$WEK
M21)9DZ\@>3U>U](/%>V# '"%EDNBG(P5UF(=8V!!%9G,R_@81E))XRSDC:C/
M9_F0-^?1K<#(31\QW*G8BPI/B+WB;H[!$26:<T1%[&&2N)MAC4!PY=_B@)0,
MZR7\4@&BE+<62:749K_=N6YV.RVC6!<(HBS4^\:AYSH+[X&@]%](8N,PR^,3
M7?6Y5*KZU)BA1YK+$-K[YOI_-#H;#>%CH!*L\AR,2\C;B87ZLJO;(P7[IVR%
M=@%#@,OGOP*18"D!KS.CTNYHA1XF\(#"B_U!2<(.(_0)2Y77ED^%(!-JSK_&
M%^8W+XT?R  TO:\OAFK[CK#T];6I%9J_?/6OX=&#ZT_Q5/U;?JI<ZU%UMBT:
MTK.+ZZ/1\1ODOB;N;<;CR3JP:MV7F:MJ9L<147^1F]HQ$/EF5_6Y,.5Q),P\
M[K>[YI'W^]VBS68];TGWKL+>T/S^%[T+DO(WC[K =.'(7&XQ#YT3)M/( [NK
M8+1J.G95M,).@6*R79</[OB4L'C6'G1ZS5:_\SQE1=>V2P79ZZ4WU<]4T?8<
MX[^ W;-WN]BU28GV60V9G :(A^-QL39?/X C1R=BQ\')Q['G+1,.[A;FC J$
MJKG+;( &,Q;QP*=!J=D<:XD_4<]1 2;$K%#5)/Y477AC-1]6A[5-8AV+!)A>
MJU?%)#X&.MZA\OP+VD;C4&?/+#5@#ZL@W6A1G[0XC4.$<$PC&N!J5 4A1U);
M^P*M5KO=:592.Y5;P9>I?$[DM'%XK-KJ$!_A;PPLJL HTR0IU>!#^WIT>GX&
MLY2DJNY_T?EJ&C@-9+2L#<$Z%AJ)3G>_7PT)F9/?B^F&5N0N0H2)R=B6W\;:
M+^2"Z=)V4X0X>Y?&AQKA(5&F?GA(Z&J%A_M2I@N"E %"'=8V\)Q9UI<_H:LG
M_X\68HPOWOK*QF!",<@RGX//W5BYFVX\5QFG+/2F7OR*>;1QF+!#E:IBDQ#4
MQB,CTQAT^\U6C7C#$I7I@@G=&*8N5"+QY3)4207CD>YS5$.<48G2[O"AGV9 
M-UI6NW&#;9B=(;XY/6 :2/9B:5DQ]TNZI#4\(P&POF<D=(^3^%.I-6)QJ)\3
M9&J8XH_F=4_O&R]ZK7[WY_6-O#4\HL&GJ-0V^)3N<0P^V0'"G(V*JKHA+.^,
M:IW+P=O5X6@+6TLUT89#N4I3Z?,,'89>W\L7/Z-7KJIMK58-O]3C:XN=4FD[
M&E3TRBSR)TNH8S^ZJ$]=AA5O>5/PP.8'6]K\H+[-%W56<41HR)$F"PT9$-U!
MLPH0#[71A%MHH^D>QX.3EN4_YPYI\XEJ551BW5YO3276L5!*])N]?I4.ZEML
M4V^S>8&U"M HXA$()Z(T@) Y,HY*JY;S9 C,B0!!9FB*5<Y\S!O]>GYK,2_M
MK](SA5@?2OL^"5S87<QC%QHL4+OS&0^]DC.&79?:65RGVA8XY7<1RY#1)_R8
MP3+;QN"AW+:T6#Y/QD"SC/$]AAKZ6Q1JJS!@MKW71_#JZ.W[TY,28ZI_%@'9
M*>E6AQ%/?/DB+XKZI=(%&#UZ^PLPFOR;7(#1G&M=@$EZG0 3.KJ QQT-H?D$
M2WWT)</'.,HWUW6%:REZON\CD>ER 2)#W))P7Q3X.\-8%-HXYRMU)J/:UD0^
MZGXG\4(OGK! /+C<DYZRCCKMQ?5,^75ST!I87TK.\N\T<+(-V9].AQ-]NK;V
M6E==Z>\:UNR:F(Y#8Q4)RX_G,(4J@\8X$KBZ.NPVN^5]H2I)TA"J+1OZO;[Y
M%NK1W<B$'(U-S=$UWS_8Y@1\XZ? L_#ECX]OWY^DR;#PHA+>JPO6PVZO.\SG
M5?.,EQQ#K+[J.X07X&-\1W[0Q_H/_=<M7GW0)71VYZ&ULZ,2GKH($6M$DZFP
M+%1['(4+V73AT#")/)?%%[I.XHX31UBUPGR*II5QQ-=RRH2^ZS#<*=&?N"24
MF$\U!.D7#<)^?_CPX)6ZULZ!30X/;'V5W4ZNM=OZCOL_4$L! A0#"@    @ 
MSH07-UIRYUR["   ZBX  !(              *2!     &5X96-U=&EO;E]L
=;V<N:'1M;%!+!08      0 ! $    #K"      ! 
end

Mime
View raw message