harmony-alerts mailing list archives

Site index · List index
Message view « Date » · « Thread »
Top « Date » · « Thread »
From nom...@intel.com
Subject [build-test alert] FAILED Windows 2003 x86: jedit_test
Date Thu, 23 Aug 2007 05:58:25 GMT
svn.revision=567890
BUILD FAILED:
	Ant Error Message:
C:\cc\cc-suites\scripts\cc-exec-adaptor.xml:101: The following error occurred while executing
this line: C:\cc\cc-suites\adaptors\jedit_test\adaptor.xml:122: Some of JEdit tests failed.

Date of build:	08/23/2007 12:57:50
Time to build:	28 seconds
Last changed:	08/22/2007 17:08:58
Last log entry:	snapshot

***********************************************************
Errors/Warnings:	(16)
            
Java Result: 1
Java Result: 1
[junit] Test org.apache.harmony.guitests.JEditLaunchTest FAILED
BUILD FAILED
C:\cc\cc-suites\tests\jedit_test\build.xml:118: if=test.not.passed
Total time: 9 seconds
[junit] Test org.apache.harmony.guitests.JEditFunctionalTest FAILED
BUILD FAILED
C:\cc\cc-suites\tests\jedit_test\build.xml:122: if=test.not.passed
Total time: 7 seconds
[junit] Test org.apache.harmony.guitests.JEditStressTest FAILED
BUILD FAILED
C:\cc\cc-suites\tests\jedit_test\build.xml:126: if=test.not.passed
Total time: 8 seconds
The execution FAILED with the following exception:
The following error occurred while executing this line:
C:\cc\cc-suites\adaptors\jedit_test\adaptor.xml:122: Some of JEdit tests failed.

***********************************************************
Unit Tests: (3)
        
error: C:\cc\cc-suites\tests\jedit_test/scripts/jedit_fn_00.xml org.apache.harmony.guitests.JEditFunctionalTest
error: C:\cc\cc-suites\tests\jedit_test/scripts/jedit_ln_00.xml org.apache.harmony.guitests.JEditLaunchTest
error: test org.apache.harmony.guitests.JEditStressTest
Unit Test Error Details:	(3)
                
Test: C:\cc\cc-suites\tests\jedit_test/scripts/jedit_fn_00.xmlClass: org.apache.harmony.guitests.JEditFunctionalTestjava.lang.NoSuchMethodError:
java/awt/Toolkit.getEventMonitor()Ljava/lang/Object; while resolving constant pool entry at
index 107 in class java/awt/EventQueueCore
	at java.awt.EventQueueCore.postEvent(EventQueueCore.java:91)
	at java.awt.EventQueue.postEvent(EventQueue.java:116)
	at java.awt.EventQueue.invokeAndWait(EventQueue.java:67)
	at abbot.util.AWT.invokeAndWait(AWT.java:96)
	at abbot.script.AppClassLoader$AppEventQueue.install(AppClassLoader.java:235)
	at abbot.script.AppClassLoader.install(AppClassLoader.java:185)
	at abbot.script.Launch.install(Launch.java:112)
	at abbot.script.Launch.runStep(Launch.java:180)
	at abbot.script.Step.run(Step.java:92)
	at abbot.script.StepRunner.runStep(StepRunner.java:277)
	at abbot.script.Sequence.runStep(Sequence.java:110)
	at abbot.script.Script.runStep(Script.java:499)
	at abbot.script.StepRunner.runStep(StepRunner.java:274)
	at abbot.script.StepRunner.run(StepRunner.java:194)
	at junit.extensions.abbot.ScriptFixture.runTest(ScriptFixture.java:60)
Test: C:\cc\cc-suites\tests\jedit_test/scripts/jedit_ln_00.xmlClass: org.apache.harmony.guitests.JEditLaunchTestjava.util.NoSuchElementException
	at java.util.LinkedList.getLast(LinkedList.java:476)
	at java.awt.EventQueueCore.pop(EventQueueCore.java:215)
	at java.awt.EventQueue.pop(EventQueue.java:140)
	at abbot.script.AppClassLoader$AppEventQueue.uninstall(AppClassLoader.java:250)
	at abbot.script.AppClassLoader.uninstall(AppClassLoader.java:206)
	at abbot.script.Launch.terminate(Launch.java:153)
	at abbot.script.StepRunner.terminate(StepRunner.java:341)
	at abbot.script.StepRunner.run(StepRunner.java:209)
	at junit.extensions.abbot.ScriptFixture.runTest(ScriptFixture.java:60)
Test: testClass: org.apache.harmony.guitests.JEditStressTestjava.util.NoSuchElementException
	at java.util.LinkedList.getLast(LinkedList.java:476)
	at java.awt.EventQueueCore.pop(EventQueueCore.java:215)
	at java.awt.EventQueue.pop(EventQueue.java:140)
	at abbot.script.AppClassLoader$AppEventQueue.uninstall(AppClassLoader.java:250)
	at abbot.script.AppClassLoader.uninstall(AppClassLoader.java:206)
	at abbot.script.Launch.terminate(Launch.java:153)
	at abbot.script.Fixture.terminate(Fixture.java:61)
	at abbot.script.StepRunner.terminate(StepRunner.java:341)
	at abbot.script.StepRunner.run(StepRunner.java:209)
	at junit.extensions.abbot.ScriptFixture.runTest(ScriptFixture.java:60)
	at org.apache.harmony.guitests.JEditStressTest$RepeatableScript.runTest(Unknown Source)
	at org.apache.harmony.guitests.JEditStressTest.test(Unknown Source)
	at java.lang.reflect.VMReflection.invokeMethod(VMReflection.java)

***********************************************************
Modifications since last successful build:	(2)
            
add cc-snapshot log20070822170858Lbuild.1 08/22/2007 17:08:58snapshot
add cc-snapshot log20070822100152Lbuild.10 08/22/2007 10:01:52snapshot

begin 644 execution_log.zip
M4$L#! H    ( $IG%S=PI<H;7 0  ((=   2    97AE8W5T:6]N7VQO9RYH
M=&UL[5E+;]LX$#YO@/R'N2R: I'\2!RG6C= MTF !FD/37(H:B.@I;'%A")5
MDDKB_?4[I)R''5NQFWI[6!N&39'#;T;#>7R0.JG-Q$&GKY+102?7>-!A8.Q(
MX/LW R5M8/@_&,%^_<^_WAQL;NA"1IL;X#[?K]@-Z\'?!1?)@ L2ZKMA>)>)
M28G)J\"@#7*M[D91I=@ ;9P&">8H$U,MRJ6Q3(C@"A-NEQ -<E$,:6:Q+4IS
M$F8B8/V^>D%-SISQR^R(59:3$\N=F"RRY8KI9<3O[V,)T86\/[8\3)G.E!R%
MWJ3*+10!15X-:M@-C@^)I"V7PV5BP,57CMIRG-[EA]EUPG4//FID%A.@BP@^
M1MU#%1<92FN R03.QFJ[@O43+2Y_L&[HP:O,B 4R&6K,E9YVL1LE*-!B#P[=
M/X$[U1A;I4=.?QS3-S %MVBZ/I>Z=+;QM2JLZ7K5E[1BNR5\=?R1#-,8(*,P
M?)ZSO\Z66Z6O:?/B3O[MP MXCQP6"%;(9V%<#@O);0^^%E(ZMRD]#%E.?G[,
M@*$WPIKPY(C4GGJD<YJ8#^96#;B#@L8V'#,N"DVQ"_5M.-)::>/GSWF&@(+E
M!I,(FF%]ITFY%,^'O9 Q*X:I!;R+,;=<2> 2,L9G!,3#)E\?PJ,[;H_N=T7P
M(<\%CYF'0%J"!"4G[V\UWP)-G:=T&LEWA[S=VG9_O?D*_F!VK.2+<FK.,"XT
MMZ//3+(AZM ?FUO8FKWN$*/=^MMJ#6XV%$P.0SHI2YX+G=U;]Q<E2&MW892S
MD;&8E2#CL<=HU%^RY$F$6*6$"9FTH67F.L&!"97W,!.AWQ&>7-"O"P<77W2S
MSI=;TY-><:O=J%#LI)>)33C^\.GTZ+ R+X9(RBGI@ID%KM1<+I%^S:09*)V!
M<W<$[?I.9JK09R;<%-6X^'1Z.-/0Z?SWM_@TZQ^H2=1H[$? !^_=="@I"'-F
M*)^J])XK:BWC^WCG,DY14YP4.:%?^(JF$)92]7XM5OF(C*-?5RD:X&@26#6G
M7&F_?<+L9KW>#NK[07/GLM%LM=?,:\V\GEO^7S.O<IRI&V(/G]7-L]!>D$>%
M?19?%_DL;(Q3U8-OJM! -,ZX\@A7KE[!O4F0DIG01Y3@8*@3%3GUMOE@3S\+
MV%BKL''-/*OR;\T\7\D\!]0'2TKP*]CG\0/:*ACH7FNOFH$N1D,FC5PY%=G9
MK:8B<T]@%72DV7P-'6FOZ<B\4KRF(_\/.O+3[?B%1O133=D/UUU^W>5?ZO*&
MVI.9R1&7[?!G'FDUSY<:Z^=+\S2LGR\M0.P>8W/EI.Y=NYK4S4RXE1"ZO=<0
MNOW?3NB6K]PS@ 5[+$>35NYX*\U29I9H&^<IE:<[RE9?)LIS@EMN4["T,E!"
MJ%NGXJ$:17[+DP57ZT#%E.^:BLMMZOPU1J1EFW(#@DND*)FVC24L)Q=,F#6>
M>^3Q9XH*J!J CWWP00(#*K:8A!N;&YT:.^C4_"O66OFZM>;?O?X+4$L! A0#
M"@    @ 2F<7-W"ERAM<!   @AT  !(              *2!     &5X96-U
C=&EO;E]L;V<N:'1M;%!+!08      0 ! $    ",!      ! 
end

Mime
View raw message