harmony-alerts mailing list archives

Site index · List index
Message view « Date » · « Thread »
Top « Date » · « Thread »
From nom...@intel.com
Subject [build-test alert] FAILED Windows 2003 x86: eut33
Date Wed, 22 Aug 2007 19:58:06 GMT

================================================
Eclipse Unit Tests on windows x86. Tested JRE:
================================================
Apache Harmony Launcher : (c) Copyright 1991, 2006 The Apache Software Foundation or its licensors, as applicable.
java version "1.5.0" 
pre-alpha : not complete or compatible
svn = r567890, (Aug 21 2007), Windows/ia32/msvc 1310, release build
http://harmony.apache.org


JRE options: -showversion -Xmx1024m
===============================

Unexpected failures (33):

Testcase: org.eclipse.core.tests.internal.localstore.MoveTest.testMoveFolderAcrossVolumes:
junit.framework.AssertionFailedError: 0.0: org.eclipse.core.runtime.CoreException: Cannot create file because existing file of wrong type exists: D:\temp\destination.
	at org.eclipse.core.tests.harness.CoreTest.fail(CoreTest.java:49)
	at org.eclipse.core.tests.internal.localstore.MoveTest.testMoveFolderAcrossVolumes(MoveTest.java:196)
	at org.eclipse.test.EclipseTestRunner.run(EclipseTestRunner.java:354)
	at org.eclipse.test.EclipseTestRunner.run(EclipseTestRunner.java:206)
	at org.eclipse.test.CoreTestApplication.runTests(CoreTestApplication.java:35)
	at org.eclipse.test.CoreTestApplication.run(CoreTestApplication.java:31)
	at org.eclipse.equinox.internal.app.EclipseAppContainer.callMethod(EclipseAppContainer.java:533)
	at org.eclipse.equinox.internal.app.EclipseAppHandle.run(EclipseAppHandle.java:155)
	at org.eclipse.core.runtime.internal.adaptor.EclipseAppLauncher.runApplication(EclipseAppLauncher.java:106)
	at org.eclipse.core.runtime.internal.adaptor.EclipseAppLauncher.start(EclipseAppLauncher.java:76)
	at org.eclipse.core.runtime.adaptor.EclipseStarter.run(EclipseStarter.java:363)
	at org.eclipse.core.runtime.adaptor.EclipseStarter.run(EclipseStarter.java:176)
	at org.eclipse.equinox.launcher.Main.invokeFramework(Main.java:504)
	at org.eclipse.equinox.launcher.Main.basicRun(Main.java:443)
	at org.eclipse.equinox.launcher.Main.run(Main.java:1169)
	at org.eclipse.equinox.launcher.Main.main(Main.java:1144)
	at org.eclipse.core.launcher.Main.main(Main.java:30)

Testcase: org.eclipse.jdt.core.tests.builder.IncrementalTests.testRenameMainType:
junit.framework.ComparisonFailure: Invalid problem(s)!!!.
----------- Expected ------------
Problem : The public type _A must be defined in its own file [ resource : </Project/src/p/A.java> range : <25,27> category : <40> severity : <2>]
Problem : A cannot be resolved to a type [ resource : </Project/src/p/B.java> range : <35,36> category : <40> severity : <2>]
Problem : The hierarchy of the type C is inconsistent [ resource : </Project/src/p/C.java> range : <25,26> category : <40> severity : <2>]
------------ but was ------------
Problem : The hierarchy of the type C is inconsistent [ resource : </Project/src/p/C.java> range : <25,26> category : <40> severity : <2>]
Problem : A cannot be resolved to a type [ resource : </Project/src/p/B.java> range : <35,36> category : <40> severity : <2>]
Problem : The public type _A must be defined in its own file [ resource : </Project/src/p/A.java> range : <25,27> category : <40> severity : <2>]
--------- Difference is ----------
 expected:<Problem : The [public type _A must be defined in its own file [ resource : </Project/src/p/A.java> range : <25,27> category : <40> severity : <2>]
Problem : A cannot be resolved to a type [ resource : </Project/src/p/B.java> range : <35,36> category : <40> severity : <2>]
Problem : The hierarchy of the type C is inconsistent [ resource : </Project/src/p/C.java> range : <25,26]> category : <40> se...> but was:<Problem : The [hierarchy of the type C is inconsistent [ resource : </Project/src/p/C.java> range : <25,26> category : <40> severity : <2>]
Problem : A cannot be resolved to a type [ resource : </Project/src/p/B.java> range : <35,36> category : <40> severity : <2>]
Problem : The public type _A must be defined in its own file [ resource : </Project/src/p/A.java> range : <25,27]> category : <40> se...>
	at org.eclipse.jdt.core.tests.junit.extension.TestCase.assertStringEquals(TestCase.java:234)
	at org.eclipse.jdt.core.tests.junit.extension.TestCase.assumeEquals(TestCase.java:254)
	at org.eclipse.jdt.core.tests.builder.BuilderTests.expectingProblemsFor(BuilderTests.java:307)
	at org.eclipse.jdt.core.tests.builder.IncrementalTests.testRenameMainType(IncrementalTests.java:189)
	at java.lang.reflect.VMReflection.invokeMethod(VMReflection.java)
	at org.eclipse.test.EclipseTestRunner.run(EclipseTestRunner.java:354)
	at org.eclipse.test.EclipseTestRunner.run(EclipseTestRunner.java:206)
	at org.eclipse.test.CoreTestApplication.runTests(CoreTestApplication.java:35)
	at org.eclipse.test.CoreTestApplication.run(CoreTestApplication.java:31)
	at java.lang.reflect.VMReflection.invokeMethod(VMReflection.java)
	at org.eclipse.equinox.internal.app.EclipseAppContainer.callMethod(EclipseAppContainer.java:533)
	at org.eclipse.equinox.internal.app.EclipseAppHandle.run(EclipseAppHandle.java:155)
	at org.eclipse.core.runtime.internal.adaptor.EclipseAppLauncher.runApplication(EclipseAppLauncher.java:106)
	at org.eclipse.core.runtime.internal.adaptor.EclipseAppLauncher.start(EclipseAppLauncher.java:76)
	at org.eclipse.core.runtime.adaptor.EclipseStarter.run(EclipseStarter.java:363)
	at org.eclipse.core.runtime.adaptor.EclipseStarter.run(EclipseStarter.java:176)
	at java.lang.reflect.VMReflection.invokeMethod(VMReflection.java)
	at org.eclipse.equinox.launcher.Main.invokeFramework(Main.java:504)
	at org.eclipse.equinox.launcher.Main.basicRun(Main.java:443)
	at org.eclipse.equinox.launcher.Main.run(Main.java:1169)
	at org.eclipse.equinox.launcher.Main.main(Main.java:1144)
	at org.eclipse.core.launcher.Main.main(Main.java:30)

Testcase: org.eclipse.jdt.core.tests.compiler.parser.ParserTest.test027 - 1.3:
junit.framework.ComparisonFailure: Invalid problem log .
----------- Expected ------------
----------\n
1. ERROR in X.java (at line 19)\n
	catch (\n
	      ^\n
Syntax error on token "(", FormalParameter expected after this token\n
----------\n
------------ but was ------------
----------\n
1. ERROR in X.java (at line 4)\n
	import org.xml.sax.SAXException;\n
	       ^^^^^^^\n
The import org.xml cannot be resolved\n
----------\n
2. ERROR in X.java (at line 6)\n
	public void doSomething() throws FileNotFoundException, EOFException, SAXException{\n
	                                                                      ^^^^^^^^^^^^\n
SAXException cannot be resolved to a type\n
----------\n
3. ERROR in X.java (at line 19)\n
	catch (\n
	      ^\n
Syntax error on token "(", FormalParameter expected after this token\n
----------\n
--------- Difference is ----------
 expected:<... in X.java (at line []19)\n
	catch (\n
	  ...> but was:<... in X.java (at line [4)\n
	import org.xml.sax.SAXException;\n
	       ^^^^^^^\n
The import org.xml cannot be resolved\n
----------\n
2. ERROR in X.java (at line 6)\n
	public void doSomething() throws FileNotFoundException, EOFException, SAXException{\n
	                                                                      ^^^^^^^^^^^^\n
SAXException cannot be resolved to a type\n
----------\n
3. ERROR in X.java (at line ]19)\n
	catch (\n
	  ...>
	at org.eclipse.jdt.core.tests.junit.extension.TestCase.assertStringEquals(TestCase.java:226)
	at org.eclipse.jdt.core.tests.junit.extension.TestCase.assertEquals(TestCase.java:201)
	at org.eclipse.jdt.core.tests.compiler.regression.AbstractRegressionTest.runNegativeTest(AbstractRegressionTest.java:1123)
	at org.eclipse.jdt.core.tests.compiler.regression.AbstractRegressionTest.runNegativeTest(AbstractRegressionTest.java:999)
	at org.eclipse.jdt.core.tests.compiler.regression.AbstractRegressionTest.runNegativeTest(AbstractRegressionTest.java:978)
	at org.eclipse.jdt.core.tests.compiler.parser.ParserTest.test027(ParserTest.java:715)
	at java.lang.reflect.VMReflection.invokeMethod(VMReflection.java)
	at junit.extensions.TestDecorator.basicRun(TestDecorator.java:24)
	at junit.extensions.TestDecorator.run(TestDecorator.java:30)
	at org.eclipse.jdt.core.tests.util.CompilerTestSetup.run(CompilerTestSetup.java:48)
	at org.eclipse.test.EclipseTestRunner.run(EclipseTestRunner.java:354)
	at org.eclipse.test.EclipseTestRunner.run(EclipseTestRunner.java:206)
	at org.eclipse.test.CoreTestApplication.runTests(CoreTestApplication.java:35)
	at org.eclipse.test.CoreTestApplication.run(CoreTestApplication.java:31)
	at java.lang.reflect.VMReflection.invokeMethod(VMReflection.java)
	at org.eclipse.equinox.internal.app.EclipseAppContainer.callMethod(EclipseAppContainer.java:533)
	at org.eclipse.equinox.internal.app.EclipseAppHandle.run(EclipseAppHandle.java:155)
	at org.eclipse.core.runtime.internal.adaptor.EclipseAppLauncher.runApplication(EclipseAppLauncher.java:106)
	at org.eclipse.core.runtime.internal.adaptor.EclipseAppLauncher.start(EclipseAppLauncher.java:76)
	at org.eclipse.core.runtime.adaptor.EclipseStarter.run(EclipseStarter.java:363)
	at org.eclipse.core.runtime.adaptor.EclipseStarter.run(EclipseStarter.java:176)
	at java.lang.reflect.VMReflection.invokeMethod(VMReflection.java)
	at org.eclipse.equinox.launcher.Main.invokeFramework(Main.java:504)
	at org.eclipse.equinox.launcher.Main.basicRun(Main.java:443)
	at org.eclipse.equinox.launcher.Main.run(Main.java:1169)
	at org.eclipse.equinox.launcher.Main.main(Main.java:1144)
	at org.eclipse.core.launcher.Main.main(Main.java:30)

Testcase: org.eclipse.jdt.core.tests.compiler.parser.ParserTest.test027 - 1.4:
junit.framework.ComparisonFailure: Invalid problem log .
----------- Expected ------------
----------\n
1. ERROR in X.java (at line 19)\n
	catch (\n
	      ^\n
Syntax error on token "(", FormalParameter expected after this token\n
----------\n
------------ but was ------------
----------\n
1. ERROR in X.java (at line 4)\n
	import org.xml.sax.SAXException;\n
	       ^^^^^^^\n
The import org.xml cannot be resolved\n
----------\n
2. ERROR in X.java (at line 6)\n
	public void doSomething() throws FileNotFoundException, EOFException, SAXException{\n
	                                                                      ^^^^^^^^^^^^\n
SAXException cannot be resolved to a type\n
----------\n
3. ERROR in X.java (at line 19)\n
	catch (\n
	      ^\n
Syntax error on token "(", FormalParameter expected after this token\n
----------\n
--------- Difference is ----------
 expected:<... in X.java (at line []19)\n
	catch (\n
	  ...> but was:<... in X.java (at line [4)\n
	import org.xml.sax.SAXException;\n
	       ^^^^^^^\n
The import org.xml cannot be resolved\n
----------\n
2. ERROR in X.java (at line 6)\n
	public void doSomething() throws FileNotFoundException, EOFException, SAXException{\n
	                                                                      ^^^^^^^^^^^^\n
SAXException cannot be resolved to a type\n
----------\n
3. ERROR in X.java (at line ]19)\n
	catch (\n
	  ...>
	at org.eclipse.jdt.core.tests.junit.extension.TestCase.assertStringEquals(TestCase.java:226)
	at org.eclipse.jdt.core.tests.junit.extension.TestCase.assertEquals(TestCase.java:201)
	at org.eclipse.jdt.core.tests.compiler.regression.AbstractRegressionTest.runNegativeTest(AbstractRegressionTest.java:1123)
	at org.eclipse.jdt.core.tests.compiler.regression.AbstractRegressionTest.runNegativeTest(AbstractRegressionTest.java:999)
	at org.eclipse.jdt.core.tests.compiler.regression.AbstractRegressionTest.runNegativeTest(AbstractRegressionTest.java:978)
	at org.eclipse.jdt.core.tests.compiler.parser.ParserTest.test027(ParserTest.java:715)
	at java.lang.reflect.VMReflection.invokeMethod(VMReflection.java)
	at junit.extensions.TestDecorator.basicRun(TestDecorator.java:24)
	at junit.extensions.TestDecorator.run(TestDecorator.java:30)
	at org.eclipse.jdt.core.tests.util.CompilerTestSetup.run(CompilerTestSetup.java:48)
	at org.eclipse.test.EclipseTestRunner.run(EclipseTestRunner.java:354)
	at org.eclipse.test.EclipseTestRunner.run(EclipseTestRunner.java:206)
	at org.eclipse.test.CoreTestApplication.runTests(CoreTestApplication.java:35)
	at org.eclipse.test.CoreTestApplication.run(CoreTestApplication.java:31)
	at java.lang.reflect.VMReflection.invokeMethod(VMReflection.java)
	at org.eclipse.equinox.internal.app.EclipseAppContainer.callMethod(EclipseAppContainer.java:533)
	at org.eclipse.equinox.internal.app.EclipseAppHandle.run(EclipseAppHandle.java:155)
	at org.eclipse.core.runtime.internal.adaptor.EclipseAppLauncher.runApplication(EclipseAppLauncher.java:106)
	at org.eclipse.core.runtime.internal.adaptor.EclipseAppLauncher.start(EclipseAppLauncher.java:76)
	at org.eclipse.core.runtime.adaptor.EclipseStarter.run(EclipseStarter.java:363)
	at org.eclipse.core.runtime.adaptor.EclipseStarter.run(EclipseStarter.java:176)
	at java.lang.reflect.VMReflection.invokeMethod(VMReflection.java)
	at org.eclipse.equinox.launcher.Main.invokeFramework(Main.java:504)
	at org.eclipse.equinox.launcher.Main.basicRun(Main.java:443)
	at org.eclipse.equinox.launcher.Main.run(Main.java:1169)
	at org.eclipse.equinox.launcher.Main.main(Main.java:1144)
	at org.eclipse.core.launcher.Main.main(Main.java:30)

Testcase: org.eclipse.jdt.core.tests.compiler.parser.ParserTest.test027 - 1.5:
junit.framework.ComparisonFailure: Invalid problem log .
----------- Expected ------------
----------\n
1. ERROR in X.java (at line 19)\n
	catch (\n
	      ^\n
Syntax error on token "(", FormalParameter expected after this token\n
----------\n
------------ but was ------------
----------\n
1. ERROR in X.java (at line 4)\n
	import org.xml.sax.SAXException;\n
	       ^^^^^^^\n
The import org.xml cannot be resolved\n
----------\n
2. ERROR in X.java (at line 6)\n
	public void doSomething() throws FileNotFoundException, EOFException, SAXException{\n
	                                                                      ^^^^^^^^^^^^\n
SAXException cannot be resolved to a type\n
----------\n
3. ERROR in X.java (at line 19)\n
	catch (\n
	      ^\n
Syntax error on token "(", FormalParameter expected after this token\n
----------\n
--------- Difference is ----------
 expected:<... in X.java (at line []19)\n
	catch (\n
	  ...> but was:<... in X.java (at line [4)\n
	import org.xml.sax.SAXException;\n
	       ^^^^^^^\n
The import org.xml cannot be resolved\n
----------\n
2. ERROR in X.java (at line 6)\n
	public void doSomething() throws FileNotFoundException, EOFException, SAXException{\n
	                                                                      ^^^^^^^^^^^^\n
SAXException cannot be resolved to a type\n
----------\n
3. ERROR in X.java (at line ]19)\n
	catch (\n
	  ...>
	at org.eclipse.jdt.core.tests.junit.extension.TestCase.assertStringEquals(TestCase.java:225)
	at org.eclipse.jdt.core.tests.junit.extension.TestCase.assertEquals(TestCase.java:201)
	at org.eclipse.jdt.core.tests.compiler.regression.AbstractRegressionTest.runNegativeTest(AbstractRegressionTest.java:1123)
	at org.eclipse.jdt.core.tests.compiler.regression.AbstractRegressionTest.runNegativeTest(AbstractRegressionTest.java:999)
	at org.eclipse.jdt.core.tests.compiler.regression.AbstractRegressionTest.runNegativeTest(AbstractRegressionTest.java:978)
	at org.eclipse.jdt.core.tests.compiler.parser.ParserTest.test027(ParserTest.java:715)
	at java.lang.reflect.VMReflection.invokeMethod(VMReflection.java)
	at junit.extensions.TestDecorator.basicRun(TestDecorator.java:24)
	at junit.extensions.TestDecorator.run(TestDecorator.java:30)
	at org.eclipse.jdt.core.tests.util.CompilerTestSetup.run(CompilerTestSetup.java:48)
	at org.eclipse.test.EclipseTestRunner.run(EclipseTestRunner.java:354)
	at org.eclipse.test.EclipseTestRunner.run(EclipseTestRunner.java:206)
	at org.eclipse.test.CoreTestApplication.runTests(CoreTestApplication.java:35)
	at org.eclipse.test.CoreTestApplication.run(CoreTestApplication.java:31)
	at java.lang.reflect.VMReflection.invokeMethod(VMReflection.java)
	at org.eclipse.equinox.internal.app.EclipseAppContainer.callMethod(EclipseAppContainer.java:533)
	at org.eclipse.equinox.internal.app.EclipseAppHandle.run(EclipseAppHandle.java:155)
	at org.eclipse.core.runtime.internal.adaptor.EclipseAppLauncher.runApplication(EclipseAppLauncher.java:106)
	at org.eclipse.core.runtime.internal.adaptor.EclipseAppLauncher.start(EclipseAppLauncher.java:76)
	at org.eclipse.core.runtime.adaptor.EclipseStarter.run(EclipseStarter.java:363)
	at org.eclipse.core.runtime.adaptor.EclipseStarter.run(EclipseStarter.java:176)
	at java.lang.reflect.VMReflection.invokeMethod(VMReflection.java)
	at org.eclipse.equinox.launcher.Main.invokeFramework(Main.java:504)
	at org.eclipse.equinox.launcher.Main.basicRun(Main.java:443)
	at org.eclipse.equinox.launcher.Main.run(Main.java:1169)
	at org.eclipse.equinox.launcher.Main.main(Main.java:1144)
	at org.eclipse.core.launcher.Main.main(Main.java:30)

Testcase: org.eclipse.jdt.core.tests.compiler.regression.RuntimeTests.test0600_reflection - 1.3:
junit.framework.AssertionFailedError: Unexpected output running resulting class file for X.java:
--[START]--
SUCCESS
SUCCESS
---[END]---
	at org.eclipse.jdt.core.tests.compiler.regression.AbstractRegressionTest.runConformTest(AbstractRegressionTest.java:658)
	at org.eclipse.jdt.core.tests.compiler.regression.AbstractRegressionTest.runConformTest(AbstractRegressionTest.java:515)
	at org.eclipse.jdt.core.tests.compiler.regression.RuntimeTests.test0600_reflection(RuntimeTests.java:130)
	at java.lang.reflect.VMReflection.invokeMethod(VMReflection.java)
	at junit.extensions.TestDecorator.basicRun(TestDecorator.java:24)
	at junit.extensions.TestDecorator.run(TestDecorator.java:30)
	at org.eclipse.jdt.core.tests.util.CompilerTestSetup.run(CompilerTestSetup.java:48)
	at org.eclipse.test.EclipseTestRunner.run(EclipseTestRunner.java:354)
	at org.eclipse.test.EclipseTestRunner.run(EclipseTestRunner.java:206)
	at org.eclipse.test.CoreTestApplication.runTests(CoreTestApplication.java:35)
	at org.eclipse.test.CoreTestApplication.run(CoreTestApplication.java:31)
	at java.lang.reflect.VMReflection.invokeMethod(VMReflection.java)
	at org.eclipse.equinox.internal.app.EclipseAppContainer.callMethod(EclipseAppContainer.java:533)
	at org.eclipse.equinox.internal.app.EclipseAppHandle.run(EclipseAppHandle.java:155)
	at org.eclipse.core.runtime.internal.adaptor.EclipseAppLauncher.runApplication(EclipseAppLauncher.java:106)
	at org.eclipse.core.runtime.internal.adaptor.EclipseAppLauncher.start(EclipseAppLauncher.java:76)
	at org.eclipse.core.runtime.adaptor.EclipseStarter.run(EclipseStarter.java:363)
	at org.eclipse.core.runtime.adaptor.EclipseStarter.run(EclipseStarter.java:176)
	at java.lang.reflect.VMReflection.invokeMethod(VMReflection.java)
	at org.eclipse.equinox.launcher.Main.invokeFramework(Main.java:504)
	at org.eclipse.equinox.launcher.Main.basicRun(Main.java:443)
	at org.eclipse.equinox.launcher.Main.run(Main.java:1169)
	at org.eclipse.equinox.launcher.Main.main(Main.java:1144)
	at org.eclipse.core.launcher.Main.main(Main.java:30)

Testcase: org.eclipse.jdt.core.tests.compiler.regression.RuntimeTests.test0601_reflection - 1.3:
junit.framework.AssertionFailedError: Unexpected output running resulting class file for X.java:
--[START]--
SUCCESS
SUCCESS
---[END]---
	at org.eclipse.jdt.core.tests.compiler.regression.AbstractRegressionTest.runConformTest(AbstractRegressionTest.java:658)
	at org.eclipse.jdt.core.tests.compiler.regression.AbstractRegressionTest.runConformTest(AbstractRegressionTest.java:515)
	at org.eclipse.jdt.core.tests.compiler.regression.RuntimeTests.test0601_reflection(RuntimeTests.java:172)
	at java.lang.reflect.VMReflection.invokeMethod(VMReflection.java)
	at junit.extensions.TestDecorator.basicRun(TestDecorator.java:24)
	at junit.extensions.TestDecorator.run(TestDecorator.java:30)
	at org.eclipse.jdt.core.tests.util.CompilerTestSetup.run(CompilerTestSetup.java:48)
	at org.eclipse.test.EclipseTestRunner.run(EclipseTestRunner.java:354)
	at org.eclipse.test.EclipseTestRunner.run(EclipseTestRunner.java:206)
	at org.eclipse.test.CoreTestApplication.runTests(CoreTestApplication.java:35)
	at org.eclipse.test.CoreTestApplication.run(CoreTestApplication.java:31)
	at java.lang.reflect.VMReflection.invokeMethod(VMReflection.java)
	at org.eclipse.equinox.internal.app.EclipseAppContainer.callMethod(EclipseAppContainer.java:533)
	at org.eclipse.equinox.internal.app.EclipseAppHandle.run(EclipseAppHandle.java:155)
	at org.eclipse.core.runtime.internal.adaptor.EclipseAppLauncher.runApplication(EclipseAppLauncher.java:106)
	at org.eclipse.core.runtime.internal.adaptor.EclipseAppLauncher.start(EclipseAppLauncher.java:76)
	at org.eclipse.core.runtime.adaptor.EclipseStarter.run(EclipseStarter.java:363)
	at org.eclipse.core.runtime.adaptor.EclipseStarter.run(EclipseStarter.java:176)
	at java.lang.reflect.VMReflection.invokeMethod(VMReflection.java)
	at org.eclipse.equinox.launcher.Main.invokeFramework(Main.java:504)
	at org.eclipse.equinox.launcher.Main.basicRun(Main.java:443)
	at org.eclipse.equinox.launcher.Main.run(Main.java:1169)
	at org.eclipse.equinox.launcher.Main.main(Main.java:1144)
	at org.eclipse.core.launcher.Main.main(Main.java:30)

Testcase: org.eclipse.jdt.core.tests.compiler.regression.RuntimeTests.test0600_reflection - 1.4:
junit.framework.AssertionFailedError: Unexpected output running resulting class file for X.java:
--[START]--
SUCCESS
SUCCESS
---[END]---
	at org.eclipse.jdt.core.tests.compiler.regression.AbstractRegressionTest.runConformTest(AbstractRegressionTest.java:658)
	at org.eclipse.jdt.core.tests.compiler.regression.AbstractRegressionTest.runConformTest(AbstractRegressionTest.java:515)
	at org.eclipse.jdt.core.tests.compiler.regression.RuntimeTests.test0600_reflection(RuntimeTests.java:130)
	at java.lang.reflect.VMReflection.invokeMethod(VMReflection.java)
	at junit.extensions.TestDecorator.basicRun(TestDecorator.java:24)
	at junit.extensions.TestDecorator.run(TestDecorator.java:30)
	at org.eclipse.jdt.core.tests.util.CompilerTestSetup.run(CompilerTestSetup.java:48)
	at org.eclipse.test.EclipseTestRunner.run(EclipseTestRunner.java:354)
	at org.eclipse.test.EclipseTestRunner.run(EclipseTestRunner.java:206)
	at org.eclipse.test.CoreTestApplication.runTests(CoreTestApplication.java:35)
	at org.eclipse.test.CoreTestApplication.run(CoreTestApplication.java:31)
	at java.lang.reflect.VMReflection.invokeMethod(VMReflection.java)
	at org.eclipse.equinox.internal.app.EclipseAppContainer.callMethod(EclipseAppContainer.java:533)
	at org.eclipse.equinox.internal.app.EclipseAppHandle.run(EclipseAppHandle.java:155)
	at org.eclipse.core.runtime.internal.adaptor.EclipseAppLauncher.runApplication(EclipseAppLauncher.java:106)
	at org.eclipse.core.runtime.internal.adaptor.EclipseAppLauncher.start(EclipseAppLauncher.java:76)
	at org.eclipse.core.runtime.adaptor.EclipseStarter.run(EclipseStarter.java:363)
	at org.eclipse.core.runtime.adaptor.EclipseStarter.run(EclipseStarter.java:176)
	at java.lang.reflect.VMReflection.invokeMethod(VMReflection.java)
	at org.eclipse.equinox.launcher.Main.invokeFramework(Main.java:504)
	at org.eclipse.equinox.launcher.Main.basicRun(Main.java:443)
	at org.eclipse.equinox.launcher.Main.run(Main.java:1169)
	at org.eclipse.equinox.launcher.Main.main(Main.java:1144)
	at org.eclipse.core.launcher.Main.main(Main.java:30)

Testcase: org.eclipse.jdt.core.tests.compiler.regression.RuntimeTests.test0601_reflection - 1.4:
junit.framework.AssertionFailedError: Unexpected output running resulting class file for X.java:
--[START]--
SUCCESS
SUCCESS
---[END]---
	at org.eclipse.jdt.core.tests.compiler.regression.AbstractRegressionTest.runConformTest(AbstractRegressionTest.java:658)
	at org.eclipse.jdt.core.tests.compiler.regression.AbstractRegressionTest.runConformTest(AbstractRegressionTest.java:515)
	at org.eclipse.jdt.core.tests.compiler.regression.RuntimeTests.test0601_reflection(RuntimeTests.java:172)
	at java.lang.reflect.VMReflection.invokeMethod(VMReflection.java)
	at junit.extensions.TestDecorator.basicRun(TestDecorator.java:24)
	at junit.extensions.TestDecorator.run(TestDecorator.java:30)
	at org.eclipse.jdt.core.tests.util.CompilerTestSetup.run(CompilerTestSetup.java:48)
	at org.eclipse.test.EclipseTestRunner.run(EclipseTestRunner.java:354)
	at org.eclipse.test.EclipseTestRunner.run(EclipseTestRunner.java:206)
	at org.eclipse.test.CoreTestApplication.runTests(CoreTestApplication.java:35)
	at org.eclipse.test.CoreTestApplication.run(CoreTestApplication.java:31)
	at java.lang.reflect.VMReflection.invokeMethod(VMReflection.java)
	at org.eclipse.equinox.internal.app.EclipseAppContainer.callMethod(EclipseAppContainer.java:533)
	at org.eclipse.equinox.internal.app.EclipseAppHandle.run(EclipseAppHandle.java:155)
	at org.eclipse.core.runtime.internal.adaptor.EclipseAppLauncher.runApplication(EclipseAppLauncher.java:106)
	at org.eclipse.core.runtime.internal.adaptor.EclipseAppLauncher.start(EclipseAppLauncher.java:76)
	at org.eclipse.core.runtime.adaptor.EclipseStarter.run(EclipseStarter.java:363)
	at org.eclipse.core.runtime.adaptor.EclipseStarter.run(EclipseStarter.java:176)
	at java.lang.reflect.VMReflection.invokeMethod(VMReflection.java)
	at org.eclipse.equinox.launcher.Main.invokeFramework(Main.java:504)
	at org.eclipse.equinox.launcher.Main.basicRun(Main.java:443)
	at org.eclipse.equinox.launcher.Main.run(Main.java:1169)
	at org.eclipse.equinox.launcher.Main.main(Main.java:1144)
	at org.eclipse.core.launcher.Main.main(Main.java:30)

Testcase: org.eclipse.jdt.core.tests.compiler.regression.RuntimeTests.test0600_reflection - 1.5:
junit.framework.AssertionFailedError: Unexpected output running resulting class file for X.java:
--[START]--
SUCCESS
SUCCESS
---[END]---
	at org.eclipse.jdt.core.tests.compiler.regression.AbstractRegressionTest.runConformTest(AbstractRegressionTest.java:658)
	at org.eclipse.jdt.core.tests.compiler.regression.AbstractRegressionTest.runConformTest(AbstractRegressionTest.java:515)
	at org.eclipse.jdt.core.tests.compiler.regression.RuntimeTests.test0600_reflection(RuntimeTests.java:130)
	at java.lang.reflect.VMReflection.invokeMethod(VMReflection.java)
	at junit.extensions.TestDecorator.basicRun(TestDecorator.java:24)
	at junit.extensions.TestDecorator.run(TestDecorator.java:30)
	at org.eclipse.jdt.core.tests.util.CompilerTestSetup.run(CompilerTestSetup.java:48)
	at org.eclipse.test.EclipseTestRunner.run(EclipseTestRunner.java:354)
	at org.eclipse.test.EclipseTestRunner.run(EclipseTestRunner.java:206)
	at org.eclipse.test.CoreTestApplication.runTests(CoreTestApplication.java:35)
	at org.eclipse.test.CoreTestApplication.run(CoreTestApplication.java:31)
	at java.lang.reflect.VMReflection.invokeMethod(VMReflection.java)
	at org.eclipse.equinox.internal.app.EclipseAppContainer.callMethod(EclipseAppContainer.java:533)
	at org.eclipse.equinox.internal.app.EclipseAppHandle.run(EclipseAppHandle.java:155)
	at org.eclipse.core.runtime.internal.adaptor.EclipseAppLauncher.runApplication(EclipseAppLauncher.java:106)
	at org.eclipse.core.runtime.internal.adaptor.EclipseAppLauncher.start(EclipseAppLauncher.java:76)
	at org.eclipse.core.runtime.adaptor.EclipseStarter.run(EclipseStarter.java:363)
	at org.eclipse.core.runtime.adaptor.EclipseStarter.run(EclipseStarter.java:176)
	at java.lang.reflect.VMReflection.invokeMethod(VMReflection.java)
	at org.eclipse.equinox.launcher.Main.invokeFramework(Main.java:504)
	at org.eclipse.equinox.launcher.Main.basicRun(Main.java:443)
	at org.eclipse.equinox.launcher.Main.run(Main.java:1169)
	at org.eclipse.equinox.launcher.Main.main(Main.java:1144)
	at org.eclipse.core.launcher.Main.main(Main.java:30)

Testcase: org.eclipse.jdt.core.tests.compiler.regression.RuntimeTests.test0601_reflection - 1.5:
junit.framework.AssertionFailedError: Unexpected output running resulting class file for X.java:
--[START]--
SUCCESS
SUCCESS
---[END]---
	at org.eclipse.jdt.core.tests.compiler.regression.AbstractRegressionTest.runConformTest(AbstractRegressionTest.java:658)
	at org.eclipse.jdt.core.tests.compiler.regression.AbstractRegressionTest.runConformTest(AbstractRegressionTest.java:515)
	at org.eclipse.jdt.core.tests.compiler.regression.RuntimeTests.test0601_reflection(RuntimeTests.java:172)
	at java.lang.reflect.VMReflection.invokeMethod(VMReflection.java)
	at junit.extensions.TestDecorator.basicRun(TestDecorator.java:24)
	at junit.extensions.TestDecorator.run(TestDecorator.java:30)
	at org.eclipse.jdt.core.tests.util.CompilerTestSetup.run(CompilerTestSetup.java:48)
	at org.eclipse.test.EclipseTestRunner.run(EclipseTestRunner.java:354)
	at org.eclipse.test.EclipseTestRunner.run(EclipseTestRunner.java:206)
	at org.eclipse.test.CoreTestApplication.runTests(CoreTestApplication.java:35)
	at org.eclipse.test.CoreTestApplication.run(CoreTestApplication.java:31)
	at java.lang.reflect.VMReflection.invokeMethod(VMReflection.java)
	at org.eclipse.equinox.internal.app.EclipseAppContainer.callMethod(EclipseAppContainer.java:533)
	at org.eclipse.equinox.internal.app.EclipseAppHandle.run(EclipseAppHandle.java:155)
	at org.eclipse.core.runtime.internal.adaptor.EclipseAppLauncher.runApplication(EclipseAppLauncher.java:106)
	at org.eclipse.core.runtime.internal.adaptor.EclipseAppLauncher.start(EclipseAppLauncher.java:76)
	at org.eclipse.core.runtime.adaptor.EclipseStarter.run(EclipseStarter.java:363)
	at org.eclipse.core.runtime.adaptor.EclipseStarter.run(EclipseStarter.java:176)
	at java.lang.reflect.VMReflection.invokeMethod(VMReflection.java)
	at org.eclipse.equinox.launcher.Main.invokeFramework(Main.java:504)
	at org.eclipse.equinox.launcher.Main.basicRun(Main.java:443)
	at org.eclipse.equinox.launcher.Main.run(Main.java:1169)
	at org.eclipse.equinox.launcher.Main.main(Main.java:1144)
	at org.eclipse.core.launcher.Main.main(Main.java:30)

Testcase: org.eclipse.jdt.core.tests.compiler.regression.GenericTypeTest.test1095 - 1.5:
junit.framework.ComparisonFailure: Invalid problem log .
----------- Expected ------------
----------\n
1. ERROR in X.java (at line 11)\n
	Annot annotation = constructor.getAnnotation(Annot.class);\n
	                   ^^^^^^^^^^^^^^^^^^^^^^^^^^^^^^^^^^^^^^\n
Type mismatch: cannot convert from Annotation to Annot\n
----------\n
------------ but was ------------
--------- Difference is ----------
 expected:<[----------\n
1. ERROR in X.java (at line 11)\n
	Annot annotation = constructor.getAnnotation(Annot.class);\n
	                   ^^^^^^^^^^^^^^^^^^^^^^^^^^^^^^^^^^^^^^\n
Type mismatch: cannot convert from Annotation to Annot\n
----------\n
]> but was:<[]>
	at org.eclipse.jdt.core.tests.junit.extension.TestCase.assertStringEquals(TestCase.java:226)
	at org.eclipse.jdt.core.tests.junit.extension.TestCase.assertEquals(TestCase.java:201)
	at org.eclipse.jdt.core.tests.compiler.regression.AbstractRegressionTest.runNegativeTest(AbstractRegressionTest.java:1123)
	at org.eclipse.jdt.core.tests.compiler.regression.GenericTypeTest.test1095(GenericTypeTest.java:36331)
	at java.lang.reflect.VMReflection.invokeMethod(VMReflection.java)
	at junit.extensions.TestDecorator.basicRun(TestDecorator.java:24)
	at junit.extensions.TestDecorator.run(TestDecorator.java:30)
	at org.eclipse.jdt.core.tests.util.CompilerTestSetup.run(CompilerTestSetup.java:48)
	at org.eclipse.test.EclipseTestRunner.run(EclipseTestRunner.java:354)
	at org.eclipse.test.EclipseTestRunner.run(EclipseTestRunner.java:206)
	at org.eclipse.test.CoreTestApplication.runTests(CoreTestApplication.java:35)
	at org.eclipse.test.CoreTestApplication.run(CoreTestApplication.java:31)
	at java.lang.reflect.VMReflection.invokeMethod(VMReflection.java)
	at org.eclipse.equinox.internal.app.EclipseAppContainer.callMethod(EclipseAppContainer.java:533)
	at org.eclipse.equinox.internal.app.EclipseAppHandle.run(EclipseAppHandle.java:155)
	at org.eclipse.core.runtime.internal.adaptor.EclipseAppLauncher.runApplication(EclipseAppLauncher.java:106)
	at org.eclipse.core.runtime.internal.adaptor.EclipseAppLauncher.start(EclipseAppLauncher.java:76)
	at org.eclipse.core.runtime.adaptor.EclipseStarter.run(EclipseStarter.java:363)
	at org.eclipse.core.runtime.adaptor.EclipseStarter.run(EclipseStarter.java:176)
	at java.lang.reflect.VMReflection.invokeMethod(VMReflection.java)
	at org.eclipse.equinox.launcher.Main.invokeFramework(Main.java:504)
	at org.eclipse.equinox.launcher.Main.basicRun(Main.java:443)
	at org.eclipse.equinox.launcher.Main.run(Main.java:1169)
	at org.eclipse.equinox.launcher.Main.main(Main.java:1144)
	at org.eclipse.core.launcher.Main.main(Main.java:30)

Testcase: org.eclipse.jdt.core.tests.compiler.regression.GenericTypeTest.test1117 - 1.5:
junit.framework.AssertionFailedError: Unexpected output running resulting class file for X.java:
--[START]--
---[END]---
	at org.eclipse.jdt.core.tests.compiler.regression.AbstractRegressionTest.runConformTest(AbstractRegressionTest.java:658)
	at org.eclipse.jdt.core.tests.compiler.regression.AbstractRegressionTest.runConformTest(AbstractRegressionTest.java:564)
	at org.eclipse.jdt.core.tests.compiler.regression.GenericTypeTest.test1117(GenericTypeTest.java:37010)
	at java.lang.reflect.VMReflection.invokeMethod(VMReflection.java)
	at junit.extensions.TestDecorator.basicRun(TestDecorator.java:24)
	at junit.extensions.TestDecorator.run(TestDecorator.java:30)
	at org.eclipse.jdt.core.tests.util.CompilerTestSetup.run(CompilerTestSetup.java:48)
	at org.eclipse.test.EclipseTestRunner.run(EclipseTestRunner.java:354)
	at org.eclipse.test.EclipseTestRunner.run(EclipseTestRunner.java:206)
	at org.eclipse.test.CoreTestApplication.runTests(CoreTestApplication.java:35)
	at org.eclipse.test.CoreTestApplication.run(CoreTestApplication.java:31)
	at java.lang.reflect.VMReflection.invokeMethod(VMReflection.java)
	at org.eclipse.equinox.internal.app.EclipseAppContainer.callMethod(EclipseAppContainer.java:533)
	at org.eclipse.equinox.internal.app.EclipseAppHandle.run(EclipseAppHandle.java:155)
	at org.eclipse.core.runtime.internal.adaptor.EclipseAppLauncher.runApplication(EclipseAppLauncher.java:106)
	at org.eclipse.core.runtime.internal.adaptor.EclipseAppLauncher.start(EclipseAppLauncher.java:76)
	at org.eclipse.core.runtime.adaptor.EclipseStarter.run(EclipseStarter.java:363)
	at org.eclipse.core.runtime.adaptor.EclipseStarter.run(EclipseStarter.java:176)
	at java.lang.reflect.VMReflection.invokeMethod(VMReflection.java)
	at org.eclipse.equinox.launcher.Main.invokeFramework(Main.java:504)
	at org.eclipse.equinox.launcher.Main.basicRun(Main.java:443)
	at org.eclipse.equinox.launcher.Main.run(Main.java:1169)
	at org.eclipse.equinox.launcher.Main.main(Main.java:1144)
	at org.eclipse.core.launcher.Main.main(Main.java:30)

Testcase: org.eclipse.jdt.core.tests.compiler.regression.AnnotationTest.test218 - 1.5:
junit.framework.ComparisonFailure: Invalid problem log .
----------- Expected ------------
----------\n
1. WARNING in X.java (at line 4)\n
	void bar(Constructor constructor, Class<Ann> ann) {\n
	         ^^^^^^^^^^^\n
Constructor is a raw type. References to generic type Constructor<T> should be parameterized\n
----------\n
2. WARNING in X.java (at line 5)\n
	constructor.getAnnotation(ann).message();\n
	^^^^^^^^^^^^^^^^^^^^^^^^^^^^^^\n
Type safety: The method getAnnotation(Class) belongs to the raw type Constructor. References to generic type Constructor<T> should be parameterized\n
----------\n
3. ERROR in X.java (at line 5)\n
	constructor.getAnnotation(ann).message();\n
	                               ^^^^^^^\n
The method message() is undefined for the type Annotation\n
----------\n
------------ but was ------------
----------\n
1. WARNING in X.java (at line 1)\n
	import java.lang.annotation.Annotation;\n
	       ^^^^^^^^^^^^^^^^^^^^^^^^^^^^^^^\n
The import java.lang.annotation.Annotation is never used\n
----------\n
2. WARNING in X.java (at line 4)\n
	void bar(Constructor constructor, Class<Ann> ann) {\n
	         ^^^^^^^^^^^\n
Constructor is a raw type. References to generic type Constructor<T> should be parameterized\n
----------\n
--------- Difference is ----------
 expected:<... in X.java (at line [4)\n
	void bar(Constructor constructor, Class<Ann> ann) {\n
	         ^^^^^^^^^^^\n
Constructor is a raw type. References to generic type Constructor<T> should be parameterized\n
----------\n
2. WARNING in X.java (at line 5)\n
	constructor.getAnnotation(ann).message();\n
	^^^^^^^^^^^^^^^^^^^^^^^^^^^^^^\n
Type safety: The method getAnnotation(Class) belongs to the raw type Constructor. References to generic type Constructor<T> should be parameterized\n
----------\n
3. ERROR in X.java (at line 5)\n
	constructor.getAnnotation(ann).message();\n
	                               ^^^^^^^\n
The method message() is undefined for the type Annotation]\n
----------\n
> but was:<... in X.java (at line [1)\n
	import java.lang.annotation.Annotation;\n
	       ^^^^^^^^^^^^^^^^^^^^^^^^^^^^^^^\n
The import java.lang.annotation.Annotation is never used\n
----------\n
2. WARNING in X.java (at line 4)\n
	void bar(Constructor constructor, Class<Ann> ann) {\n
	         ^^^^^^^^^^^\n
Constructor is a raw type. References to generic type Constructor<T> should be parameterized]\n
----------\n
>
	at org.eclipse.jdt.core.tests.junit.extension.TestCase.assertStringEquals(TestCase.java:226)
	at org.eclipse.jdt.core.tests.junit.extension.TestCase.assertEquals(TestCase.java:201)
	at org.eclipse.jdt.core.tests.compiler.regression.AbstractRegressionTest.runNegativeTest(AbstractRegressionTest.java:1123)
	at org.eclipse.jdt.core.tests.compiler.regression.AbstractRegressionTest.runNegativeTest(AbstractRegressionTest.java:999)
	at org.eclipse.jdt.core.tests.compiler.regression.AbstractRegressionTest.runNegativeTest(AbstractRegressionTest.java:978)
	at org.eclipse.jdt.core.tests.compiler.regression.AnnotationTest.test218(AnnotationTest.java:7212)
	at java.lang.reflect.VMReflection.invokeMethod(VMReflection.java)
	at junit.extensions.TestDecorator.basicRun(TestDecorator.java:24)
	at junit.extensions.TestDecorator.run(TestDecorator.java:30)
	at org.eclipse.jdt.core.tests.util.CompilerTestSetup.run(CompilerTestSetup.java:48)
	at org.eclipse.test.EclipseTestRunner.run(EclipseTestRunner.java:354)
	at org.eclipse.test.EclipseTestRunner.run(EclipseTestRunner.java:206)
	at org.eclipse.test.CoreTestApplication.runTests(CoreTestApplication.java:35)
	at org.eclipse.test.CoreTestApplication.run(CoreTestApplication.java:31)
	at java.lang.reflect.VMReflection.invokeMethod(VMReflection.java)
	at org.eclipse.equinox.internal.app.EclipseAppContainer.callMethod(EclipseAppContainer.java:533)
	at org.eclipse.equinox.internal.app.EclipseAppHandle.run(EclipseAppHandle.java:155)
	at org.eclipse.core.runtime.internal.adaptor.EclipseAppLauncher.runApplication(EclipseAppLauncher.java:106)
	at org.eclipse.core.runtime.internal.adaptor.EclipseAppLauncher.start(EclipseAppLauncher.java:76)
	at org.eclipse.core.runtime.adaptor.EclipseStarter.run(EclipseStarter.java:363)
	at org.eclipse.core.runtime.adaptor.EclipseStarter.run(EclipseStarter.java:176)
	at java.lang.reflect.VMReflection.invokeMethod(VMReflection.java)
	at org.eclipse.equinox.launcher.Main.invokeFramework(Main.java:504)
	at org.eclipse.equinox.launcher.Main.basicRun(Main.java:443)
	at org.eclipse.equinox.launcher.Main.run(Main.java:1169)
	at org.eclipse.equinox.launcher.Main.main(Main.java:1144)
	at org.eclipse.core.launcher.Main.main(Main.java:30)

Testcase: org.eclipse.jdt.core.tests.eval.DebugEvaluationTest.test022 - 1.5:
junit.framework.AssertionFailedError: Value expected:<toto> but was:<null>
	at org.eclipse.jdt.core.tests.eval.EvaluationTest.failNotEquals(EvaluationTest.java:470)
	at org.eclipse.jdt.core.tests.eval.EvaluationTest.assertEquals(EvaluationTest.java:148)
	at org.eclipse.jdt.core.tests.eval.DebugEvaluationTest.test022(DebugEvaluationTest.java:1369)
	at java.lang.reflect.VMReflection.invokeMethod(VMReflection.java)
	at junit.extensions.TestDecorator.basicRun(TestDecorator.java:24)
	at junit.extensions.TestDecorator.run(TestDecorator.java:30)
	at org.eclipse.jdt.core.tests.util.CompilerTestSetup.run(CompilerTestSetup.java:48)
	at org.eclipse.test.EclipseTestRunner.run(EclipseTestRunner.java:354)
	at org.eclipse.test.EclipseTestRunner.run(EclipseTestRunner.java:206)
	at org.eclipse.test.CoreTestApplication.runTests(CoreTestApplication.java:35)
	at org.eclipse.test.CoreTestApplication.run(CoreTestApplication.java:31)
	at java.lang.reflect.VMReflection.invokeMethod(VMReflection.java)
	at org.eclipse.equinox.internal.app.EclipseAppContainer.callMethod(EclipseAppContainer.java:533)
	at org.eclipse.equinox.internal.app.EclipseAppHandle.run(EclipseAppHandle.java:155)
	at org.eclipse.core.runtime.internal.adaptor.EclipseAppLauncher.runApplication(EclipseAppLauncher.java:106)
	at org.eclipse.core.runtime.internal.adaptor.EclipseAppLauncher.start(EclipseAppLauncher.java:76)
	at org.eclipse.core.runtime.adaptor.EclipseStarter.run(EclipseStarter.java:363)
	at org.eclipse.core.runtime.adaptor.EclipseStarter.run(EclipseStarter.java:176)
	at java.lang.reflect.VMReflection.invokeMethod(VMReflection.java)
	at org.eclipse.equinox.launcher.Main.invokeFramework(Main.java:504)
	at org.eclipse.equinox.launcher.Main.basicRun(Main.java:443)
	at org.eclipse.equinox.launcher.Main.run(Main.java:1169)
	at org.eclipse.equinox.launcher.Main.main(Main.java:1144)
	at org.eclipse.core.launcher.Main.main(Main.java:30)

Testcase: org.eclipse.jdt.debug.tests.sourcelookup.ExternalArchiveSourceContainerTests.testArchiveSourceContainerMemento:
junit.framework.AssertionFailedError: Did not find JRE source archive
	at org.eclipse.jdt.debug.tests.sourcelookup.ExternalArchiveSourceContainerTests.getContainer(ExternalArchiveSourceContainerTests.java:56)
	at org.eclipse.jdt.debug.tests.sourcelookup.ExternalArchiveSourceContainerTests.testArchiveSourceContainerMemento(ExternalArchiveSourceContainerTests.java:81)
	at org.eclipse.jdt.debug.tests.AbstractDebugTest.runBare(AbstractDebugTest.java:1602)
	at org.eclipse.jdt.debug.tests.DebugSuite$1.run(DebugSuite.java:54)
	at java.lang.Thread.run(Thread.java:595)

Testcase: org.eclipse.jdt.debug.tests.sourcelookup.ExternalArchiveSourceContainerTests.testAutoDetectRootSourceLookupPositive:
junit.framework.AssertionFailedError: Did not find JRE source archive
	at org.eclipse.jdt.debug.tests.sourcelookup.ExternalArchiveSourceContainerTests.getContainer(ExternalArchiveSourceContainerTests.java:56)
	at org.eclipse.jdt.debug.tests.sourcelookup.ExternalArchiveSourceContainerTests.testAutoDetectRootSourceLookupPositive(ExternalArchiveSourceContainerTests.java:92)
	at org.eclipse.jdt.debug.tests.AbstractDebugTest.runBare(AbstractDebugTest.java:1602)
	at org.eclipse.jdt.debug.tests.DebugSuite$1.run(DebugSuite.java:54)
	at java.lang.Thread.run(Thread.java:595)

Testcase: org.eclipse.jdt.debug.tests.sourcelookup.ExternalArchiveSourceContainerTests.testAutoDetectRootSourceLookupNegative:
junit.framework.AssertionFailedError: Did not find JRE source archive
	at org.eclipse.jdt.debug.tests.sourcelookup.ExternalArchiveSourceContainerTests.getContainer(ExternalArchiveSourceContainerTests.java:56)
	at org.eclipse.jdt.debug.tests.sourcelookup.ExternalArchiveSourceContainerTests.testAutoDetectRootSourceLookupNegative(ExternalArchiveSourceContainerTests.java:100)
	at org.eclipse.jdt.debug.tests.AbstractDebugTest.runBare(AbstractDebugTest.java:1602)
	at org.eclipse.jdt.debug.tests.DebugSuite$1.run(DebugSuite.java:54)
	at java.lang.Thread.run(Thread.java:595)

Testcase: org.eclipse.jdt.debug.tests.sourcelookup.ExternalArchiveSourceContainerTests.testSourceLookupPositive:
junit.framework.AssertionFailedError: Did not find JRE source archive
	at org.eclipse.jdt.debug.tests.sourcelookup.ExternalArchiveSourceContainerTests.getContainer(ExternalArchiveSourceContainerTests.java:56)
	at org.eclipse.jdt.debug.tests.sourcelookup.ExternalArchiveSourceContainerTests.testSourceLookupPositive(ExternalArchiveSourceContainerTests.java:106)
	at org.eclipse.jdt.debug.tests.AbstractDebugTest.runBare(AbstractDebugTest.java:1602)
	at org.eclipse.jdt.debug.tests.DebugSuite$1.run(DebugSuite.java:54)
	at java.lang.Thread.run(Thread.java:595)

Testcase: org.eclipse.jdt.debug.tests.sourcelookup.ExternalArchiveSourceContainerTests.testSourceLookupNegative:
junit.framework.AssertionFailedError: Did not find JRE source archive
	at org.eclipse.jdt.debug.tests.sourcelookup.ExternalArchiveSourceContainerTests.getContainer(ExternalArchiveSourceContainerTests.java:56)
	at org.eclipse.jdt.debug.tests.sourcelookup.ExternalArchiveSourceContainerTests.testSourceLookupNegative(ExternalArchiveSourceContainerTests.java:114)
	at org.eclipse.jdt.debug.tests.AbstractDebugTest.runBare(AbstractDebugTest.java:1602)
	at org.eclipse.jdt.debug.tests.DebugSuite$1.run(DebugSuite.java:54)
	at java.lang.Thread.run(Thread.java:595)

Testcase: org.eclipse.jdt.debug.tests.sourcelookup.ExternalArchiveSourceContainerTests.testPartiallyQualifiedSourceLookupPositive:
junit.framework.AssertionFailedError: Did not find JRE source archive
	at org.eclipse.jdt.debug.tests.sourcelookup.ExternalArchiveSourceContainerTests.getContainer(ExternalArchiveSourceContainerTests.java:56)
	at org.eclipse.jdt.debug.tests.sourcelookup.ExternalArchiveSourceContainerTests.testPartiallyQualifiedSourceLookupPositive(ExternalArchiveSourceContainerTests.java:120)
	at org.eclipse.jdt.debug.tests.AbstractDebugTest.runBare(AbstractDebugTest.java:1602)
	at org.eclipse.jdt.debug.tests.DebugSuite$1.run(DebugSuite.java:54)
	at java.lang.Thread.run(Thread.java:595)

Testcase: org.eclipse.jdt.debug.tests.sourcelookup.ExternalArchiveSourceContainerTests.testAutoDetectUnqualifiedSourceLookupPositive:
junit.framework.AssertionFailedError: Did not find JRE source archive
	at org.eclipse.jdt.debug.tests.sourcelookup.ExternalArchiveSourceContainerTests.getContainer(ExternalArchiveSourceContainerTests.java:56)
	at org.eclipse.jdt.debug.tests.sourcelookup.ExternalArchiveSourceContainerTests.testAutoDetectUnqualifiedSourceLookupPositive(ExternalArchiveSourceContainerTests.java:128)
	at org.eclipse.jdt.debug.tests.AbstractDebugTest.runBare(AbstractDebugTest.java:1602)
	at org.eclipse.jdt.debug.tests.DebugSuite$1.run(DebugSuite.java:54)
	at java.lang.Thread.run(Thread.java:595)

Testcase: org.eclipse.jface.tests.viewers.SimpleVirtualLazyTreeViewerTest.testCreation:
junit.framework.AssertionFailedError: call to updateElement expected
	at org.eclipse.jface.tests.viewers.SimpleVirtualLazyTreeViewerTest.testCreation(SimpleVirtualLazyTreeViewerTest.java:108)
	at org.eclipse.test.EclipseTestRunner.run(EclipseTestRunner.java:354)
	at org.eclipse.test.EclipseTestRunner.run(EclipseTestRunner.java:206)
	at org.eclipse.test.CoreTestApplication.runTests(CoreTestApplication.java:35)
	at org.eclipse.test.CoreTestApplication.run(CoreTestApplication.java:31)
	at org.eclipse.equinox.internal.app.EclipseAppContainer.callMethod(EclipseAppContainer.java:533)
	at org.eclipse.equinox.internal.app.EclipseAppHandle.run(EclipseAppHandle.java:155)
	at org.eclipse.core.runtime.internal.adaptor.EclipseAppLauncher.runApplication(EclipseAppLauncher.java:106)
	at org.eclipse.core.runtime.internal.adaptor.EclipseAppLauncher.start(EclipseAppLauncher.java:76)
	at org.eclipse.core.runtime.adaptor.EclipseStarter.run(EclipseStarter.java:363)
	at org.eclipse.core.runtime.adaptor.EclipseStarter.run(EclipseStarter.java:176)
	at org.eclipse.equinox.launcher.Main.invokeFramework(Main.java:504)
	at org.eclipse.equinox.launcher.Main.basicRun(Main.java:443)
	at org.eclipse.equinox.launcher.Main.run(Main.java:1169)
	at org.eclipse.equinox.launcher.Main.main(Main.java:1144)
	at org.eclipse.core.launcher.Main.main(Main.java:30)

Testcase: org.eclipse.jface.tests.viewers.SimpleVirtualLazyTreeViewerTest.testRemoveAt:
junit.framework.AssertionFailedError: expected:<2> but was:<0>
	at org.eclipse.jface.tests.viewers.SimpleVirtualLazyTreeViewerTest.testRemoveAt(SimpleVirtualLazyTreeViewerTest.java:167)
	at org.eclipse.test.EclipseTestRunner.run(EclipseTestRunner.java:354)
	at org.eclipse.test.EclipseTestRunner.run(EclipseTestRunner.java:206)
	at org.eclipse.test.CoreTestApplication.runTests(CoreTestApplication.java:35)
	at org.eclipse.test.CoreTestApplication.run(CoreTestApplication.java:31)
	at org.eclipse.equinox.internal.app.EclipseAppContainer.callMethod(EclipseAppContainer.java:533)
	at org.eclipse.equinox.internal.app.EclipseAppHandle.run(EclipseAppHandle.java:155)
	at org.eclipse.core.runtime.internal.adaptor.EclipseAppLauncher.runApplication(EclipseAppLauncher.java:106)
	at org.eclipse.core.runtime.internal.adaptor.EclipseAppLauncher.start(EclipseAppLauncher.java:76)
	at org.eclipse.core.runtime.adaptor.EclipseStarter.run(EclipseStarter.java:363)
	at org.eclipse.core.runtime.adaptor.EclipseStarter.run(EclipseStarter.java:176)
	at org.eclipse.equinox.launcher.Main.invokeFramework(Main.java:504)
	at org.eclipse.equinox.launcher.Main.basicRun(Main.java:443)
	at org.eclipse.equinox.launcher.Main.run(Main.java:1169)
	at org.eclipse.equinox.launcher.Main.main(Main.java:1144)
	at org.eclipse.core.launcher.Main.main(Main.java:30)

Testcase: org.eclipse.jface.tests.viewers.VirtualLazyTreeViewerTest.testDeleteSibling:
junit.framework.AssertionFailedError: first child is visible
	at org.eclipse.jface.tests.viewers.StructuredViewerTest.testDeleteSibling(StructuredViewerTest.java:149)
	at org.eclipse.test.EclipseTestRunner.run(EclipseTestRunner.java:354)
	at org.eclipse.test.EclipseTestRunner.run(EclipseTestRunner.java:206)
	at org.eclipse.test.CoreTestApplication.runTests(CoreTestApplication.java:35)
	at org.eclipse.test.CoreTestApplication.run(CoreTestApplication.java:31)
	at org.eclipse.equinox.internal.app.EclipseAppContainer.callMethod(EclipseAppContainer.java:533)
	at org.eclipse.equinox.internal.app.EclipseAppHandle.run(EclipseAppHandle.java:155)
	at org.eclipse.core.runtime.internal.adaptor.EclipseAppLauncher.runApplication(EclipseAppLauncher.java:106)
	at org.eclipse.core.runtime.internal.adaptor.EclipseAppLauncher.start(EclipseAppLauncher.java:76)
	at org.eclipse.core.runtime.adaptor.EclipseStarter.run(EclipseStarter.java:363)
	at org.eclipse.core.runtime.adaptor.EclipseStarter.run(EclipseStarter.java:176)
	at org.eclipse.equinox.launcher.Main.invokeFramework(Main.java:504)
	at org.eclipse.equinox.launcher.Main.basicRun(Main.java:443)
	at org.eclipse.equinox.launcher.Main.run(Main.java:1169)
	at org.eclipse.equinox.launcher.Main.main(Main.java:1144)
	at org.eclipse.core.launcher.Main.main(Main.java:30)

Testcase: org.eclipse.jface.tests.viewers.VirtualLazyTreeViewerTest.testInsertSibling:
junit.framework.AssertionFailedError: new sibling is visible
	at org.eclipse.jface.tests.viewers.StructuredViewerTest.testInsertSibling(StructuredViewerTest.java:203)
	at org.eclipse.test.EclipseTestRunner.run(EclipseTestRunner.java:354)
	at org.eclipse.test.EclipseTestRunner.run(EclipseTestRunner.java:206)
	at org.eclipse.test.CoreTestApplication.runTests(CoreTestApplication.java:35)
	at org.eclipse.test.CoreTestApplication.run(CoreTestApplication.java:31)
	at org.eclipse.equinox.internal.app.EclipseAppContainer.callMethod(EclipseAppContainer.java:533)
	at org.eclipse.equinox.internal.app.EclipseAppHandle.run(EclipseAppHandle.java:155)
	at org.eclipse.core.runtime.internal.adaptor.EclipseAppLauncher.runApplication(EclipseAppLauncher.java:106)
	at org.eclipse.core.runtime.internal.adaptor.EclipseAppLauncher.start(EclipseAppLauncher.java:76)
	at org.eclipse.core.runtime.adaptor.EclipseStarter.run(EclipseStarter.java:363)
	at org.eclipse.core.runtime.adaptor.EclipseStarter.run(EclipseStarter.java:176)
	at org.eclipse.equinox.launcher.Main.invokeFramework(Main.java:504)
	at org.eclipse.equinox.launcher.Main.basicRun(Main.java:443)
	at org.eclipse.equinox.launcher.Main.run(Main.java:1169)
	at org.eclipse.equinox.launcher.Main.main(Main.java:1144)
	at org.eclipse.core.launcher.Main.main(Main.java:30)

Testcase: org.eclipse.jface.tests.viewers.VirtualLazyTreeViewerTest.testInsertSiblings:
junit.framework.AssertionFailedError: new siblings are visible
	at org.eclipse.jface.tests.viewers.StructuredViewerTest.testInsertSiblings(StructuredViewerTest.java:219)
	at org.eclipse.test.EclipseTestRunner.run(EclipseTestRunner.java:354)
	at org.eclipse.test.EclipseTestRunner.run(EclipseTestRunner.java:206)
	at org.eclipse.test.CoreTestApplication.runTests(CoreTestApplication.java:35)
	at org.eclipse.test.CoreTestApplication.run(CoreTestApplication.java:31)
	at org.eclipse.equinox.internal.app.EclipseAppContainer.callMethod(EclipseAppContainer.java:533)
	at org.eclipse.equinox.internal.app.EclipseAppHandle.run(EclipseAppHandle.java:155)
	at org.eclipse.core.runtime.internal.adaptor.EclipseAppLauncher.runApplication(EclipseAppLauncher.java:106)
	at org.eclipse.core.runtime.internal.adaptor.EclipseAppLauncher.start(EclipseAppLauncher.java:76)
	at org.eclipse.core.runtime.adaptor.EclipseStarter.run(EclipseStarter.java:363)
	at org.eclipse.core.runtime.adaptor.EclipseStarter.run(EclipseStarter.java:176)
	at org.eclipse.equinox.launcher.Main.invokeFramework(Main.java:504)
	at org.eclipse.equinox.launcher.Main.basicRun(Main.java:443)
	at org.eclipse.equinox.launcher.Main.run(Main.java:1169)
	at org.eclipse.equinox.launcher.Main.main(Main.java:1144)
	at org.eclipse.core.launcher.Main.main(Main.java:30)

Testcase: org.eclipse.jface.tests.viewers.VirtualLazyTreeViewerTest.testSomeChildrenChanged:
junit.framework.AssertionFailedError: new sibling is visible
	at org.eclipse.jface.tests.viewers.StructuredViewerTest.bulkChange(StructuredViewerTest.java:103)
	at org.eclipse.jface.tests.viewers.StructuredViewerTest.testSomeChildrenChanged(StructuredViewerTest.java:358)
	at org.eclipse.test.EclipseTestRunner.run(EclipseTestRunner.java:354)
	at org.eclipse.test.EclipseTestRunner.run(EclipseTestRunner.java:206)
	at org.eclipse.test.CoreTestApplication.runTests(CoreTestApplication.java:35)
	at org.eclipse.test.CoreTestApplication.run(CoreTestApplication.java:31)
	at org.eclipse.equinox.internal.app.EclipseAppContainer.callMethod(EclipseAppContainer.java:533)
	at org.eclipse.equinox.internal.app.EclipseAppHandle.run(EclipseAppHandle.java:155)
	at org.eclipse.core.runtime.internal.adaptor.EclipseAppLauncher.runApplication(EclipseAppLauncher.java:106)
	at org.eclipse.core.runtime.internal.adaptor.EclipseAppLauncher.start(EclipseAppLauncher.java:76)
	at org.eclipse.core.runtime.adaptor.EclipseStarter.run(EclipseStarter.java:363)
	at org.eclipse.core.runtime.adaptor.EclipseStarter.run(EclipseStarter.java:176)
	at org.eclipse.equinox.launcher.Main.invokeFramework(Main.java:504)
	at org.eclipse.equinox.launcher.Main.basicRun(Main.java:443)
	at org.eclipse.equinox.launcher.Main.run(Main.java:1169)
	at org.eclipse.equinox.launcher.Main.main(Main.java:1144)
	at org.eclipse.core.launcher.Main.main(Main.java:30)

Testcase: org.eclipse.jface.tests.viewers.VirtualLazyTreeViewerTest.testWorldChanged:
junit.framework.AssertionFailedError: new sibling is visible
	at org.eclipse.jface.tests.viewers.StructuredViewerTest.bulkChange(StructuredViewerTest.java:103)
	at org.eclipse.jface.tests.viewers.StructuredViewerTest.testWorldChanged(StructuredViewerTest.java:381)
	at org.eclipse.test.EclipseTestRunner.run(EclipseTestRunner.java:354)
	at org.eclipse.test.EclipseTestRunner.run(EclipseTestRunner.java:206)
	at org.eclipse.test.CoreTestApplication.runTests(CoreTestApplication.java:35)
	at org.eclipse.test.CoreTestApplication.run(CoreTestApplication.java:31)
	at org.eclipse.equinox.internal.app.EclipseAppContainer.callMethod(EclipseAppContainer.java:533)
	at org.eclipse.equinox.internal.app.EclipseAppHandle.run(EclipseAppHandle.java:155)
	at org.eclipse.core.runtime.internal.adaptor.EclipseAppLauncher.runApplication(EclipseAppLauncher.java:106)
	at org.eclipse.core.runtime.internal.adaptor.EclipseAppLauncher.start(EclipseAppLauncher.java:76)
	at org.eclipse.core.runtime.adaptor.EclipseStarter.run(EclipseStarter.java:363)
	at org.eclipse.core.runtime.adaptor.EclipseStarter.run(EclipseStarter.java:176)
	at org.eclipse.equinox.launcher.Main.invokeFramework(Main.java:504)
	at org.eclipse.equinox.launcher.Main.basicRun(Main.java:443)
	at org.eclipse.equinox.launcher.Main.run(Main.java:1169)
	at org.eclipse.equinox.launcher.Main.main(Main.java:1144)
	at org.eclipse.core.launcher.Main.main(Main.java:30)

Testcase: org.eclipse.jface.tests.viewers.VirtualTableViewerTest.testFilter:
junit.framework.AssertionFailedError: filtered count expected:<5> but was:<0>
	at org.eclipse.jface.tests.viewers.VirtualTableViewerTest.testFilter(VirtualTableViewerTest.java:114)
	at org.eclipse.test.EclipseTestRunner.run(EclipseTestRunner.java:354)
	at org.eclipse.test.EclipseTestRunner.run(EclipseTestRunner.java:206)
	at org.eclipse.test.CoreTestApplication.runTests(CoreTestApplication.java:35)
	at org.eclipse.test.CoreTestApplication.run(CoreTestApplication.java:31)
	at org.eclipse.equinox.internal.app.EclipseAppContainer.callMethod(EclipseAppContainer.java:533)
	at org.eclipse.equinox.internal.app.EclipseAppHandle.run(EclipseAppHandle.java:155)
	at org.eclipse.core.runtime.internal.adaptor.EclipseAppLauncher.runApplication(EclipseAppLauncher.java:106)
	at org.eclipse.core.runtime.internal.adaptor.EclipseAppLauncher.start(EclipseAppLauncher.java:76)
	at org.eclipse.core.runtime.adaptor.EclipseStarter.run(EclipseStarter.java:363)
	at org.eclipse.core.runtime.adaptor.EclipseStarter.run(EclipseStarter.java:176)
	at org.eclipse.equinox.launcher.Main.invokeFramework(Main.java:504)
	at org.eclipse.equinox.launcher.Main.basicRun(Main.java:443)
	at org.eclipse.equinox.launcher.Main.run(Main.java:1169)
	at org.eclipse.equinox.launcher.Main.main(Main.java:1144)
	at org.eclipse.core.launcher.Main.main(Main.java:30)

Testcase: org.eclipse.jface.tests.viewers.VirtualTableViewerTest.testSetFilters:
junit.framework.AssertionFailedError: 2 filters count expected:<1> but was:<0>
	at org.eclipse.jface.tests.viewers.VirtualTableViewerTest.testSetFilters(VirtualTableViewerTest.java:128)
	at org.eclipse.test.EclipseTestRunner.run(EclipseTestRunner.java:354)
	at org.eclipse.test.EclipseTestRunner.run(EclipseTestRunner.java:206)
	at org.eclipse.test.CoreTestApplication.runTests(CoreTestApplication.java:35)
	at org.eclipse.test.CoreTestApplication.run(CoreTestApplication.java:31)
	at org.eclipse.equinox.internal.app.EclipseAppContainer.callMethod(EclipseAppContainer.java:533)
	at org.eclipse.equinox.internal.app.EclipseAppHandle.run(EclipseAppHandle.java:155)
	at org.eclipse.core.runtime.internal.adaptor.EclipseAppLauncher.runApplication(EclipseAppLauncher.java:106)
	at org.eclipse.core.runtime.internal.adaptor.EclipseAppLauncher.start(EclipseAppLauncher.java:76)
	at org.eclipse.core.runtime.adaptor.EclipseStarter.run(EclipseStarter.java:363)
	at org.eclipse.core.runtime.adaptor.EclipseStarter.run(EclipseStarter.java:176)
	at org.eclipse.equinox.launcher.Main.invokeFramework(Main.java:504)
	at org.eclipse.equinox.launcher.Main.basicRun(Main.java:443)
	at org.eclipse.equinox.launcher.Main.run(Main.java:1169)
	at org.eclipse.equinox.launcher.Main.main(Main.java:1144)
	at org.eclipse.core.launcher.Main.main(Main.java:30)

Testcase: org.eclipse.jface.tests.viewers.VirtualTableViewerTest.testRenameWithFilter:
junit.framework.AssertionFailedError: changed sibling is not visible
	at org.eclipse.jface.tests.viewers.VirtualTableViewerTest.testRenameWithFilter(VirtualTableViewerTest.java:222)
	at org.eclipse.test.EclipseTestRunner.run(EclipseTestRunner.java:354)
	at org.eclipse.test.EclipseTestRunner.run(EclipseTestRunner.java:206)
	at org.eclipse.test.CoreTestApplication.runTests(CoreTestApplication.java:35)
	at org.eclipse.test.CoreTestApplication.run(CoreTestApplication.java:31)
	at org.eclipse.equinox.internal.app.EclipseAppContainer.callMethod(EclipseAppContainer.java:533)
	at org.eclipse.equinox.internal.app.EclipseAppHandle.run(EclipseAppHandle.java:155)
	at org.eclipse.core.runtime.internal.adaptor.EclipseAppLauncher.runApplication(EclipseAppLauncher.java:106)
	at org.eclipse.core.runtime.internal.adaptor.EclipseAppLauncher.start(EclipseAppLauncher.java:76)
	at org.eclipse.core.runtime.adaptor.EclipseStarter.run(EclipseStarter.java:363)
	at org.eclipse.core.runtime.adaptor.EclipseStarter.run(EclipseStarter.java:176)
	at org.eclipse.equinox.launcher.Main.invokeFramework(Main.java:504)
	at org.eclipse.equinox.launcher.Main.basicRun(Main.java:443)
	at org.eclipse.equinox.launcher.Main.run(Main.java:1169)
	at org.eclipse.equinox.launcher.Main.main(Main.java:1144)
	at org.eclipse.core.launcher.Main.main(Main.java:30)

Testcase: org.eclipse.jface.tests.viewers.VirtualTableViewerTest.testRenameWithSorter:
junit.framework.ComparisonFailure: sorted first expected:<0-[0 name-999]9> but was:<0-[9 name-]9>
	at org.eclipse.jface.tests.viewers.VirtualTableViewerTest.testRenameWithSorter(VirtualTableViewerTest.java:245)
	at org.eclipse.test.EclipseTestRunner.run(EclipseTestRunner.java:354)
	at org.eclipse.test.EclipseTestRunner.run(EclipseTestRunner.java:206)
	at org.eclipse.test.CoreTestApplication.runTests(CoreTestApplication.java:35)
	at org.eclipse.test.CoreTestApplication.run(CoreTestApplication.java:31)
	at org.eclipse.equinox.internal.app.EclipseAppContainer.callMethod(EclipseAppContainer.java:533)
	at org.eclipse.equinox.internal.app.EclipseAppHandle.run(EclipseAppHandle.java:155)
	at org.eclipse.core.runtime.internal.adaptor.EclipseAppLauncher.runApplication(EclipseAppLauncher.java:106)
	at org.eclipse.core.runtime.internal.adaptor.EclipseAppLauncher.start(EclipseAppLauncher.java:76)
	at org.eclipse.core.runtime.adaptor.EclipseStarter.run(EclipseStarter.java:363)
	at org.eclipse.core.runtime.adaptor.EclipseStarter.run(EclipseStarter.java:176)
	at org.eclipse.equinox.launcher.Main.invokeFramework(Main.java:504)
	at org.eclipse.equinox.launcher.Main.basicRun(Main.java:443)
	at org.eclipse.equinox.launcher.Main.run(Main.java:1169)
	at org.eclipse.equinox.launcher.Main.main(Main.java:1144)
	at org.eclipse.core.launcher.Main.main(Main.java:30)

Unexpected errors (34):

Testcase: org.eclipse.core.tests.filesystem.FileStoreTest.testCopyAcrossVolumes:
org.eclipse.core.runtime.CoreException: Parent of resource: d:\temp is marked as read-only.
	at org.eclipse.core.internal.filesystem.Policy.error(Policy.java:55)
	at org.eclipse.core.internal.filesystem.local.LocalFile.checkReadOnlyParent(LocalFile.java:66)
	at org.eclipse.core.internal.filesystem.local.LocalFile.mkdir(LocalFile.java:255)
	at org.eclipse.core.tests.filesystem.FileStoreTest.createDir(FileStoreTest.java:44)
	at org.eclipse.core.tests.filesystem.FileStoreTest.createDir(FileStoreTest.java:52)
	at org.eclipse.core.tests.filesystem.FileStoreTest.testCopyAcrossVolumes(FileStoreTest.java:94)
	at org.eclipse.test.EclipseTestRunner.run(EclipseTestRunner.java:354)
	at org.eclipse.test.EclipseTestRunner.run(EclipseTestRunner.java:206)
	at org.eclipse.test.CoreTestApplication.runTests(CoreTestApplication.java:35)
	at org.eclipse.test.CoreTestApplication.run(CoreTestApplication.java:31)
	at org.eclipse.equinox.internal.app.EclipseAppContainer.callMethod(EclipseAppContainer.java:533)
	at org.eclipse.equinox.internal.app.EclipseAppHandle.run(EclipseAppHandle.java:155)
	at org.eclipse.core.runtime.internal.adaptor.EclipseAppLauncher.runApplication(EclipseAppLauncher.java:106)
	at org.eclipse.core.runtime.internal.adaptor.EclipseAppLauncher.start(EclipseAppLauncher.java:76)
	at org.eclipse.core.runtime.adaptor.EclipseStarter.run(EclipseStarter.java:363)
	at org.eclipse.core.runtime.adaptor.EclipseStarter.run(EclipseStarter.java:176)
	at org.eclipse.equinox.launcher.Main.invokeFramework(Main.java:504)
	at org.eclipse.equinox.launcher.Main.basicRun(Main.java:443)
	at org.eclipse.equinox.launcher.Main.run(Main.java:1169)
	at org.eclipse.equinox.launcher.Main.main(Main.java:1144)
	at org.eclipse.core.launcher.Main.main(Main.java:30)

Testcase: org.eclipse.core.tests.filesystem.FileStoreTest.testCopyFileAcrossVolumes:
org.eclipse.core.runtime.CoreException: Parent of resource: d:\temp is marked as read-only.
	at org.eclipse.core.internal.filesystem.Policy.error(Policy.java:55)
	at org.eclipse.core.internal.filesystem.local.LocalFile.checkReadOnlyParent(LocalFile.java:66)
	at org.eclipse.core.internal.filesystem.local.LocalFile.mkdir(LocalFile.java:255)
	at org.eclipse.core.tests.filesystem.FileStoreTest.createDir(FileStoreTest.java:44)
	at org.eclipse.core.tests.filesystem.FileStoreTest.createDir(FileStoreTest.java:52)
	at org.eclipse.core.tests.filesystem.FileStoreTest.testCopyFileAcrossVolumes(FileStoreTest.java:238)
	at org.eclipse.test.EclipseTestRunner.run(EclipseTestRunner.java:354)
	at org.eclipse.test.EclipseTestRunner.run(EclipseTestRunner.java:206)
	at org.eclipse.test.CoreTestApplication.runTests(CoreTestApplication.java:35)
	at org.eclipse.test.CoreTestApplication.run(CoreTestApplication.java:31)
	at org.eclipse.equinox.internal.app.EclipseAppContainer.callMethod(EclipseAppContainer.java:533)
	at org.eclipse.equinox.internal.app.EclipseAppHandle.run(EclipseAppHandle.java:155)
	at org.eclipse.core.runtime.internal.adaptor.EclipseAppLauncher.runApplication(EclipseAppLauncher.java:106)
	at org.eclipse.core.runtime.internal.adaptor.EclipseAppLauncher.start(EclipseAppLauncher.java:76)
	at org.eclipse.core.runtime.adaptor.EclipseStarter.run(EclipseStarter.java:363)
	at org.eclipse.core.runtime.adaptor.EclipseStarter.run(EclipseStarter.java:176)
	at org.eclipse.equinox.launcher.Main.invokeFramework(Main.java:504)
	at org.eclipse.equinox.launcher.Main.basicRun(Main.java:443)
	at org.eclipse.equinox.launcher.Main.run(Main.java:1169)
	at org.eclipse.equinox.launcher.Main.main(Main.java:1144)
	at org.eclipse.core.launcher.Main.main(Main.java:30)

Testcase: org.eclipse.core.tests.filesystem.FileStoreTest.testMoveAcrossVolumes:
org.eclipse.core.runtime.CoreException: Parent of resource: d:\temp is marked as read-only.
	at org.eclipse.core.internal.filesystem.Policy.error(Policy.java:55)
	at org.eclipse.core.internal.filesystem.local.LocalFile.checkReadOnlyParent(LocalFile.java:66)
	at org.eclipse.core.internal.filesystem.local.LocalFile.mkdir(LocalFile.java:255)
	at org.eclipse.core.tests.filesystem.FileStoreTest.createDir(FileStoreTest.java:44)
	at org.eclipse.core.tests.filesystem.FileStoreTest.createDir(FileStoreTest.java:52)
	at org.eclipse.core.tests.filesystem.FileStoreTest.testMoveAcrossVolumes(FileStoreTest.java:409)
	at org.eclipse.test.EclipseTestRunner.run(EclipseTestRunner.java:354)
	at org.eclipse.test.EclipseTestRunner.run(EclipseTestRunner.java:206)
	at org.eclipse.test.CoreTestApplication.runTests(CoreTestApplication.java:35)
	at org.eclipse.test.CoreTestApplication.run(CoreTestApplication.java:31)
	at org.eclipse.equinox.internal.app.EclipseAppContainer.callMethod(EclipseAppContainer.java:533)
	at org.eclipse.equinox.internal.app.EclipseAppHandle.run(EclipseAppHandle.java:155)
	at org.eclipse.core.runtime.internal.adaptor.EclipseAppLauncher.runApplication(EclipseAppLauncher.java:106)
	at org.eclipse.core.runtime.internal.adaptor.EclipseAppLauncher.start(EclipseAppLauncher.java:76)
	at org.eclipse.core.runtime.adaptor.EclipseStarter.run(EclipseStarter.java:363)
	at org.eclipse.core.runtime.adaptor.EclipseStarter.run(EclipseStarter.java:176)
	at org.eclipse.equinox.launcher.Main.invokeFramework(Main.java:504)
	at org.eclipse.equinox.launcher.Main.basicRun(Main.java:443)
	at org.eclipse.equinox.launcher.Main.run(Main.java:1169)
	at org.eclipse.equinox.launcher.Main.main(Main.java:1144)
	at org.eclipse.core.launcher.Main.main(Main.java:30)

Testcase: org.eclipse.jdt.core.tests.model.SortCompilationUnitElementsTests.test001:
java.lang.VerifyError: com/ibm/icu/impl/ICUResourceBundleImpl/getBundle()Lcom/ibm/icu/impl/ICUResourceBundle;, pass: 2, instr: 32, reason: incompartible argument
	at java.lang.ClassLoader.defineClass0(ClassLoader.java)
	at java.lang.ClassLoader.defineClass(ClassLoader.java:438)
	at org.eclipse.osgi.internal.baseadaptor.DefaultClassLoader.defineClass(DefaultClassLoader.java:161)
	at org.eclipse.osgi.baseadaptor.loader.ClasspathManager.defineClass(ClasspathManager.java:501)
	at org.eclipse.osgi.baseadaptor.loader.ClasspathManager.findClassImpl(ClasspathManager.java:471)
	at org.eclipse.osgi.baseadaptor.loader.ClasspathManager.findLocalClassImpl(ClasspathManager.java:430)
	at org.eclipse.osgi.baseadaptor.loader.ClasspathManager.findLocalClass(ClasspathManager.java:413)
	at org.eclipse.osgi.internal.baseadaptor.DefaultClassLoader.findLocalClass(DefaultClassLoader.java:189)
	at org.eclipse.osgi.framework.internal.core.BundleLoader.findLocalClass(BundleLoader.java)
	at org.eclipse.osgi.framework.internal.core.BundleLoader.findClassInternal(BundleLoader.java:408)
	at org.eclipse.osgi.framework.internal.core.BundleLoader.findClass(BundleLoader.java:369)
	at org.eclipse.osgi.framework.internal.core.BundleLoader.findClass(BundleLoader.java:357)
	at org.eclipse.osgi.internal.baseadaptor.DefaultClassLoader.loadClass(DefaultClassLoader.java)
	at java.lang.ClassLoader.loadClass(ClassLoader.java)
	at com.ibm.icu.impl.ICUResourceBundle.instantiateBundle(ICUResourceBundle.java:1195)
	at com.ibm.icu.impl.ICUResourceBundle.getBundleInstance(ICUResourceBundle.java:1163)
	at com.ibm.icu.util.UResourceBundle.getRootType(UResourceBundle.java:418)
	at com.ibm.icu.util.UResourceBundle.instantiateBundle(UResourceBundle.java:466)
	at com.ibm.icu.util.UResourceBundle.getBundleInstance(UResourceBundle.java:123)
	at com.ibm.icu.util.UResourceBundle.getBundleInstance(UResourceBundle.java:105)
	at com.ibm.icu.util.UResourceBundle.getBundleInstance(UResourceBundle.java:186)
	at com.ibm.icu.text.RuleBasedCollator.<clinit>(RuleBasedCollator.java:1764)
	at com.ibm.icu.text.CollatorServiceShim$1$CollatorFactory.handleCreate(CollatorServiceShim.java:114)
	at com.ibm.icu.impl.ICULocaleService$LocaleKeyFactory.create(ICULocaleService.java:378)
	at com.ibm.icu.impl.ICUService.getKey(ICUService.java:463)
	at com.ibm.icu.impl.ICUService.getKey(ICUService.java:383)
	at com.ibm.icu.impl.ICULocaleService.get(ICULocaleService.java:72)
	at com.ibm.icu.impl.ICULocaleService.get(ICULocaleService.java:56)
	at com.ibm.icu.text.CollatorServiceShim.getInstance(CollatorServiceShim.java:34)
	at com.ibm.icu.text.Collator.getInstance(Collator.java:483)
	at com.ibm.icu.text.Collator.getInstance(Collator.java:315)
	at org.eclipse.jdt.core.tests.model.DefaultJavaElementComparator.<init>(DefaultJavaElementComparator.java:157)
	at org.eclipse.jdt.core.tests.model.SortCompilationUnitElementsTests.sortUnit(SortCompilationUnitElementsTests.java:64)
	at org.eclipse.jdt.core.tests.model.SortCompilationUnitElementsTests.sortUnit(SortCompilationUnitElementsTests.java:53)
	at org.eclipse.jdt.core.tests.model.SortCompilationUnitElementsTests.test001(SortCompilationUnitElementsTests.java:257)
	at java.lang.reflect.VMReflection.invokeMethod(VMReflection.java)
	at org.eclipse.jdt.core.tests.model.SuiteOfTestCases$Suite.runTest(SuiteOfTestCases.java:99)
	at org.eclipse.jdt.core.tests.model.SuiteOfTestCases$Suite.superRun(SuiteOfTestCases.java:83)
	at org.eclipse.jdt.core.tests.model.SuiteOfTestCases$1.protect(SuiteOfTestCases.java:71)
	at org.eclipse.jdt.core.tests.model.SuiteOfTestCases$Suite.run(SuiteOfTestCases.java:80)
	at org.eclipse.test.EclipseTestRunner.run(EclipseTestRunner.java:354)
	at org.eclipse.test.EclipseTestRunner.run(EclipseTestRunner.java:206)
	at org.eclipse.test.CoreTestApplication.runTests(CoreTestApplication.java:35)
	at org.eclipse.test.CoreTestApplication.run(CoreTestApplication.java:31)
	at java.lang.reflect.VMReflection.invokeMethod(VMReflection.java)
	at org.eclipse.equinox.internal.app.EclipseAppContainer.callMethod(EclipseAppContainer.java:533)
	at org.eclipse.equinox.internal.app.EclipseAppHandle.run(EclipseAppHandle.java:155)
	at org.eclipse.core.runtime.internal.adaptor.EclipseAppLauncher.runApplication(EclipseAppLauncher.java:106)
	at org.eclipse.core.runtime.internal.adaptor.EclipseAppLauncher.start(EclipseAppLauncher.java:76)
	at org.eclipse.core.runtime.adaptor.EclipseStarter.run(EclipseStarter.java:363)
	at org.eclipse.core.runtime.adaptor.EclipseStarter.run(EclipseStarter.java:176)
	at java.lang.reflect.VMReflection.invokeMethod(VMReflection.java)
	at org.eclipse.equinox.launcher.Main.invokeFramework(Main.java:504)
	at org.eclipse.equinox.launcher.Main.basicRun(Main.java:443)
	at org.eclipse.equinox.launcher.Main.run(Main.java:1169)
	at org.eclipse.equinox.launcher.Main.main(Main.java:1144)
	at org.eclipse.core.launcher.Main.main(Main.java:30)

Testcase: org.eclipse.jdt.core.tests.model.SortCompilationUnitElementsTests.test002:
java.lang.NoClassDefFoundError: com/ibm/icu/text/RuleBasedCollator
	at com.ibm.icu.text.CollatorServiceShim$1$CollatorFactory.handleCreate(CollatorServiceShim.java:114)
	at com.ibm.icu.impl.ICULocaleService$LocaleKeyFactory.create(ICULocaleService.java:378)
	at com.ibm.icu.impl.ICUService.getKey(ICUService.java:463)
	at com.ibm.icu.impl.ICUService.getKey(ICUService.java:383)
	at com.ibm.icu.impl.ICULocaleService.get(ICULocaleService.java:72)
	at com.ibm.icu.impl.ICULocaleService.get(ICULocaleService.java:56)
	at com.ibm.icu.text.CollatorServiceShim.getInstance(CollatorServiceShim.java:34)
	at com.ibm.icu.text.Collator.getInstance(Collator.java:483)
	at com.ibm.icu.text.Collator.getInstance(Collator.java:315)
	at org.eclipse.jdt.core.tests.model.DefaultJavaElementComparator.<init>(DefaultJavaElementComparator.java:157)
	at org.eclipse.jdt.core.tests.model.SortCompilationUnitElementsTests.sortUnit(SortCompilationUnitElementsTests.java:64)
	at org.eclipse.jdt.core.tests.model.SortCompilationUnitElementsTests.sortUnit(SortCompilationUnitElementsTests.java:53)
	at org.eclipse.jdt.core.tests.model.SortCompilationUnitElementsTests.test002(SortCompilationUnitElementsTests.java:323)
	at java.lang.reflect.VMReflection.invokeMethod(VMReflection.java)
	at org.eclipse.jdt.core.tests.model.SuiteOfTestCases$Suite.runTest(SuiteOfTestCases.java:99)
	at org.eclipse.jdt.core.tests.model.SuiteOfTestCases$Suite.superRun(SuiteOfTestCases.java:83)
	at org.eclipse.jdt.core.tests.model.SuiteOfTestCases$1.protect(SuiteOfTestCases.java:71)
	at org.eclipse.jdt.core.tests.model.SuiteOfTestCases$Suite.run(SuiteOfTestCases.java:80)
	at org.eclipse.test.EclipseTestRunner.run(EclipseTestRunner.java:354)
	at org.eclipse.test.EclipseTestRunner.run(EclipseTestRunner.java:206)
	at org.eclipse.test.CoreTestApplication.runTests(CoreTestApplication.java:35)
	at org.eclipse.test.CoreTestApplication.run(CoreTestApplication.java:31)
	at java.lang.reflect.VMReflection.invokeMethod(VMReflection.java)
	at org.eclipse.equinox.internal.app.EclipseAppContainer.callMethod(EclipseAppContainer.java:533)
	at org.eclipse.equinox.internal.app.EclipseAppHandle.run(EclipseAppHandle.java:155)
	at org.eclipse.core.runtime.internal.adaptor.EclipseAppLauncher.runApplication(EclipseAppLauncher.java:106)
	at org.eclipse.core.runtime.internal.adaptor.EclipseAppLauncher.start(EclipseAppLauncher.java:76)
	at org.eclipse.core.runtime.adaptor.EclipseStarter.run(EclipseStarter.java:363)
	at org.eclipse.core.runtime.adaptor.EclipseStarter.run(EclipseStarter.java:176)
	at java.lang.reflect.VMReflection.invokeMethod(VMReflection.java)
	at org.eclipse.equinox.launcher.Main.invokeFramework(Main.java:504)
	at org.eclipse.equinox.launcher.Main.basicRun(Main.java:443)
	at org.eclipse.equinox.launcher.Main.run(Main.java:1169)
	at org.eclipse.equinox.launcher.Main.main(Main.java:1144)
	at org.eclipse.core.launcher.Main.main(Main.java:30)

Testcase: org.eclipse.jdt.core.tests.model.SortCompilationUnitElementsTests.test003:
java.lang.NoClassDefFoundError: com/ibm/icu/text/RuleBasedCollator
	at com.ibm.icu.text.CollatorServiceShim$1$CollatorFactory.handleCreate(CollatorServiceShim.java:114)
	at com.ibm.icu.impl.ICULocaleService$LocaleKeyFactory.create(ICULocaleService.java:378)
	at com.ibm.icu.impl.ICUService.getKey(ICUService.java:463)
	at com.ibm.icu.impl.ICUService.getKey(ICUService.java:383)
	at com.ibm.icu.impl.ICULocaleService.get(ICULocaleService.java:72)
	at com.ibm.icu.impl.ICULocaleService.get(ICULocaleService.java:56)
	at com.ibm.icu.text.CollatorServiceShim.getInstance(CollatorServiceShim.java:34)
	at com.ibm.icu.text.Collator.getInstance(Collator.java:483)
	at com.ibm.icu.text.Collator.getInstance(Collator.java:315)
	at org.eclipse.jdt.core.tests.model.DefaultJavaElementComparator.<init>(DefaultJavaElementComparator.java:157)
	at org.eclipse.jdt.core.tests.model.SortCompilationUnitElementsTests.sortUnit(SortCompilationUnitElementsTests.java:64)
	at org.eclipse.jdt.core.tests.model.SortCompilationUnitElementsTests.sortUnit(SortCompilationUnitElementsTests.java:53)
	at org.eclipse.jdt.core.tests.model.SortCompilationUnitElementsTests.test003(SortCompilationUnitElementsTests.java:421)
	at java.lang.reflect.VMReflection.invokeMethod(VMReflection.java)
	at org.eclipse.jdt.core.tests.model.SuiteOfTestCases$Suite.runTest(SuiteOfTestCases.java:99)
	at org.eclipse.jdt.core.tests.model.SuiteOfTestCases$Suite.superRun(SuiteOfTestCases.java:83)
	at org.eclipse.jdt.core.tests.model.SuiteOfTestCases$1.protect(SuiteOfTestCases.java:71)
	at org.eclipse.jdt.core.tests.model.SuiteOfTestCases$Suite.run(SuiteOfTestCases.java:80)
	at org.eclipse.test.EclipseTestRunner.run(EclipseTestRunner.java:354)
	at org.eclipse.test.EclipseTestRunner.run(EclipseTestRunner.java:206)
	at org.eclipse.test.CoreTestApplication.runTests(CoreTestApplication.java:35)
	at org.eclipse.test.CoreTestApplication.run(CoreTestApplication.java:31)
	at java.lang.reflect.VMReflection.invokeMethod(VMReflection.java)
	at org.eclipse.equinox.internal.app.EclipseAppContainer.callMethod(EclipseAppContainer.java:533)
	at org.eclipse.equinox.internal.app.EclipseAppHandle.run(EclipseAppHandle.java:155)
	at org.eclipse.core.runtime.internal.adaptor.EclipseAppLauncher.runApplication(EclipseAppLauncher.java:106)
	at org.eclipse.core.runtime.internal.adaptor.EclipseAppLauncher.start(EclipseAppLauncher.java:76)
	at org.eclipse.core.runtime.adaptor.EclipseStarter.run(EclipseStarter.java:363)
	at org.eclipse.core.runtime.adaptor.EclipseStarter.run(EclipseStarter.java:176)
	at java.lang.reflect.VMReflection.invokeMethod(VMReflection.java)
	at org.eclipse.equinox.launcher.Main.invokeFramework(Main.java:504)
	at org.eclipse.equinox.launcher.Main.basicRun(Main.java:443)
	at org.eclipse.equinox.launcher.Main.run(Main.java:1169)
	at org.eclipse.equinox.launcher.Main.main(Main.java:1144)
	at org.eclipse.core.launcher.Main.main(Main.java:30)

Testcase: org.eclipse.jdt.core.tests.model.SortCompilationUnitElementsTests.test004:
java.lang.NoClassDefFoundError: com/ibm/icu/text/RuleBasedCollator
	at com.ibm.icu.text.CollatorServiceShim$1$CollatorFactory.handleCreate(CollatorServiceShim.java:114)
	at com.ibm.icu.impl.ICULocaleService$LocaleKeyFactory.create(ICULocaleService.java:378)
	at com.ibm.icu.impl.ICUService.getKey(ICUService.java:463)
	at com.ibm.icu.impl.ICUService.getKey(ICUService.java:383)
	at com.ibm.icu.impl.ICULocaleService.get(ICULocaleService.java:72)
	at com.ibm.icu.impl.ICULocaleService.get(ICULocaleService.java:56)
	at com.ibm.icu.text.CollatorServiceShim.getInstance(CollatorServiceShim.java:34)
	at com.ibm.icu.text.Collator.getInstance(Collator.java:483)
	at com.ibm.icu.text.Collator.getInstance(Collator.java:315)
	at org.eclipse.jdt.core.tests.model.DefaultJavaElementComparator.<init>(DefaultJavaElementComparator.java:157)
	at org.eclipse.jdt.core.tests.model.SortCompilationUnitElementsTests.sortUnit(SortCompilationUnitElementsTests.java:64)
	at org.eclipse.jdt.core.tests.model.SortCompilationUnitElementsTests.sortUnit(SortCompilationUnitElementsTests.java:53)
	at org.eclipse.jdt.core.tests.model.SortCompilationUnitElementsTests.test004(SortCompilationUnitElementsTests.java:504)
	at java.lang.reflect.VMReflection.invokeMethod(VMReflection.java)
	at org.eclipse.jdt.core.tests.model.SuiteOfTestCases$Suite.runTest(SuiteOfTestCases.java:99)
	at org.eclipse.jdt.core.tests.model.SuiteOfTestCases$Suite.superRun(SuiteOfTestCases.java:83)
	at org.eclipse.jdt.core.tests.model.SuiteOfTestCases$1.protect(SuiteOfTestCases.java:71)
	at org.eclipse.jdt.core.tests.model.SuiteOfTestCases$Suite.run(SuiteOfTestCases.java:80)
	at org.eclipse.test.EclipseTestRunner.run(EclipseTestRunner.java:354)
	at org.eclipse.test.EclipseTestRunner.run(EclipseTestRunner.java:206)
	at org.eclipse.test.CoreTestApplication.runTests(CoreTestApplication.java:35)
	at org.eclipse.test.CoreTestApplication.run(CoreTestApplication.java:31)
	at java.lang.reflect.VMReflection.invokeMethod(VMReflection.java)
	at org.eclipse.equinox.internal.app.EclipseAppContainer.callMethod(EclipseAppContainer.java:533)
	at org.eclipse.equinox.internal.app.EclipseAppHandle.run(EclipseAppHandle.java:155)
	at org.eclipse.core.runtime.internal.adaptor.EclipseAppLauncher.runApplication(EclipseAppLauncher.java:106)
	at org.eclipse.core.runtime.internal.adaptor.EclipseAppLauncher.start(EclipseAppLauncher.java:76)
	at org.eclipse.core.runtime.adaptor.EclipseStarter.run(EclipseStarter.java:363)
	at org.eclipse.core.runtime.adaptor.EclipseStarter.run(EclipseStarter.java:176)
	at java.lang.reflect.VMReflection.invokeMethod(VMReflection.java)
	at org.eclipse.equinox.launcher.Main.invokeFramework(Main.java:504)
	at org.eclipse.equinox.launcher.Main.basicRun(Main.java:443)
	at org.eclipse.equinox.launcher.Main.run(Main.java:1169)
	at org.eclipse.equinox.launcher.Main.main(Main.java:1144)
	at org.eclipse.core.launcher.Main.main(Main.java:30)

Testcase: org.eclipse.jdt.core.tests.model.SortCompilationUnitElementsTests.test005:
java.lang.NoClassDefFoundError: com/ibm/icu/text/RuleBasedCollator
	at com.ibm.icu.text.CollatorServiceShim$1$CollatorFactory.handleCreate(CollatorServiceShim.java:114)
	at com.ibm.icu.impl.ICULocaleService$LocaleKeyFactory.create(ICULocaleService.java:378)
	at com.ibm.icu.impl.ICUService.getKey(ICUService.java:463)
	at com.ibm.icu.impl.ICUService.getKey(ICUService.java:383)
	at com.ibm.icu.impl.ICULocaleService.get(ICULocaleService.java:72)
	at com.ibm.icu.impl.ICULocaleService.get(ICULocaleService.java:56)
	at com.ibm.icu.text.CollatorServiceShim.getInstance(CollatorServiceShim.java:34)
	at com.ibm.icu.text.Collator.getInstance(Collator.java:483)
	at com.ibm.icu.text.Collator.getInstance(Collator.java:315)
	at org.eclipse.jdt.core.tests.model.DefaultJavaElementComparator.<init>(DefaultJavaElementComparator.java:157)
	at org.eclipse.jdt.core.tests.model.SortCompilationUnitElementsTests.sortUnit(SortCompilationUnitElementsTests.java:64)
	at org.eclipse.jdt.core.tests.model.SortCompilationUnitElementsTests.sortUnit(SortCompilationUnitElementsTests.java:53)
	at org.eclipse.jdt.core.tests.model.SortCompilationUnitElementsTests.test005(SortCompilationUnitElementsTests.java:532)
	at java.lang.reflect.VMReflection.invokeMethod(VMReflection.java)
	at org.eclipse.jdt.core.tests.model.SuiteOfTestCases$Suite.runTest(SuiteOfTestCases.java:99)
	at org.eclipse.jdt.core.tests.model.SuiteOfTestCases$Suite.superRun(SuiteOfTestCases.java:83)
	at org.eclipse.jdt.core.tests.model.SuiteOfTestCases$1.protect(SuiteOfTestCases.java:71)
	at org.eclipse.jdt.core.tests.model.SuiteOfTestCases$Suite.run(SuiteOfTestCases.java:80)
	at org.eclipse.test.EclipseTestRunner.run(EclipseTestRunner.java:354)
	at org.eclipse.test.EclipseTestRunner.run(EclipseTestRunner.java:206)
	at org.eclipse.test.CoreTestApplication.runTests(CoreTestApplication.java:35)
	at org.eclipse.test.CoreTestApplication.run(CoreTestApplication.java:31)
	at java.lang.reflect.VMReflection.invokeMethod(VMReflection.java)
	at org.eclipse.equinox.internal.app.EclipseAppContainer.callMethod(EclipseAppContainer.java:533)
	at org.eclipse.equinox.internal.app.EclipseAppHandle.run(EclipseAppHandle.java:155)
	at org.eclipse.core.runtime.internal.adaptor.EclipseAppLauncher.runApplication(EclipseAppLauncher.java:106)
	at org.eclipse.core.runtime.internal.adaptor.EclipseAppLauncher.start(EclipseAppLauncher.java:76)
	at org.eclipse.core.runtime.adaptor.EclipseStarter.run(EclipseStarter.java:363)
	at org.eclipse.core.runtime.adaptor.EclipseStarter.run(EclipseStarter.java:176)
	at java.lang.reflect.VMReflection.invokeMethod(VMReflection.java)
	at org.eclipse.equinox.launcher.Main.invokeFramework(Main.java:504)
	at org.eclipse.equinox.launcher.Main.basicRun(Main.java:443)
	at org.eclipse.equinox.launcher.Main.run(Main.java:1169)
	at org.eclipse.equinox.launcher.Main.main(Main.java:1144)
	at org.eclipse.core.launcher.Main.main(Main.java:30)

Testcase: org.eclipse.jdt.core.tests.model.SortCompilationUnitElementsTests.test006:
java.lang.NoClassDefFoundError: com/ibm/icu/text/RuleBasedCollator
	at com.ibm.icu.text.CollatorServiceShim$1$CollatorFactory.handleCreate(CollatorServiceShim.java:114)
	at com.ibm.icu.impl.ICULocaleService$LocaleKeyFactory.create(ICULocaleService.java:378)
	at com.ibm.icu.impl.ICUService.getKey(ICUService.java:463)
	at com.ibm.icu.impl.ICUService.getKey(ICUService.java:383)
	at com.ibm.icu.impl.ICULocaleService.get(ICULocaleService.java:72)
	at com.ibm.icu.impl.ICULocaleService.get(ICULocaleService.java:56)
	at com.ibm.icu.text.CollatorServiceShim.getInstance(CollatorServiceShim.java:34)
	at com.ibm.icu.text.Collator.getInstance(Collator.java:483)
	at com.ibm.icu.text.Collator.getInstance(Collator.java:315)
	at org.eclipse.jdt.core.tests.model.DefaultJavaElementComparator.<init>(DefaultJavaElementComparator.java:157)
	at org.eclipse.jdt.core.tests.model.SortCompilationUnitElementsTests.sortUnit(SortCompilationUnitElementsTests.java:64)
	at org.eclipse.jdt.core.tests.model.SortCompilationUnitElementsTests.sortUnit(SortCompilationUnitElementsTests.java:53)
	at org.eclipse.jdt.core.tests.model.SortCompilationUnitElementsTests.test006(SortCompilationUnitElementsTests.java:564)
	at java.lang.reflect.VMReflection.invokeMethod(VMReflection.java)
	at org.eclipse.jdt.core.tests.model.SuiteOfTestCases$Suite.runTest(SuiteOfTestCases.java:99)
	at org.eclipse.jdt.core.tests.model.SuiteOfTestCases$Suite.superRun(SuiteOfTestCases.java:83)
	at org.eclipse.jdt.core.tests.model.SuiteOfTestCases$1.protect(SuiteOfTestCases.java:71)
	at org.eclipse.jdt.core.tests.model.SuiteOfTestCases$Suite.run(SuiteOfTestCases.java:80)
	at org.eclipse.test.EclipseTestRunner.run(EclipseTestRunner.java:354)
	at org.eclipse.test.EclipseTestRunner.run(EclipseTestRunner.java:206)
	at org.eclipse.test.CoreTestApplication.runTests(CoreTestApplication.java:35)
	at org.eclipse.test.CoreTestApplication.run(CoreTestApplication.java:31)
	at java.lang.reflect.VMReflection.invokeMethod(VMReflection.java)
	at org.eclipse.equinox.internal.app.EclipseAppContainer.callMethod(EclipseAppContainer.java:533)
	at org.eclipse.equinox.internal.app.EclipseAppHandle.run(EclipseAppHandle.java:155)
	at org.eclipse.core.runtime.internal.adaptor.EclipseAppLauncher.runApplication(EclipseAppLauncher.java:106)
	at org.eclipse.core.runtime.internal.adaptor.EclipseAppLauncher.start(EclipseAppLauncher.java:76)
	at org.eclipse.core.runtime.adaptor.EclipseStarter.run(EclipseStarter.java:363)
	at org.eclipse.core.runtime.adaptor.EclipseStarter.run(EclipseStarter.java:176)
	at java.lang.reflect.VMReflection.invokeMethod(VMReflection.java)
	at org.eclipse.equinox.launcher.Main.invokeFramework(Main.java:504)
	at org.eclipse.equinox.launcher.Main.basicRun(Main.java:443)
	at org.eclipse.equinox.launcher.Main.run(Main.java:1169)
	at org.eclipse.equinox.launcher.Main.main(Main.java:1144)
	at org.eclipse.core.launcher.Main.main(Main.java:30)

Testcase: org.eclipse.jdt.core.tests.model.SortCompilationUnitElementsTests.test007:
java.lang.NoClassDefFoundError: com/ibm/icu/text/RuleBasedCollator
	at com.ibm.icu.text.CollatorServiceShim$1$CollatorFactory.handleCreate(CollatorServiceShim.java:114)
	at com.ibm.icu.impl.ICULocaleService$LocaleKeyFactory.create(ICULocaleService.java:378)
	at com.ibm.icu.impl.ICUService.getKey(ICUService.java:463)
	at com.ibm.icu.impl.ICUService.getKey(ICUService.java:383)
	at com.ibm.icu.impl.ICULocaleService.get(ICULocaleService.java:72)
	at com.ibm.icu.impl.ICULocaleService.get(ICULocaleService.java:56)
	at com.ibm.icu.text.CollatorServiceShim.getInstance(CollatorServiceShim.java:34)
	at com.ibm.icu.text.Collator.getInstance(Collator.java:483)
	at com.ibm.icu.text.Collator.getInstance(Collator.java:315)
	at org.eclipse.jdt.core.tests.model.DefaultJavaElementComparator.<init>(DefaultJavaElementComparator.java:157)
	at org.eclipse.jdt.core.tests.model.SortCompilationUnitElementsTests.sortUnit(SortCompilationUnitElementsTests.java:64)
	at org.eclipse.jdt.core.tests.model.SortCompilationUnitElementsTests.sortUnit(SortCompilationUnitElementsTests.java:53)
	at org.eclipse.jdt.core.tests.model.SortCompilationUnitElementsTests.test007(SortCompilationUnitElementsTests.java:596)
	at java.lang.reflect.VMReflection.invokeMethod(VMReflection.java)
	at org.eclipse.jdt.core.tests.model.SuiteOfTestCases$Suite.runTest(SuiteOfTestCases.java:99)
	at org.eclipse.jdt.core.tests.model.SuiteOfTestCases$Suite.superRun(SuiteOfTestCases.java:83)
	at org.eclipse.jdt.core.tests.model.SuiteOfTestCases$1.protect(SuiteOfTestCases.java:71)
	at org.eclipse.jdt.core.tests.model.SuiteOfTestCases$Suite.run(SuiteOfTestCases.java:80)
	at org.eclipse.test.EclipseTestRunner.run(EclipseTestRunner.java:354)
	at org.eclipse.test.EclipseTestRunner.run(EclipseTestRunner.java:206)
	at org.eclipse.test.CoreTestApplication.runTests(CoreTestApplication.java:35)
	at org.eclipse.test.CoreTestApplication.run(CoreTestApplication.java:31)
	at java.lang.reflect.VMReflection.invokeMethod(VMReflection.java)
	at org.eclipse.equinox.internal.app.EclipseAppContainer.callMethod(EclipseAppContainer.java:533)
	at org.eclipse.equinox.internal.app.EclipseAppHandle.run(EclipseAppHandle.java:155)
	at org.eclipse.core.runtime.internal.adaptor.EclipseAppLauncher.runApplication(EclipseAppLauncher.java:106)
	at org.eclipse.core.runtime.internal.adaptor.EclipseAppLauncher.start(EclipseAppLauncher.java:76)
	at org.eclipse.core.runtime.adaptor.EclipseStarter.run(EclipseStarter.java:363)
	at org.eclipse.core.runtime.adaptor.EclipseStarter.run(EclipseStarter.java:176)
	at java.lang.reflect.VMReflection.invokeMethod(VMReflection.java)
	at org.eclipse.equinox.launcher.Main.invokeFramework(Main.java:504)
	at org.eclipse.equinox.launcher.Main.basicRun(Main.java:443)
	at org.eclipse.equinox.launcher.Main.run(Main.java:1169)
	at org.eclipse.equinox.launcher.Main.main(Main.java:1144)
	at org.eclipse.core.launcher.Main.main(Main.java:30)

Testcase: org.eclipse.jdt.core.tests.model.SortCompilationUnitElementsTests.test008:
java.lang.NoClassDefFoundError: com/ibm/icu/text/RuleBasedCollator
	at com.ibm.icu.text.CollatorServiceShim$1$CollatorFactory.handleCreate(CollatorServiceShim.java:114)
	at com.ibm.icu.impl.ICULocaleService$LocaleKeyFactory.create(ICULocaleService.java:378)
	at com.ibm.icu.impl.ICUService.getKey(ICUService.java:463)
	at com.ibm.icu.impl.ICUService.getKey(ICUService.java:383)
	at com.ibm.icu.impl.ICULocaleService.get(ICULocaleService.java:72)
	at com.ibm.icu.impl.ICULocaleService.get(ICULocaleService.java:56)
	at com.ibm.icu.text.CollatorServiceShim.getInstance(CollatorServiceShim.java:34)
	at com.ibm.icu.text.Collator.getInstance(Collator.java:483)
	at com.ibm.icu.text.Collator.getInstance(Collator.java:315)
	at org.eclipse.jdt.core.tests.model.DefaultJavaElementComparator.<init>(DefaultJavaElementComparator.java:157)
	at org.eclipse.jdt.core.tests.model.SortCompilationUnitElementsTests.sortUnit(SortCompilationUnitElementsTests.java:64)
	at org.eclipse.jdt.core.tests.model.SortCompilationUnitElementsTests.sortUnit(SortCompilationUnitElementsTests.java:53)
	at org.eclipse.jdt.core.tests.model.SortCompilationUnitElementsTests.test008(SortCompilationUnitElementsTests.java:629)
	at java.lang.reflect.VMReflection.invokeMethod(VMReflection.java)
	at org.eclipse.jdt.core.tests.model.SuiteOfTestCases$Suite.runTest(SuiteOfTestCases.java:99)
	at org.eclipse.jdt.core.tests.model.SuiteOfTestCases$Suite.superRun(SuiteOfTestCases.java:83)
	at org.eclipse.jdt.core.tests.model.SuiteOfTestCases$1.protect(SuiteOfTestCases.java:71)
	at org.eclipse.jdt.core.tests.model.SuiteOfTestCases$Suite.run(SuiteOfTestCases.java:80)
	at org.eclipse.test.EclipseTestRunner.run(EclipseTestRunner.java:354)
	at org.eclipse.test.EclipseTestRunner.run(EclipseTestRunner.java:206)
	at org.eclipse.test.CoreTestApplication.runTests(CoreTestApplication.java:35)
	at org.eclipse.test.CoreTestApplication.run(CoreTestApplication.java:31)
	at java.lang.reflect.VMReflection.invokeMethod(VMReflection.java)
	at org.eclipse.equinox.internal.app.EclipseAppContainer.callMethod(EclipseAppContainer.java:533)
	at org.eclipse.equinox.internal.app.EclipseAppHandle.run(EclipseAppHandle.java:155)
	at org.eclipse.core.runtime.internal.adaptor.EclipseAppLauncher.runApplication(EclipseAppLauncher.java:106)
	at org.eclipse.core.runtime.internal.adaptor.EclipseAppLauncher.start(EclipseAppLauncher.java:76)
	at org.eclipse.core.runtime.adaptor.EclipseStarter.run(EclipseStarter.java:363)
	at org.eclipse.core.runtime.adaptor.EclipseStarter.run(EclipseStarter.java:176)
	at java.lang.reflect.VMReflection.invokeMethod(VMReflection.java)
	at org.eclipse.equinox.launcher.Main.invokeFramework(Main.java:504)
	at org.eclipse.equinox.launcher.Main.basicRun(Main.java:443)
	at org.eclipse.equinox.launcher.Main.run(Main.java:1169)
	at org.eclipse.equinox.launcher.Main.main(Main.java:1144)
	at org.eclipse.core.launcher.Main.main(Main.java:30)

Testcase: org.eclipse.jdt.core.tests.model.SortCompilationUnitElementsTests.test009:
java.lang.NoClassDefFoundError: com/ibm/icu/text/RuleBasedCollator
	at com.ibm.icu.text.CollatorServiceShim$1$CollatorFactory.handleCreate(CollatorServiceShim.java:114)
	at com.ibm.icu.impl.ICULocaleService$LocaleKeyFactory.create(ICULocaleService.java:378)
	at com.ibm.icu.impl.ICUService.getKey(ICUService.java:463)
	at com.ibm.icu.impl.ICUService.getKey(ICUService.java:383)
	at com.ibm.icu.impl.ICULocaleService.get(ICULocaleService.java:72)
	at com.ibm.icu.impl.ICULocaleService.get(ICULocaleService.java:56)
	at com.ibm.icu.text.CollatorServiceShim.getInstance(CollatorServiceShim.java:34)
	at com.ibm.icu.text.Collator.getInstance(Collator.java:483)
	at com.ibm.icu.text.Collator.getInstance(Collator.java:315)
	at org.eclipse.jdt.core.tests.model.DefaultJavaElementComparator.<init>(DefaultJavaElementComparator.java:157)
	at org.eclipse.jdt.core.tests.model.SortCompilationUnitElementsTests.sortUnit(SortCompilationUnitElementsTests.java:64)
	at org.eclipse.jdt.core.tests.model.SortCompilationUnitElementsTests.sortUnit(SortCompilationUnitElementsTests.java:61)
	at org.eclipse.jdt.core.tests.model.SortCompilationUnitElementsTests.test009(SortCompilationUnitElementsTests.java:731)
	at java.lang.reflect.VMReflection.invokeMethod(VMReflection.java)
	at org.eclipse.jdt.core.tests.model.SuiteOfTestCases$Suite.runTest(SuiteOfTestCases.java:99)
	at org.eclipse.jdt.core.tests.model.SuiteOfTestCases$Suite.superRun(SuiteOfTestCases.java:83)
	at org.eclipse.jdt.core.tests.model.SuiteOfTestCases$1.protect(SuiteOfTestCases.java:71)
	at org.eclipse.jdt.core.tests.model.SuiteOfTestCases$Suite.run(SuiteOfTestCases.java:80)
	at org.eclipse.test.EclipseTestRunner.run(EclipseTestRunner.java:354)
	at org.eclipse.test.EclipseTestRunner.run(EclipseTestRunner.java:206)
	at org.eclipse.test.CoreTestApplication.runTests(CoreTestApplication.java:35)
	at org.eclipse.test.CoreTestApplication.run(CoreTestApplication.java:31)
	at java.lang.reflect.VMReflection.invokeMethod(VMReflection.java)
	at org.eclipse.equinox.internal.app.EclipseAppContainer.callMethod(EclipseAppContainer.java:533)
	at org.eclipse.equinox.internal.app.EclipseAppHandle.run(EclipseAppHandle.java:155)
	at org.eclipse.core.runtime.internal.adaptor.EclipseAppLauncher.runApplication(EclipseAppLauncher.java:106)
	at org.eclipse.core.runtime.internal.adaptor.EclipseAppLauncher.start(EclipseAppLauncher.java:76)
	at org.eclipse.core.runtime.adaptor.EclipseStarter.run(EclipseStarter.java:363)
	at org.eclipse.core.runtime.adaptor.EclipseStarter.run(EclipseStarter.java:176)
	at java.lang.reflect.VMReflection.invokeMethod(VMReflection.java)
	at org.eclipse.equinox.launcher.Main.invokeFramework(Main.java:504)
	at org.eclipse.equinox.launcher.Main.basicRun(Main.java:443)
	at org.eclipse.equinox.launcher.Main.run(Main.java:1169)
	at org.eclipse.equinox.launcher.Main.main(Main.java:1144)
	at org.eclipse.core.launcher.Main.main(Main.java:30)

Testcase: org.eclipse.jdt.core.tests.model.SortCompilationUnitElementsTests.test010:
java.lang.NoClassDefFoundError: com/ibm/icu/text/RuleBasedCollator
	at com.ibm.icu.text.CollatorServiceShim$1$CollatorFactory.handleCreate(CollatorServiceShim.java:114)
	at com.ibm.icu.impl.ICULocaleService$LocaleKeyFactory.create(ICULocaleService.java:378)
	at com.ibm.icu.impl.ICUService.getKey(ICUService.java:463)
	at com.ibm.icu.impl.ICUService.getKey(ICUService.java:383)
	at com.ibm.icu.impl.ICULocaleService.get(ICULocaleService.java:72)
	at com.ibm.icu.impl.ICULocaleService.get(ICULocaleService.java:56)
	at com.ibm.icu.text.CollatorServiceShim.getInstance(CollatorServiceShim.java:34)
	at com.ibm.icu.text.Collator.getInstance(Collator.java:483)
	at com.ibm.icu.text.Collator.getInstance(Collator.java:315)
	at org.eclipse.jdt.core.tests.model.DefaultJavaElementComparator.<init>(DefaultJavaElementComparator.java:157)
	at org.eclipse.jdt.core.tests.model.SortCompilationUnitElementsTests.sortUnit(SortCompilationUnitElementsTests.java:64)
	at org.eclipse.jdt.core.tests.model.SortCompilationUnitElementsTests.sortUnit(SortCompilationUnitElementsTests.java:53)
	at org.eclipse.jdt.core.tests.model.SortCompilationUnitElementsTests.test010(SortCompilationUnitElementsTests.java:821)
	at java.lang.reflect.VMReflection.invokeMethod(VMReflection.java)
	at org.eclipse.jdt.core.tests.model.SuiteOfTestCases$Suite.runTest(SuiteOfTestCases.java:99)
	at org.eclipse.jdt.core.tests.model.SuiteOfTestCases$Suite.superRun(SuiteOfTestCases.java:83)
	at org.eclipse.jdt.core.tests.model.SuiteOfTestCases$1.protect(SuiteOfTestCases.java:71)
	at org.eclipse.jdt.core.tests.model.SuiteOfTestCases$Suite.run(SuiteOfTestCases.java:80)
	at org.eclipse.test.EclipseTestRunner.run(EclipseTestRunner.java:354)
	at org.eclipse.test.EclipseTestRunner.run(EclipseTestRunner.java:206)
	at org.eclipse.test.CoreTestApplication.runTests(CoreTestApplication.java:35)
	at org.eclipse.test.CoreTestApplication.run(CoreTestApplication.java:31)
	at java.lang.reflect.VMReflection.invokeMethod(VMReflection.java)
	at org.eclipse.equinox.internal.app.EclipseAppContainer.callMethod(EclipseAppContainer.java:533)
	at org.eclipse.equinox.internal.app.EclipseAppHandle.run(EclipseAppHandle.java:155)
	at org.eclipse.core.runtime.internal.adaptor.EclipseAppLauncher.runApplication(EclipseAppLauncher.java:106)
	at org.eclipse.core.runtime.internal.adaptor.EclipseAppLauncher.start(EclipseAppLauncher.java:76)
	at org.eclipse.core.runtime.adaptor.EclipseStarter.run(EclipseStarter.java:363)
	at org.eclipse.core.runtime.adaptor.EclipseStarter.run(EclipseStarter.java:176)
	at java.lang.reflect.VMReflection.invokeMethod(VMReflection.java)
	at org.eclipse.equinox.launcher.Main.invokeFramework(Main.java:504)
	at org.eclipse.equinox.launcher.Main.basicRun(Main.java:443)
	at org.eclipse.equinox.launcher.Main.run(Main.java:1169)
	at org.eclipse.equinox.launcher.Main.main(Main.java:1144)
	at org.eclipse.core.launcher.Main.main(Main.java:30)

Testcase: org.eclipse.jdt.core.tests.model.SortCompilationUnitElementsTests.test011:
java.lang.NoClassDefFoundError: com/ibm/icu/text/RuleBasedCollator
	at com.ibm.icu.text.CollatorServiceShim$1$CollatorFactory.handleCreate(CollatorServiceShim.java:114)
	at com.ibm.icu.impl.ICULocaleService$LocaleKeyFactory.create(ICULocaleService.java:378)
	at com.ibm.icu.impl.ICUService.getKey(ICUService.java:463)
	at com.ibm.icu.impl.ICUService.getKey(ICUService.java:383)
	at com.ibm.icu.impl.ICULocaleService.get(ICULocaleService.java:72)
	at com.ibm.icu.impl.ICULocaleService.get(ICULocaleService.java:56)
	at com.ibm.icu.text.CollatorServiceShim.getInstance(CollatorServiceShim.java:34)
	at com.ibm.icu.text.Collator.getInstance(Collator.java:483)
	at com.ibm.icu.text.Collator.getInstance(Collator.java:315)
	at org.eclipse.jdt.core.tests.model.DefaultJavaElementComparator.<init>(DefaultJavaElementComparator.java:157)
	at org.eclipse.jdt.core.tests.model.SortCompilationUnitElementsTests.sortUnit(SortCompilationUnitElementsTests.java:64)
	at org.eclipse.jdt.core.tests.model.SortCompilationUnitElementsTests.sortUnit(SortCompilationUnitElementsTests.java:53)
	at org.eclipse.jdt.core.tests.model.SortCompilationUnitElementsTests.test011(SortCompilationUnitElementsTests.java:879)
	at java.lang.reflect.VMReflection.invokeMethod(VMReflection.java)
	at org.eclipse.jdt.core.tests.model.SuiteOfTestCases$Suite.runTest(SuiteOfTestCases.java:99)
	at org.eclipse.jdt.core.tests.model.SuiteOfTestCases$Suite.superRun(SuiteOfTestCases.java:83)
	at org.eclipse.jdt.core.tests.model.SuiteOfTestCases$1.protect(SuiteOfTestCases.java:71)
	at org.eclipse.jdt.core.tests.model.SuiteOfTestCases$Suite.run(SuiteOfTestCases.java:80)
	at org.eclipse.test.EclipseTestRunner.run(EclipseTestRunner.java:354)
	at org.eclipse.test.EclipseTestRunner.run(EclipseTestRunner.java:206)
	at org.eclipse.test.CoreTestApplication.runTests(CoreTestApplication.java:35)
	at org.eclipse.test.CoreTestApplication.run(CoreTestApplication.java:31)
	at java.lang.reflect.VMReflection.invokeMethod(VMReflection.java)
	at org.eclipse.equinox.internal.app.EclipseAppContainer.callMethod(EclipseAppContainer.java:533)
	at org.eclipse.equinox.internal.app.EclipseAppHandle.run(EclipseAppHandle.java:155)
	at org.eclipse.core.runtime.internal.adaptor.EclipseAppLauncher.runApplication(EclipseAppLauncher.java:106)
	at org.eclipse.core.runtime.internal.adaptor.EclipseAppLauncher.start(EclipseAppLauncher.java:76)
	at org.eclipse.core.runtime.adaptor.EclipseStarter.run(EclipseStarter.java:363)
	at org.eclipse.core.runtime.adaptor.EclipseStarter.run(EclipseStarter.java:176)
	at java.lang.reflect.VMReflection.invokeMethod(VMReflection.java)
	at org.eclipse.equinox.launcher.Main.invokeFramework(Main.java:504)
	at org.eclipse.equinox.launcher.Main.basicRun(Main.java:443)
	at org.eclipse.equinox.launcher.Main.run(Main.java:1169)
	at org.eclipse.equinox.launcher.Main.main(Main.java:1144)
	at org.eclipse.core.launcher.Main.main(Main.java:30)

Testcase: org.eclipse.jdt.core.tests.model.SortCompilationUnitElementsTests.test012:
java.lang.NoClassDefFoundError: com/ibm/icu/text/RuleBasedCollator
	at com.ibm.icu.text.CollatorServiceShim$1$CollatorFactory.handleCreate(CollatorServiceShim.java:114)
	at com.ibm.icu.impl.ICULocaleService$LocaleKeyFactory.create(ICULocaleService.java:378)
	at com.ibm.icu.impl.ICUService.getKey(ICUService.java:463)
	at com.ibm.icu.impl.ICUService.getKey(ICUService.java:383)
	at com.ibm.icu.impl.ICULocaleService.get(ICULocaleService.java:72)
	at com.ibm.icu.impl.ICULocaleService.get(ICULocaleService.java:56)
	at com.ibm.icu.text.CollatorServiceShim.getInstance(CollatorServiceShim.java:34)
	at com.ibm.icu.text.Collator.getInstance(Collator.java:483)
	at com.ibm.icu.text.Collator.getInstance(Collator.java:315)
	at org.eclipse.jdt.core.tests.model.DefaultJavaElementComparator.<init>(DefaultJavaElementComparator.java:157)
	at org.eclipse.jdt.core.tests.model.SortCompilationUnitElementsTests.sortUnit(SortCompilationUnitElementsTests.java:64)
	at org.eclipse.jdt.core.tests.model.SortCompilationUnitElementsTests.sortUnit(SortCompilationUnitElementsTests.java:53)
	at org.eclipse.jdt.core.tests.model.SortCompilationUnitElementsTests.test012(SortCompilationUnitElementsTests.java:925)
	at java.lang.reflect.VMReflection.invokeMethod(VMReflection.java)
	at org.eclipse.jdt.core.tests.model.SuiteOfTestCases$Suite.runTest(SuiteOfTestCases.java:99)
	at org.eclipse.jdt.core.tests.model.SuiteOfTestCases$Suite.superRun(SuiteOfTestCases.java:83)
	at org.eclipse.jdt.core.tests.model.SuiteOfTestCases$1.protect(SuiteOfTestCases.java:71)
	at org.eclipse.jdt.core.tests.model.SuiteOfTestCases$Suite.run(SuiteOfTestCases.java:80)
	at org.eclipse.test.EclipseTestRunner.run(EclipseTestRunner.java:354)
	at org.eclipse.test.EclipseTestRunner.run(EclipseTestRunner.java:206)
	at org.eclipse.test.CoreTestApplication.runTests(CoreTestApplication.java:35)
	at org.eclipse.test.CoreTestApplication.run(CoreTestApplication.java:31)
	at java.lang.reflect.VMReflection.invokeMethod(VMReflection.java)
	at org.eclipse.equinox.internal.app.EclipseAppContainer.callMethod(EclipseAppContainer.java:533)
	at org.eclipse.equinox.internal.app.EclipseAppHandle.run(EclipseAppHandle.java:155)
	at org.eclipse.core.runtime.internal.adaptor.EclipseAppLauncher.runApplication(EclipseAppLauncher.java:106)
	at org.eclipse.core.runtime.internal.adaptor.EclipseAppLauncher.start(EclipseAppLauncher.java:76)
	at org.eclipse.core.runtime.adaptor.EclipseStarter.run(EclipseStarter.java:363)
	at org.eclipse.core.runtime.adaptor.EclipseStarter.run(EclipseStarter.java:176)
	at java.lang.reflect.VMReflection.invokeMethod(VMReflection.java)
	at org.eclipse.equinox.launcher.Main.invokeFramework(Main.java:504)
	at org.eclipse.equinox.launcher.Main.basicRun(Main.java:443)
	at org.eclipse.equinox.launcher.Main.run(Main.java:1169)
	at org.eclipse.equinox.launcher.Main.main(Main.java:1144)
	at org.eclipse.core.launcher.Main.main(Main.java:30)

Testcase: org.eclipse.jdt.core.tests.model.SortCompilationUnitElementsTests.test013:
java.lang.NoClassDefFoundError: com/ibm/icu/text/RuleBasedCollator
	at com.ibm.icu.text.CollatorServiceShim$1$CollatorFactory.handleCreate(CollatorServiceShim.java:114)
	at com.ibm.icu.impl.ICULocaleService$LocaleKeyFactory.create(ICULocaleService.java:378)
	at com.ibm.icu.impl.ICUService.getKey(ICUService.java:463)
	at com.ibm.icu.impl.ICUService.getKey(ICUService.java:383)
	at com.ibm.icu.impl.ICULocaleService.get(ICULocaleService.java:72)
	at com.ibm.icu.impl.ICULocaleService.get(ICULocaleService.java:56)
	at com.ibm.icu.text.CollatorServiceShim.getInstance(CollatorServiceShim.java:34)
	at com.ibm.icu.text.Collator.getInstance(Collator.java:483)
	at com.ibm.icu.text.Collator.getInstance(Collator.java:315)
	at org.eclipse.jdt.core.tests.model.DefaultJavaElementComparator.<init>(DefaultJavaElementComparator.java:157)
	at org.eclipse.jdt.core.tests.model.SortCompilationUnitElementsTests.sortUnit(SortCompilationUnitElementsTests.java:64)
	at org.eclipse.jdt.core.tests.model.SortCompilationUnitElementsTests.sortUnit(SortCompilationUnitElementsTests.java:53)
	at org.eclipse.jdt.core.tests.model.SortCompilationUnitElementsTests.test013(SortCompilationUnitElementsTests.java:958)
	at java.lang.reflect.VMReflection.invokeMethod(VMReflection.java)
	at org.eclipse.jdt.core.tests.model.SuiteOfTestCases$Suite.runTest(SuiteOfTestCases.java:99)
	at org.eclipse.jdt.core.tests.model.SuiteOfTestCases$Suite.superRun(SuiteOfTestCases.java:83)
	at org.eclipse.jdt.core.tests.model.SuiteOfTestCases$1.protect(SuiteOfTestCases.java:71)
	at org.eclipse.jdt.core.tests.model.SuiteOfTestCases$Suite.run(SuiteOfTestCases.java:80)
	at org.eclipse.test.EclipseTestRunner.run(EclipseTestRunner.java:354)
	at org.eclipse.test.EclipseTestRunner.run(EclipseTestRunner.java:206)
	at org.eclipse.test.CoreTestApplication.runTests(CoreTestApplication.java:35)
	at org.eclipse.test.CoreTestApplication.run(CoreTestApplication.java:31)
	at java.lang.reflect.VMReflection.invokeMethod(VMReflection.java)
	at org.eclipse.equinox.internal.app.EclipseAppContainer.callMethod(EclipseAppContainer.java:533)
	at org.eclipse.equinox.internal.app.EclipseAppHandle.run(EclipseAppHandle.java:155)
	at org.eclipse.core.runtime.internal.adaptor.EclipseAppLauncher.runApplication(EclipseAppLauncher.java:106)
	at org.eclipse.core.runtime.internal.adaptor.EclipseAppLauncher.start(EclipseAppLauncher.java:76)
	at org.eclipse.core.runtime.adaptor.EclipseStarter.run(EclipseStarter.java:363)
	at org.eclipse.core.runtime.adaptor.EclipseStarter.run(EclipseStarter.java:176)
	at java.lang.reflect.VMReflection.invokeMethod(VMReflection.java)
	at org.eclipse.equinox.launcher.Main.invokeFramework(Main.java:504)
	at org.eclipse.equinox.launcher.Main.basicRun(Main.java:443)
	at org.eclipse.equinox.launcher.Main.run(Main.java:1169)
	at org.eclipse.equinox.launcher.Main.main(Main.java:1144)
	at org.eclipse.core.launcher.Main.main(Main.java:30)

Testcase: org.eclipse.jdt.core.tests.model.SortCompilationUnitElementsTests.test014:
java.lang.NoClassDefFoundError: com/ibm/icu/text/RuleBasedCollator
	at com.ibm.icu.text.CollatorServiceShim$1$CollatorFactory.handleCreate(CollatorServiceShim.java:114)
	at com.ibm.icu.impl.ICULocaleService$LocaleKeyFactory.create(ICULocaleService.java:378)
	at com.ibm.icu.impl.ICUService.getKey(ICUService.java:463)
	at com.ibm.icu.impl.ICUService.getKey(ICUService.java:383)
	at com.ibm.icu.impl.ICULocaleService.get(ICULocaleService.java:72)
	at com.ibm.icu.impl.ICULocaleService.get(ICULocaleService.java:56)
	at com.ibm.icu.text.CollatorServiceShim.getInstance(CollatorServiceShim.java:34)
	at com.ibm.icu.text.Collator.getInstance(Collator.java:483)
	at com.ibm.icu.text.Collator.getInstance(Collator.java:315)
	at org.eclipse.jdt.core.tests.model.DefaultJavaElementComparator.<init>(DefaultJavaElementComparator.java:157)
	at org.eclipse.jdt.core.tests.model.SortCompilationUnitElementsTests.sortUnit(SortCompilationUnitElementsTests.java:64)
	at org.eclipse.jdt.core.tests.model.SortCompilationUnitElementsTests.sortUnit(SortCompilationUnitElementsTests.java:53)
	at org.eclipse.jdt.core.tests.model.SortCompilationUnitElementsTests.test014(SortCompilationUnitElementsTests.java:984)
	at java.lang.reflect.VMReflection.invokeMethod(VMReflection.java)
	at org.eclipse.jdt.core.tests.model.SuiteOfTestCases$Suite.runTest(SuiteOfTestCases.java:99)
	at org.eclipse.jdt.core.tests.model.SuiteOfTestCases$Suite.superRun(SuiteOfTestCases.java:83)
	at org.eclipse.jdt.core.tests.model.SuiteOfTestCases$1.protect(SuiteOfTestCases.java:71)
	at org.eclipse.jdt.core.tests.model.SuiteOfTestCases$Suite.run(SuiteOfTestCases.java:80)
	at org.eclipse.test.EclipseTestRunner.run(EclipseTestRunner.java:354)
	at org.eclipse.test.EclipseTestRunner.run(EclipseTestRunner.java:206)
	at org.eclipse.test.CoreTestApplication.runTests(CoreTestApplication.java:35)
	at org.eclipse.test.CoreTestApplication.run(CoreTestApplication.java:31)
	at java.lang.reflect.VMReflection.invokeMethod(VMReflection.java)
	at org.eclipse.equinox.internal.app.EclipseAppContainer.callMethod(EclipseAppContainer.java:533)
	at org.eclipse.equinox.internal.app.EclipseAppHandle.run(EclipseAppHandle.java:155)
	at org.eclipse.core.runtime.internal.adaptor.EclipseAppLauncher.runApplication(EclipseAppLauncher.java:106)
	at org.eclipse.core.runtime.internal.adaptor.EclipseAppLauncher.start(EclipseAppLauncher.java:76)
	at org.eclipse.core.runtime.adaptor.EclipseStarter.run(EclipseStarter.java:363)
	at org.eclipse.core.runtime.adaptor.EclipseStarter.run(EclipseStarter.java:176)
	at java.lang.reflect.VMReflection.invokeMethod(VMReflection.java)
	at org.eclipse.equinox.launcher.Main.invokeFramework(Main.java:504)
	at org.eclipse.equinox.launcher.Main.basicRun(Main.java:443)
	at org.eclipse.equinox.launcher.Main.run(Main.java:1169)
	at org.eclipse.equinox.launcher.Main.main(Main.java:1144)
	at org.eclipse.core.launcher.Main.main(Main.java:30)

Testcase: org.eclipse.jdt.core.tests.model.SortCompilationUnitElementsTests.test015:
java.lang.NoClassDefFoundError: com/ibm/icu/text/RuleBasedCollator
	at com.ibm.icu.text.CollatorServiceShim$1$CollatorFactory.handleCreate(CollatorServiceShim.java:114)
	at com.ibm.icu.impl.ICULocaleService$LocaleKeyFactory.create(ICULocaleService.java:378)
	at com.ibm.icu.impl.ICUService.getKey(ICUService.java:463)
	at com.ibm.icu.impl.ICUService.getKey(ICUService.java:383)
	at com.ibm.icu.impl.ICULocaleService.get(ICULocaleService.java:72)
	at com.ibm.icu.impl.ICULocaleService.get(ICULocaleService.java:56)
	at com.ibm.icu.text.CollatorServiceShim.getInstance(CollatorServiceShim.java:34)
	at com.ibm.icu.text.Collator.getInstance(Collator.java:483)
	at com.ibm.icu.text.Collator.getInstance(Collator.java:315)
	at org.eclipse.jdt.core.tests.model.DefaultJavaElementComparator.<init>(DefaultJavaElementComparator.java:157)
	at org.eclipse.jdt.core.tests.model.SortCompilationUnitElementsTests.sortUnit(SortCompilationUnitElementsTests.java:64)
	at org.eclipse.jdt.core.tests.model.SortCompilationUnitElementsTests.sortUnit(SortCompilationUnitElementsTests.java:53)
	at org.eclipse.jdt.core.tests.model.SortCompilationUnitElementsTests.test015(SortCompilationUnitElementsTests.java:1014)
	at java.lang.reflect.VMReflection.invokeMethod(VMReflection.java)
	at org.eclipse.jdt.core.tests.model.SuiteOfTestCases$Suite.runTest(SuiteOfTestCases.java:99)
	at org.eclipse.jdt.core.tests.model.SuiteOfTestCases$Suite.superRun(SuiteOfTestCases.java:83)
	at org.eclipse.jdt.core.tests.model.SuiteOfTestCases$1.protect(SuiteOfTestCases.java:71)
	at org.eclipse.jdt.core.tests.model.SuiteOfTestCases$Suite.run(SuiteOfTestCases.java:80)
	at org.eclipse.test.EclipseTestRunner.run(EclipseTestRunner.java:354)
	at org.eclipse.test.EclipseTestRunner.run(EclipseTestRunner.java:206)
	at org.eclipse.test.CoreTestApplication.runTests(CoreTestApplication.java:35)
	at org.eclipse.test.CoreTestApplication.run(CoreTestApplication.java:31)
	at java.lang.reflect.VMReflection.invokeMethod(VMReflection.java)
	at org.eclipse.equinox.internal.app.EclipseAppContainer.callMethod(EclipseAppContainer.java:533)
	at org.eclipse.equinox.internal.app.EclipseAppHandle.run(EclipseAppHandle.java:155)
	at org.eclipse.core.runtime.internal.adaptor.EclipseAppLauncher.runApplication(EclipseAppLauncher.java:106)
	at org.eclipse.core.runtime.internal.adaptor.EclipseAppLauncher.start(EclipseAppLauncher.java:76)
	at org.eclipse.core.runtime.adaptor.EclipseStarter.run(EclipseStarter.java:363)
	at org.eclipse.core.runtime.adaptor.EclipseStarter.run(EclipseStarter.java:176)
	at java.lang.reflect.VMReflection.invokeMethod(VMReflection.java)
	at org.eclipse.equinox.launcher.Main.invokeFramework(Main.java:504)
	at org.eclipse.equinox.launcher.Main.basicRun(Main.java:443)
	at org.eclipse.equinox.launcher.Main.run(Main.java:1169)
	at org.eclipse.equinox.launcher.Main.main(Main.java:1144)
	at org.eclipse.core.launcher.Main.main(Main.java:30)

Testcase: org.eclipse.jdt.core.tests.model.SortCompilationUnitElementsTests.test016:
java.lang.NoClassDefFoundError: com/ibm/icu/text/RuleBasedCollator
	at com.ibm.icu.text.CollatorServiceShim$1$CollatorFactory.handleCreate(CollatorServiceShim.java:114)
	at com.ibm.icu.impl.ICULocaleService$LocaleKeyFactory.create(ICULocaleService.java:378)
	at com.ibm.icu.impl.ICUService.getKey(ICUService.java:463)
	at com.ibm.icu.impl.ICUService.getKey(ICUService.java:383)
	at com.ibm.icu.impl.ICULocaleService.get(ICULocaleService.java:72)
	at com.ibm.icu.impl.ICULocaleService.get(ICULocaleService.java:56)
	at com.ibm.icu.text.CollatorServiceShim.getInstance(CollatorServiceShim.java:34)
	at com.ibm.icu.text.Collator.getInstance(Collator.java:483)
	at com.ibm.icu.text.Collator.getInstance(Collator.java:315)
	at org.eclipse.jdt.core.tests.model.DefaultJavaElementComparator.<init>(DefaultJavaElementComparator.java:157)
	at org.eclipse.jdt.core.tests.model.SortCompilationUnitElementsTests.sortUnit(SortCompilationUnitElementsTests.java:64)
	at org.eclipse.jdt.core.tests.model.SortCompilationUnitElementsTests.sortUnit(SortCompilationUnitElementsTests.java:53)
	at org.eclipse.jdt.core.tests.model.SortCompilationUnitElementsTests.test016(SortCompilationUnitElementsTests.java:1098)
	at java.lang.reflect.VMReflection.invokeMethod(VMReflection.java)
	at org.eclipse.jdt.core.tests.model.SuiteOfTestCases$Suite.runTest(SuiteOfTestCases.java:99)
	at org.eclipse.jdt.core.tests.model.SuiteOfTestCases$Suite.superRun(SuiteOfTestCases.java:83)
	at org.eclipse.jdt.core.tests.model.SuiteOfTestCases$1.protect(SuiteOfTestCases.java:71)
	at org.eclipse.jdt.core.tests.model.SuiteOfTestCases$Suite.run(SuiteOfTestCases.java:80)
	at org.eclipse.test.EclipseTestRunner.run(EclipseTestRunner.java:354)
	at org.eclipse.test.EclipseTestRunner.run(EclipseTestRunner.java:206)
	at org.eclipse.test.CoreTestApplication.runTests(CoreTestApplication.java:35)
	at org.eclipse.test.CoreTestApplication.run(CoreTestApplication.java:31)
	at java.lang.reflect.VMReflection.invokeMethod(VMReflection.java)
	at org.eclipse.equinox.internal.app.EclipseAppContainer.callMethod(EclipseAppContainer.java:533)
	at org.eclipse.equinox.internal.app.EclipseAppHandle.run(EclipseAppHandle.java:155)
	at org.eclipse.core.runtime.internal.adaptor.EclipseAppLauncher.runApplication(EclipseAppLauncher.java:106)
	at org.eclipse.core.runtime.internal.adaptor.EclipseAppLauncher.start(EclipseAppLauncher.java:76)
	at org.eclipse.core.runtime.adaptor.EclipseStarter.run(EclipseStarter.java:363)
	at org.eclipse.core.runtime.adaptor.EclipseStarter.run(EclipseStarter.java:176)
	at java.lang.reflect.VMReflection.invokeMethod(VMReflection.java)
	at org.eclipse.equinox.launcher.Main.invokeFramework(Main.java:504)
	at org.eclipse.equinox.launcher.Main.basicRun(Main.java:443)
	at org.eclipse.equinox.launcher.Main.run(Main.java:1169)
	at org.eclipse.equinox.launcher.Main.main(Main.java:1144)
	at org.eclipse.core.launcher.Main.main(Main.java:30)

Testcase: org.eclipse.jdt.core.tests.model.SortCompilationUnitElementsTests.test017:
java.lang.NoClassDefFoundError: com/ibm/icu/text/RuleBasedCollator
	at com.ibm.icu.text.CollatorServiceShim$1$CollatorFactory.handleCreate(CollatorServiceShim.java:114)
	at com.ibm.icu.impl.ICULocaleService$LocaleKeyFactory.create(ICULocaleService.java:378)
	at com.ibm.icu.impl.ICUService.getKey(ICUService.java:463)
	at com.ibm.icu.impl.ICUService.getKey(ICUService.java:383)
	at com.ibm.icu.impl.ICULocaleService.get(ICULocaleService.java:72)
	at com.ibm.icu.impl.ICULocaleService.get(ICULocaleService.java:56)
	at com.ibm.icu.text.CollatorServiceShim.getInstance(CollatorServiceShim.java:34)
	at com.ibm.icu.text.Collator.getInstance(Collator.java:483)
	at com.ibm.icu.text.Collator.getInstance(Collator.java:315)
	at org.eclipse.jdt.core.tests.model.DefaultJavaElementComparator.<init>(DefaultJavaElementComparator.java:157)
	at org.eclipse.jdt.core.tests.model.SortCompilationUnitElementsTests.sortUnit(SortCompilationUnitElementsTests.java:64)
	at org.eclipse.jdt.core.tests.model.SortCompilationUnitElementsTests.sortUnit(SortCompilationUnitElementsTests.java:53)
	at org.eclipse.jdt.core.tests.model.SortCompilationUnitElementsTests.test017(SortCompilationUnitElementsTests.java:1182)
	at java.lang.reflect.VMReflection.invokeMethod(VMReflection.java)
	at org.eclipse.jdt.core.tests.model.SuiteOfTestCases$Suite.runTest(SuiteOfTestCases.java:99)
	at org.eclipse.jdt.core.tests.model.SuiteOfTestCases$Suite.superRun(SuiteOfTestCases.java:83)
	at org.eclipse.jdt.core.tests.model.SuiteOfTestCases$1.protect(SuiteOfTestCases.java:71)
	at org.eclipse.jdt.core.tests.model.SuiteOfTestCases$Suite.run(SuiteOfTestCases.java:80)
	at org.eclipse.test.EclipseTestRunner.run(EclipseTestRunner.java:354)
	at org.eclipse.test.EclipseTestRunner.run(EclipseTestRunner.java:206)
	at org.eclipse.test.CoreTestApplication.runTests(CoreTestApplication.java:35)
	at org.eclipse.test.CoreTestApplication.run(CoreTestApplication.java:31)
	at java.lang.reflect.VMReflection.invokeMethod(VMReflection.java)
	at org.eclipse.equinox.internal.app.EclipseAppContainer.callMethod(EclipseAppContainer.java:533)
	at org.eclipse.equinox.internal.app.EclipseAppHandle.run(EclipseAppHandle.java:155)
	at org.eclipse.core.runtime.internal.adaptor.EclipseAppLauncher.runApplication(EclipseAppLauncher.java:106)
	at org.eclipse.core.runtime.internal.adaptor.EclipseAppLauncher.start(EclipseAppLauncher.java:76)
	at org.eclipse.core.runtime.adaptor.EclipseStarter.run(EclipseStarter.java:363)
	at org.eclipse.core.runtime.adaptor.EclipseStarter.run(EclipseStarter.java:176)
	at java.lang.reflect.VMReflection.invokeMethod(VMReflection.java)
	at org.eclipse.equinox.launcher.Main.invokeFramework(Main.java:504)
	at org.eclipse.equinox.launcher.Main.basicRun(Main.java:443)
	at org.eclipse.equinox.launcher.Main.run(Main.java:1169)
	at org.eclipse.equinox.launcher.Main.main(Main.java:1144)
	at org.eclipse.core.launcher.Main.main(Main.java:30)

Testcase: org.eclipse.jdt.core.tests.model.SortCompilationUnitElementsTests.test018:
java.lang.NoClassDefFoundError: com/ibm/icu/text/RuleBasedCollator
	at com.ibm.icu.text.CollatorServiceShim$1$CollatorFactory.handleCreate(CollatorServiceShim.java:114)
	at com.ibm.icu.impl.ICULocaleService$LocaleKeyFactory.create(ICULocaleService.java:378)
	at com.ibm.icu.impl.ICUService.getKey(ICUService.java:463)
	at com.ibm.icu.impl.ICUService.getKey(ICUService.java:383)
	at com.ibm.icu.impl.ICULocaleService.get(ICULocaleService.java:72)
	at com.ibm.icu.impl.ICULocaleService.get(ICULocaleService.java:56)
	at com.ibm.icu.text.CollatorServiceShim.getInstance(CollatorServiceShim.java:34)
	at com.ibm.icu.text.Collator.getInstance(Collator.java:483)
	at com.ibm.icu.text.Collator.getInstance(Collator.java:315)
	at org.eclipse.jdt.core.tests.model.DefaultJavaElementComparator.<init>(DefaultJavaElementComparator.java:157)
	at org.eclipse.jdt.core.tests.model.SortCompilationUnitElementsTests.sortUnit(SortCompilationUnitElementsTests.java:64)
	at org.eclipse.jdt.core.tests.model.SortCompilationUnitElementsTests.sortUnit(SortCompilationUnitElementsTests.java:53)
	at org.eclipse.jdt.core.tests.model.SortCompilationUnitElementsTests.test018(SortCompilationUnitElementsTests.java:1207)
	at java.lang.reflect.VMReflection.invokeMethod(VMReflection.java)
	at org.eclipse.jdt.core.tests.model.SuiteOfTestCases$Suite.runTest(SuiteOfTestCases.java:99)
	at org.eclipse.jdt.core.tests.model.SuiteOfTestCases$Suite.superRun(SuiteOfTestCases.java:83)
	at org.eclipse.jdt.core.tests.model.SuiteOfTestCases$1.protect(SuiteOfTestCases.java:71)
	at org.eclipse.jdt.core.tests.model.SuiteOfTestCases$Suite.run(SuiteOfTestCases.java:80)
	at org.eclipse.test.EclipseTestRunner.run(EclipseTestRunner.java:354)
	at org.eclipse.test.EclipseTestRunner.run(EclipseTestRunner.java:206)
	at org.eclipse.test.CoreTestApplication.runTests(CoreTestApplication.java:35)
	at org.eclipse.test.CoreTestApplication.run(CoreTestApplication.java:31)
	at java.lang.reflect.VMReflection.invokeMethod(VMReflection.java)
	at org.eclipse.equinox.internal.app.EclipseAppContainer.callMethod(EclipseAppContainer.java:533)
	at org.eclipse.equinox.internal.app.EclipseAppHandle.run(EclipseAppHandle.java:155)
	at org.eclipse.core.runtime.internal.adaptor.EclipseAppLauncher.runApplication(EclipseAppLauncher.java:106)
	at org.eclipse.core.runtime.internal.adaptor.EclipseAppLauncher.start(EclipseAppLauncher.java:76)
	at org.eclipse.core.runtime.adaptor.EclipseStarter.run(EclipseStarter.java:363)
	at org.eclipse.core.runtime.adaptor.EclipseStarter.run(EclipseStarter.java:176)
	at java.lang.reflect.VMReflection.invokeMethod(VMReflection.java)
	at org.eclipse.equinox.launcher.Main.invokeFramework(Main.java:504)
	at org.eclipse.equinox.launcher.Main.basicRun(Main.java:443)
	at org.eclipse.equinox.launcher.Main.run(Main.java:1169)
	at org.eclipse.equinox.launcher.Main.main(Main.java:1144)
	at org.eclipse.core.launcher.Main.main(Main.java:30)

Testcase: org.eclipse.jdt.core.tests.model.SortCompilationUnitElementsTests.test019:
java.lang.NoClassDefFoundError: com/ibm/icu/text/RuleBasedCollator
	at com.ibm.icu.text.CollatorServiceShim$1$CollatorFactory.handleCreate(CollatorServiceShim.java:114)
	at com.ibm.icu.impl.ICULocaleService$LocaleKeyFactory.create(ICULocaleService.java:378)
	at com.ibm.icu.impl.ICUService.getKey(ICUService.java:463)
	at com.ibm.icu.impl.ICUService.getKey(ICUService.java:383)
	at com.ibm.icu.impl.ICULocaleService.get(ICULocaleService.java:72)
	at com.ibm.icu.impl.ICULocaleService.get(ICULocaleService.java:56)
	at com.ibm.icu.text.CollatorServiceShim.getInstance(CollatorServiceShim.java:34)
	at com.ibm.icu.text.Collator.getInstance(Collator.java:483)
	at com.ibm.icu.text.Collator.getInstance(Collator.java:315)
	at org.eclipse.jdt.core.tests.model.DefaultJavaElementComparator.<init>(DefaultJavaElementComparator.java:157)
	at org.eclipse.jdt.core.tests.model.SortCompilationUnitElementsTests.sortUnit(SortCompilationUnitElementsTests.java:64)
	at org.eclipse.jdt.core.tests.model.SortCompilationUnitElementsTests.sortUnit(SortCompilationUnitElementsTests.java:57)
	at org.eclipse.jdt.core.tests.model.SortCompilationUnitElementsTests.test019(SortCompilationUnitElementsTests.java:1225)
	at java.lang.reflect.VMReflection.invokeMethod(VMReflection.java)
	at org.eclipse.jdt.core.tests.model.SuiteOfTestCases$Suite.runTest(SuiteOfTestCases.java:99)
	at org.eclipse.jdt.core.tests.model.SuiteOfTestCases$Suite.superRun(SuiteOfTestCases.java:83)
	at org.eclipse.jdt.core.tests.model.SuiteOfTestCases$1.protect(SuiteOfTestCases.java:71)
	at org.eclipse.jdt.core.tests.model.SuiteOfTestCases$Suite.run(SuiteOfTestCases.java:80)
	at org.eclipse.test.EclipseTestRunner.run(EclipseTestRunner.java:354)
	at org.eclipse.test.EclipseTestRunner.run(EclipseTestRunner.java:206)
	at org.eclipse.test.CoreTestApplication.runTests(CoreTestApplication.java:35)
	at org.eclipse.test.CoreTestApplication.run(CoreTestApplication.java:31)
	at java.lang.reflect.VMReflection.invokeMethod(VMReflection.java)
	at org.eclipse.equinox.internal.app.EclipseAppContainer.callMethod(EclipseAppContainer.java:533)
	at org.eclipse.equinox.internal.app.EclipseAppHandle.run(EclipseAppHandle.java:155)
	at org.eclipse.core.runtime.internal.adaptor.EclipseAppLauncher.runApplication(EclipseAppLauncher.java:106)
	at org.eclipse.core.runtime.internal.adaptor.EclipseAppLauncher.start(EclipseAppLauncher.java:76)
	at org.eclipse.core.runtime.adaptor.EclipseStarter.run(EclipseStarter.java:363)
	at org.eclipse.core.runtime.adaptor.EclipseStarter.run(EclipseStarter.java:176)
	at java.lang.reflect.VMReflection.invokeMethod(VMReflection.java)
	at org.eclipse.equinox.launcher.Main.invokeFramework(Main.java:504)
	at org.eclipse.equinox.launcher.Main.basicRun(Main.java:443)
	at org.eclipse.equinox.launcher.Main.run(Main.java:1169)
	at org.eclipse.equinox.launcher.Main.main(Main.java:1144)
	at org.eclipse.core.launcher.Main.main(Main.java:30)

Testcase: org.eclipse.jdt.core.tests.model.SortCompilationUnitElementsTests.test020:
java.lang.NoClassDefFoundError: com/ibm/icu/text/RuleBasedCollator
	at com.ibm.icu.text.CollatorServiceShim$1$CollatorFactory.handleCreate(CollatorServiceShim.java:114)
	at com.ibm.icu.impl.ICULocaleService$LocaleKeyFactory.create(ICULocaleService.java:378)
	at com.ibm.icu.impl.ICUService.getKey(ICUService.java:463)
	at com.ibm.icu.impl.ICUService.getKey(ICUService.java:383)
	at com.ibm.icu.impl.ICULocaleService.get(ICULocaleService.java:72)
	at com.ibm.icu.impl.ICULocaleService.get(ICULocaleService.java:56)
	at com.ibm.icu.text.CollatorServiceShim.getInstance(CollatorServiceShim.java:34)
	at com.ibm.icu.text.Collator.getInstance(Collator.java:483)
	at com.ibm.icu.text.Collator.getInstance(Collator.java:315)
	at org.eclipse.jdt.core.tests.model.DefaultJavaElementComparator.<init>(DefaultJavaElementComparator.java:157)
	at org.eclipse.jdt.core.tests.model.SortCompilationUnitElementsTests.sortUnit(SortCompilationUnitElementsTests.java:64)
	at org.eclipse.jdt.core.tests.model.SortCompilationUnitElementsTests.sortUnit(SortCompilationUnitElementsTests.java:57)
	at org.eclipse.jdt.core.tests.model.SortCompilationUnitElementsTests.test020(SortCompilationUnitElementsTests.java:1255)
	at java.lang.reflect.VMReflection.invokeMethod(VMReflection.java)
	at org.eclipse.jdt.core.tests.model.SuiteOfTestCases$Suite.runTest(SuiteOfTestCases.java:99)
	at org.eclipse.jdt.core.tests.model.SuiteOfTestCases$Suite.superRun(SuiteOfTestCases.java:83)
	at org.eclipse.jdt.core.tests.model.SuiteOfTestCases$1.protect(SuiteOfTestCases.java:71)
	at org.eclipse.jdt.core.tests.model.SuiteOfTestCases$Suite.run(SuiteOfTestCases.java:80)
	at org.eclipse.test.EclipseTestRunner.run(EclipseTestRunner.java:354)
	at org.eclipse.test.EclipseTestRunner.run(EclipseTestRunner.java:206)
	at org.eclipse.test.CoreTestApplication.runTests(CoreTestApplication.java:35)
	at org.eclipse.test.CoreTestApplication.run(CoreTestApplication.java:31)
	at java.lang.reflect.VMReflection.invokeMethod(VMReflection.java)
	at org.eclipse.equinox.internal.app.EclipseAppContainer.callMethod(EclipseAppContainer.java:533)
	at org.eclipse.equinox.internal.app.EclipseAppHandle.run(EclipseAppHandle.java:155)
	at org.eclipse.core.runtime.internal.adaptor.EclipseAppLauncher.runApplication(EclipseAppLauncher.java:106)
	at org.eclipse.core.runtime.internal.adaptor.EclipseAppLauncher.start(EclipseAppLauncher.java:76)
	at org.eclipse.core.runtime.adaptor.EclipseStarter.run(EclipseStarter.java:363)
	at org.eclipse.core.runtime.adaptor.EclipseStarter.run(EclipseStarter.java:176)
	at java.lang.reflect.VMReflection.invokeMethod(VMReflection.java)
	at org.eclipse.equinox.launcher.Main.invokeFramework(Main.java:504)
	at org.eclipse.equinox.launcher.Main.basicRun(Main.java:443)
	at org.eclipse.equinox.launcher.Main.run(Main.java:1169)
	at org.eclipse.equinox.launcher.Main.main(Main.java:1144)
	at org.eclipse.core.launcher.Main.main(Main.java:30)

Testcase: org.eclipse.jdt.core.tests.model.SortCompilationUnitElementsTests.test021:
java.lang.NoClassDefFoundError: com/ibm/icu/text/RuleBasedCollator
	at com.ibm.icu.text.CollatorServiceShim$1$CollatorFactory.handleCreate(CollatorServiceShim.java:114)
	at com.ibm.icu.impl.ICULocaleService$LocaleKeyFactory.create(ICULocaleService.java:378)
	at com.ibm.icu.impl.ICUService.getKey(ICUService.java:463)
	at com.ibm.icu.impl.ICUService.getKey(ICUService.java:383)
	at com.ibm.icu.impl.ICULocaleService.get(ICULocaleService.java:72)
	at com.ibm.icu.impl.ICULocaleService.get(ICULocaleService.java:56)
	at com.ibm.icu.text.CollatorServiceShim.getInstance(CollatorServiceShim.java:34)
	at com.ibm.icu.text.Collator.getInstance(Collator.java:483)
	at com.ibm.icu.text.Collator.getInstance(Collator.java:315)
	at org.eclipse.jdt.core.tests.model.DefaultJavaElementComparator.<init>(DefaultJavaElementComparator.java:157)
	at org.eclipse.jdt.core.tests.model.SortCompilationUnitElementsTests.sortUnit(SortCompilationUnitElementsTests.java:64)
	at org.eclipse.jdt.core.tests.model.SortCompilationUnitElementsTests.sortUnit(SortCompilationUnitElementsTests.java:57)
	at org.eclipse.jdt.core.tests.model.SortCompilationUnitElementsTests.test021(SortCompilationUnitElementsTests.java:1301)
	at java.lang.reflect.VMReflection.invokeMethod(VMReflection.java)
	at org.eclipse.jdt.core.tests.model.SuiteOfTestCases$Suite.runTest(SuiteOfTestCases.java:99)
	at org.eclipse.jdt.core.tests.model.SuiteOfTestCases$Suite.superRun(SuiteOfTestCases.java:83)
	at org.eclipse.jdt.core.tests.model.SuiteOfTestCases$1.protect(SuiteOfTestCases.java:71)
	at org.eclipse.jdt.core.tests.model.SuiteOfTestCases$Suite.run(SuiteOfTestCases.java:80)
	at org.eclipse.test.EclipseTestRunner.run(EclipseTestRunner.java:354)
	at org.eclipse.test.EclipseTestRunner.run(EclipseTestRunner.java:206)
	at org.eclipse.test.CoreTestApplication.runTests(CoreTestApplication.java:35)
	at org.eclipse.test.CoreTestApplication.run(CoreTestApplication.java:31)
	at java.lang.reflect.VMReflection.invokeMethod(VMReflection.java)
	at org.eclipse.equinox.internal.app.EclipseAppContainer.callMethod(EclipseAppContainer.java:533)
	at org.eclipse.equinox.internal.app.EclipseAppHandle.run(EclipseAppHandle.java:155)
	at org.eclipse.core.runtime.internal.adaptor.EclipseAppLauncher.runApplication(EclipseAppLauncher.java:106)
	at org.eclipse.core.runtime.internal.adaptor.EclipseAppLauncher.start(EclipseAppLauncher.java:76)
	at org.eclipse.core.runtime.adaptor.EclipseStarter.run(EclipseStarter.java:363)
	at org.eclipse.core.runtime.adaptor.EclipseStarter.run(EclipseStarter.java:176)
	at java.lang.reflect.VMReflection.invokeMethod(VMReflection.java)
	at org.eclipse.equinox.launcher.Main.invokeFramework(Main.java:504)
	at org.eclipse.equinox.launcher.Main.basicRun(Main.java:443)
	at org.eclipse.equinox.launcher.Main.run(Main.java:1169)
	at org.eclipse.equinox.launcher.Main.main(Main.java:1144)
	at org.eclipse.core.launcher.Main.main(Main.java:30)

Testcase: org.eclipse.jdt.core.tests.model.SortCompilationUnitElementsTests.test022:
java.lang.NoClassDefFoundError: com/ibm/icu/text/RuleBasedCollator
	at com.ibm.icu.text.CollatorServiceShim$1$CollatorFactory.handleCreate(CollatorServiceShim.java:114)
	at com.ibm.icu.impl.ICULocaleService$LocaleKeyFactory.create(ICULocaleService.java:378)
	at com.ibm.icu.impl.ICUService.getKey(ICUService.java:463)
	at com.ibm.icu.impl.ICUService.getKey(ICUService.java:383)
	at com.ibm.icu.impl.ICULocaleService.get(ICULocaleService.java:72)
	at com.ibm.icu.impl.ICULocaleService.get(ICULocaleService.java:56)
	at com.ibm.icu.text.CollatorServiceShim.getInstance(CollatorServiceShim.java:34)
	at com.ibm.icu.text.Collator.getInstance(Collator.java:483)
	at com.ibm.icu.text.Collator.getInstance(Collator.java:315)
	at org.eclipse.jdt.core.tests.model.DefaultJavaElementComparator.<init>(DefaultJavaElementComparator.java:157)
	at org.eclipse.jdt.core.tests.model.SortCompilationUnitElementsTests.sortUnit(SortCompilationUnitElementsTests.java:64)
	at org.eclipse.jdt.core.tests.model.SortCompilationUnitElementsTests.sortUnit(SortCompilationUnitElementsTests.java:53)
	at org.eclipse.jdt.core.tests.model.SortCompilationUnitElementsTests.test022(SortCompilationUnitElementsTests.java:1647)
	at java.lang.reflect.VMReflection.invokeMethod(VMReflection.java)
	at org.eclipse.jdt.core.tests.model.SuiteOfTestCases$Suite.runTest(SuiteOfTestCases.java:99)
	at org.eclipse.jdt.core.tests.model.SuiteOfTestCases$Suite.superRun(SuiteOfTestCases.java:83)
	at org.eclipse.jdt.core.tests.model.SuiteOfTestCases$1.protect(SuiteOfTestCases.java:71)
	at org.eclipse.jdt.core.tests.model.SuiteOfTestCases$Suite.run(SuiteOfTestCases.java:80)
	at org.eclipse.test.EclipseTestRunner.run(EclipseTestRunner.java:354)
	at org.eclipse.test.EclipseTestRunner.run(EclipseTestRunner.java:206)
	at org.eclipse.test.CoreTestApplication.runTests(CoreTestApplication.java:35)
	at org.eclipse.test.CoreTestApplication.run(CoreTestApplication.java:31)
	at java.lang.reflect.VMReflection.invokeMethod(VMReflection.java)
	at org.eclipse.equinox.internal.app.EclipseAppContainer.callMethod(EclipseAppContainer.java:533)
	at org.eclipse.equinox.internal.app.EclipseAppHandle.run(EclipseAppHandle.java:155)
	at org.eclipse.core.runtime.internal.adaptor.EclipseAppLauncher.runApplication(EclipseAppLauncher.java:106)
	at org.eclipse.core.runtime.internal.adaptor.EclipseAppLauncher.start(EclipseAppLauncher.java:76)
	at org.eclipse.core.runtime.adaptor.EclipseStarter.run(EclipseStarter.java:363)
	at org.eclipse.core.runtime.adaptor.EclipseStarter.run(EclipseStarter.java:176)
	at java.lang.reflect.VMReflection.invokeMethod(VMReflection.java)
	at org.eclipse.equinox.launcher.Main.invokeFramework(Main.java:504)
	at org.eclipse.equinox.launcher.Main.basicRun(Main.java:443)
	at org.eclipse.equinox.launcher.Main.run(Main.java:1169)
	at org.eclipse.equinox.launcher.Main.main(Main.java:1144)
	at org.eclipse.core.launcher.Main.main(Main.java:30)

Testcase: org.eclipse.jdt.core.tests.model.SortCompilationUnitElementsTests.test023:
java.lang.NoClassDefFoundError: com/ibm/icu/text/RuleBasedCollator
	at com.ibm.icu.text.CollatorServiceShim$1$CollatorFactory.handleCreate(CollatorServiceShim.java:114)
	at com.ibm.icu.impl.ICULocaleService$LocaleKeyFactory.create(ICULocaleService.java:378)
	at com.ibm.icu.impl.ICUService.getKey(ICUService.java:463)
	at com.ibm.icu.impl.ICUService.getKey(ICUService.java:383)
	at com.ibm.icu.impl.ICULocaleService.get(ICULocaleService.java:72)
	at com.ibm.icu.impl.ICULocaleService.get(ICULocaleService.java:56)
	at com.ibm.icu.text.CollatorServiceShim.getInstance(CollatorServiceShim.java:34)
	at com.ibm.icu.text.Collator.getInstance(Collator.java:483)
	at com.ibm.icu.text.Collator.getInstance(Collator.java:315)
	at org.eclipse.jdt.core.tests.model.DefaultJavaElementComparator.<init>(DefaultJavaElementComparator.java:157)
	at org.eclipse.jdt.core.tests.model.SortCompilationUnitElementsTests.sortUnit(SortCompilationUnitElementsTests.java:64)
	at org.eclipse.jdt.core.tests.model.SortCompilationUnitElementsTests.sortUnit(SortCompilationUnitElementsTests.java:57)
	at org.eclipse.jdt.core.tests.model.SortCompilationUnitElementsTests.test023(SortCompilationUnitElementsTests.java:1673)
	at java.lang.reflect.VMReflection.invokeMethod(VMReflection.java)
	at org.eclipse.jdt.core.tests.model.SuiteOfTestCases$Suite.runTest(SuiteOfTestCases.java:99)
	at org.eclipse.jdt.core.tests.model.SuiteOfTestCases$Suite.superRun(SuiteOfTestCases.java:83)
	at org.eclipse.jdt.core.tests.model.SuiteOfTestCases$1.protect(SuiteOfTestCases.java:71)
	at org.eclipse.jdt.core.tests.model.SuiteOfTestCases$Suite.run(SuiteOfTestCases.java:80)
	at org.eclipse.test.EclipseTestRunner.run(EclipseTestRunner.java:354)
	at org.eclipse.test.EclipseTestRunner.run(EclipseTestRunner.java:206)
	at org.eclipse.test.CoreTestApplication.runTests(CoreTestApplication.java:35)
	at org.eclipse.test.CoreTestApplication.run(CoreTestApplication.java:31)
	at java.lang.reflect.VMReflection.invokeMethod(VMReflection.java)
	at org.eclipse.equinox.internal.app.EclipseAppContainer.callMethod(EclipseAppContainer.java:533)
	at org.eclipse.equinox.internal.app.EclipseAppHandle.run(EclipseAppHandle.java:155)
	at org.eclipse.core.runtime.internal.adaptor.EclipseAppLauncher.runApplication(EclipseAppLauncher.java:106)
	at org.eclipse.core.runtime.internal.adaptor.EclipseAppLauncher.start(EclipseAppLauncher.java:76)
	at org.eclipse.core.runtime.adaptor.EclipseStarter.run(EclipseStarter.java:363)
	at org.eclipse.core.runtime.adaptor.EclipseStarter.run(EclipseStarter.java:176)
	at java.lang.reflect.VMReflection.invokeMethod(VMReflection.java)
	at org.eclipse.equinox.launcher.Main.invokeFramework(Main.java:504)
	at org.eclipse.equinox.launcher.Main.basicRun(Main.java:443)
	at org.eclipse.equinox.launcher.Main.run(Main.java:1169)
	at org.eclipse.equinox.launcher.Main.main(Main.java:1144)
	at org.eclipse.core.launcher.Main.main(Main.java:30)

Testcase: org.eclipse.jdt.core.tests.model.SortCompilationUnitElementsTests.test024:
java.lang.NoClassDefFoundError: com/ibm/icu/text/RuleBasedCollator
	at com.ibm.icu.text.CollatorServiceShim$1$CollatorFactory.handleCreate(CollatorServiceShim.java:114)
	at com.ibm.icu.impl.ICULocaleService$LocaleKeyFactory.create(ICULocaleService.java:378)
	at com.ibm.icu.impl.ICUService.getKey(ICUService.java:463)
	at com.ibm.icu.impl.ICUService.getKey(ICUService.java:383)
	at com.ibm.icu.impl.ICULocaleService.get(ICULocaleService.java:72)
	at com.ibm.icu.impl.ICULocaleService.get(ICULocaleService.java:56)
	at com.ibm.icu.text.CollatorServiceShim.getInstance(CollatorServiceShim.java:34)
	at com.ibm.icu.text.Collator.getInstance(Collator.java:483)
	at com.ibm.icu.text.Collator.getInstance(Collator.java:315)
	at org.eclipse.jdt.core.tests.model.DefaultJavaElementComparator.<init>(DefaultJavaElementComparator.java:157)
	at org.eclipse.jdt.core.tests.model.SortCompilationUnitElementsTests.sortUnit(SortCompilationUnitElementsTests.java:64)
	at org.eclipse.jdt.core.tests.model.SortCompilationUnitElementsTests.sortUnit(SortCompilationUnitElementsTests.java:57)
	at org.eclipse.jdt.core.tests.model.SortCompilationUnitElementsTests.test024(SortCompilationUnitElementsTests.java:1707)
	at java.lang.reflect.VMReflection.invokeMethod(VMReflection.java)
	at org.eclipse.jdt.core.tests.model.SuiteOfTestCases$Suite.runTest(SuiteOfTestCases.java:99)
	at org.eclipse.jdt.core.tests.model.SuiteOfTestCases$Suite.superRun(SuiteOfTestCases.java:83)
	at org.eclipse.jdt.core.tests.model.SuiteOfTestCases$1.protect(SuiteOfTestCases.java:71)
	at org.eclipse.jdt.core.tests.model.SuiteOfTestCases$Suite.run(SuiteOfTestCases.java:80)
	at org.eclipse.test.EclipseTestRunner.run(EclipseTestRunner.java:354)
	at org.eclipse.test.EclipseTestRunner.run(EclipseTestRunner.java:206)
	at org.eclipse.test.CoreTestApplication.runTests(CoreTestApplication.java:35)
	at org.eclipse.test.CoreTestApplication.run(CoreTestApplication.java:31)
	at java.lang.reflect.VMReflection.invokeMethod(VMReflection.java)
	at org.eclipse.equinox.internal.app.EclipseAppContainer.callMethod(EclipseAppContainer.java:533)
	at org.eclipse.equinox.internal.app.EclipseAppHandle.run(EclipseAppHandle.java:155)
	at org.eclipse.core.runtime.internal.adaptor.EclipseAppLauncher.runApplication(EclipseAppLauncher.java:106)
	at org.eclipse.core.runtime.internal.adaptor.EclipseAppLauncher.start(EclipseAppLauncher.java:76)
	at org.eclipse.core.runtime.adaptor.EclipseStarter.run(EclipseStarter.java:363)
	at org.eclipse.core.runtime.adaptor.EclipseStarter.run(EclipseStarter.java:176)
	at java.lang.reflect.VMReflection.invokeMethod(VMReflection.java)
	at org.eclipse.equinox.launcher.Main.invokeFramework(Main.java:504)
	at org.eclipse.equinox.launcher.Main.basicRun(Main.java:443)
	at org.eclipse.equinox.launcher.Main.run(Main.java:1169)
	at org.eclipse.equinox.launcher.Main.main(Main.java:1144)
	at org.eclipse.core.launcher.Main.main(Main.java:30)

Testcase: org.eclipse.jdt.core.tests.model.SortCompilationUnitElementsTests.test025:
java.lang.NoClassDefFoundError: com/ibm/icu/text/RuleBasedCollator
	at com.ibm.icu.text.CollatorServiceShim$1$CollatorFactory.handleCreate(CollatorServiceShim.java:114)
	at com.ibm.icu.impl.ICULocaleService$LocaleKeyFactory.create(ICULocaleService.java:378)
	at com.ibm.icu.impl.ICUService.getKey(ICUService.java:463)
	at com.ibm.icu.impl.ICUService.getKey(ICUService.java:383)
	at com.ibm.icu.impl.ICULocaleService.get(ICULocaleService.java:72)
	at com.ibm.icu.impl.ICULocaleService.get(ICULocaleService.java:56)
	at com.ibm.icu.text.CollatorServiceShim.getInstance(CollatorServiceShim.java:34)
	at com.ibm.icu.text.Collator.getInstance(Collator.java:483)
	at com.ibm.icu.text.Collator.getInstance(Collator.java:315)
	at org.eclipse.jdt.core.tests.model.DefaultJavaElementComparator.<init>(DefaultJavaElementComparator.java:157)
	at org.eclipse.jdt.core.tests.model.SortCompilationUnitElementsTests.sortUnit(SortCompilationUnitElementsTests.java:64)
	at org.eclipse.jdt.core.tests.model.SortCompilationUnitElementsTests.sortUnit(SortCompilationUnitElementsTests.java:57)
	at org.eclipse.jdt.core.tests.model.SortCompilationUnitElementsTests.test025(SortCompilationUnitElementsTests.java:1759)
	at java.lang.reflect.VMReflection.invokeMethod(VMReflection.java)
	at org.eclipse.jdt.core.tests.model.SuiteOfTestCases$Suite.runTest(SuiteOfTestCases.java:99)
	at org.eclipse.jdt.core.tests.model.SuiteOfTestCases$Suite.superRun(SuiteOfTestCases.java:83)
	at org.eclipse.jdt.core.tests.model.SuiteOfTestCases$1.protect(SuiteOfTestCases.java:71)
	at org.eclipse.jdt.core.tests.model.SuiteOfTestCases$Suite.run(SuiteOfTestCases.java:80)
	at org.eclipse.test.EclipseTestRunner.run(EclipseTestRunner.java:354)
	at org.eclipse.test.EclipseTestRunner.run(EclipseTestRunner.java:206)
	at org.eclipse.test.CoreTestApplication.runTests(CoreTestApplication.java:35)
	at org.eclipse.test.CoreTestApplication.run(CoreTestApplication.java:31)
	at java.lang.reflect.VMReflection.invokeMethod(VMReflection.java)
	at org.eclipse.equinox.internal.app.EclipseAppContainer.callMethod(EclipseAppContainer.java:533)
	at org.eclipse.equinox.internal.app.EclipseAppHandle.run(EclipseAppHandle.java:155)
	at org.eclipse.core.runtime.internal.adaptor.EclipseAppLauncher.runApplication(EclipseAppLauncher.java:106)
	at org.eclipse.core.runtime.internal.adaptor.EclipseAppLauncher.start(EclipseAppLauncher.java:76)
	at org.eclipse.core.runtime.adaptor.EclipseStarter.run(EclipseStarter.java:363)
	at org.eclipse.core.runtime.adaptor.EclipseStarter.run(EclipseStarter.java:176)
	at java.lang.reflect.VMReflection.invokeMethod(VMReflection.java)
	at org.eclipse.equinox.launcher.Main.invokeFramework(Main.java:504)
	at org.eclipse.equinox.launcher.Main.basicRun(Main.java:443)
	at org.eclipse.equinox.launcher.Main.run(Main.java:1169)
	at org.eclipse.equinox.launcher.Main.main(Main.java:1144)
	at org.eclipse.core.launcher.Main.main(Main.java:30)

Testcase: org.eclipse.jdt.core.tests.model.SortCompilationUnitElementsTests.test026:
java.lang.NoClassDefFoundError: com/ibm/icu/text/RuleBasedCollator
	at com.ibm.icu.text.CollatorServiceShim$1$CollatorFactory.handleCreate(CollatorServiceShim.java:114)
	at com.ibm.icu.impl.ICULocaleService$LocaleKeyFactory.create(ICULocaleService.java:378)
	at com.ibm.icu.impl.ICUService.getKey(ICUService.java:463)
	at com.ibm.icu.impl.ICUService.getKey(ICUService.java:383)
	at com.ibm.icu.impl.ICULocaleService.get(ICULocaleService.java:72)
	at com.ibm.icu.impl.ICULocaleService.get(ICULocaleService.java:56)
	at com.ibm.icu.text.CollatorServiceShim.getInstance(CollatorServiceShim.java:34)
	at com.ibm.icu.text.Collator.getInstance(Collator.java:483)
	at com.ibm.icu.text.Collator.getInstance(Collator.java:315)
	at org.eclipse.jdt.core.tests.model.DefaultJavaElementComparator.<init>(DefaultJavaElementComparator.java:157)
	at org.eclipse.jdt.core.tests.model.SortCompilationUnitElementsTests.sortUnit(SortCompilationUnitElementsTests.java:64)
	at org.eclipse.jdt.core.tests.model.SortCompilationUnitElementsTests.sortUnit(SortCompilationUnitElementsTests.java:53)
	at org.eclipse.jdt.core.tests.model.SortCompilationUnitElementsTests.test026(SortCompilationUnitElementsTests.java:1795)
	at java.lang.reflect.VMReflection.invokeMethod(VMReflection.java)
	at org.eclipse.jdt.core.tests.model.SuiteOfTestCases$Suite.runTest(SuiteOfTestCases.java:99)
	at org.eclipse.jdt.core.tests.model.SuiteOfTestCases$Suite.superRun(SuiteOfTestCases.java:83)
	at org.eclipse.jdt.core.tests.model.SuiteOfTestCases$1.protect(SuiteOfTestCases.java:71)
	at org.eclipse.jdt.core.tests.model.SuiteOfTestCases$Suite.run(SuiteOfTestCases.java:80)
	at org.eclipse.test.EclipseTestRunner.run(EclipseTestRunner.java:354)
	at org.eclipse.test.EclipseTestRunner.run(EclipseTestRunner.java:206)
	at org.eclipse.test.CoreTestApplication.runTests(CoreTestApplication.java:35)
	at org.eclipse.test.CoreTestApplication.run(CoreTestApplication.java:31)
	at java.lang.reflect.VMReflection.invokeMethod(VMReflection.java)
	at org.eclipse.equinox.internal.app.EclipseAppContainer.callMethod(EclipseAppContainer.java:533)
	at org.eclipse.equinox.internal.app.EclipseAppHandle.run(EclipseAppHandle.java:155)
	at org.eclipse.core.runtime.internal.adaptor.EclipseAppLauncher.runApplication(EclipseAppLauncher.java:106)
	at org.eclipse.core.runtime.internal.adaptor.EclipseAppLauncher.start(EclipseAppLauncher.java:76)
	at org.eclipse.core.runtime.adaptor.EclipseStarter.run(EclipseStarter.java:363)
	at org.eclipse.core.runtime.adaptor.EclipseStarter.run(EclipseStarter.java:176)
	at java.lang.reflect.VMReflection.invokeMethod(VMReflection.java)
	at org.eclipse.equinox.launcher.Main.invokeFramework(Main.java:504)
	at org.eclipse.equinox.launcher.Main.basicRun(Main.java:443)
	at org.eclipse.equinox.launcher.Main.run(Main.java:1169)
	at org.eclipse.equinox.launcher.Main.main(Main.java:1144)
	at org.eclipse.core.launcher.Main.main(Main.java:30)

Testcase: org.eclipse.jdt.core.tests.model.SortCompilationUnitElementsTests.test027:
java.lang.NoClassDefFoundError: com/ibm/icu/text/RuleBasedCollator
	at com.ibm.icu.text.CollatorServiceShim$1$CollatorFactory.handleCreate(CollatorServiceShim.java:114)
	at com.ibm.icu.impl.ICULocaleService$LocaleKeyFactory.create(ICULocaleService.java:378)
	at com.ibm.icu.impl.ICUService.getKey(ICUService.java:463)
	at com.ibm.icu.impl.ICUService.getKey(ICUService.java:383)
	at com.ibm.icu.impl.ICULocaleService.get(ICULocaleService.java:72)
	at com.ibm.icu.impl.ICULocaleService.get(ICULocaleService.java:56)
	at com.ibm.icu.text.CollatorServiceShim.getInstance(CollatorServiceShim.java:34)
	at com.ibm.icu.text.Collator.getInstance(Collator.java:483)
	at com.ibm.icu.text.Collator.getInstance(Collator.java:315)
	at org.eclipse.jdt.core.tests.model.DefaultJavaElementComparator.<init>(DefaultJavaElementComparator.java:157)
	at org.eclipse.jdt.core.tests.model.SortCompilationUnitElementsTests.sortUnit(SortCompilationUnitElementsTests.java:64)
	at org.eclipse.jdt.core.tests.model.SortCompilationUnitElementsTests.sortUnit(SortCompilationUnitElementsTests.java:53)
	at org.eclipse.jdt.core.tests.model.SortCompilationUnitElementsTests.test027(SortCompilationUnitElementsTests.java:1839)
	at java.lang.reflect.VMReflection.invokeMethod(VMReflection.java)
	at org.eclipse.jdt.core.tests.model.SuiteOfTestCases$Suite.runTest(SuiteOfTestCases.java:99)
	at org.eclipse.jdt.core.tests.model.SuiteOfTestCases$Suite.superRun(SuiteOfTestCases.java:83)
	at org.eclipse.jdt.core.tests.model.SuiteOfTestCases$1.protect(SuiteOfTestCases.java:71)
	at org.eclipse.jdt.core.tests.model.SuiteOfTestCases$Suite.run(SuiteOfTestCases.java:80)
	at org.eclipse.test.EclipseTestRunner.run(EclipseTestRunner.java:354)
	at org.eclipse.test.EclipseTestRunner.run(EclipseTestRunner.java:206)
	at org.eclipse.test.CoreTestApplication.runTests(CoreTestApplication.java:35)
	at org.eclipse.test.CoreTestApplication.run(CoreTestApplication.java:31)
	at java.lang.reflect.VMReflection.invokeMethod(VMReflection.java)
	at org.eclipse.equinox.internal.app.EclipseAppContainer.callMethod(EclipseAppContainer.java:533)
	at org.eclipse.equinox.internal.app.EclipseAppHandle.run(EclipseAppHandle.java:155)
	at org.eclipse.core.runtime.internal.adaptor.EclipseAppLauncher.runApplication(EclipseAppLauncher.java:106)
	at org.eclipse.core.runtime.internal.adaptor.EclipseAppLauncher.start(EclipseAppLauncher.java:76)
	at org.eclipse.core.runtime.adaptor.EclipseStarter.run(EclipseStarter.java:363)
	at org.eclipse.core.runtime.adaptor.EclipseStarter.run(EclipseStarter.java:176)
	at java.lang.reflect.VMReflection.invokeMethod(VMReflection.java)
	at org.eclipse.equinox.launcher.Main.invokeFramework(Main.java:504)
	at org.eclipse.equinox.launcher.Main.basicRun(Main.java:443)
	at org.eclipse.equinox.launcher.Main.run(Main.java:1169)
	at org.eclipse.equinox.launcher.Main.main(Main.java:1144)
	at org.eclipse.core.launcher.Main.main(Main.java:30)

Testcase: org.eclipse.jdt.core.tests.model.SortCompilationUnitElementsTests.test030:
java.lang.NoClassDefFoundError: com/ibm/icu/text/RuleBasedCollator
	at com.ibm.icu.text.CollatorServiceShim$1$CollatorFactory.handleCreate(CollatorServiceShim.java:114)
	at com.ibm.icu.impl.ICULocaleService$LocaleKeyFactory.create(ICULocaleService.java:378)
	at com.ibm.icu.impl.ICUService.getKey(ICUService.java:463)
	at com.ibm.icu.impl.ICUService.getKey(ICUService.java:383)
	at com.ibm.icu.impl.ICULocaleService.get(ICULocaleService.java:72)
	at com.ibm.icu.impl.ICULocaleService.get(ICULocaleService.java:56)
	at com.ibm.icu.text.CollatorServiceShim.getInstance(CollatorServiceShim.java:34)
	at com.ibm.icu.text.Collator.getInstance(Collator.java:483)
	at com.ibm.icu.text.Collator.getInstance(Collator.java:315)
	at org.eclipse.jdt.core.tests.model.DefaultJavaElementComparator.<init>(DefaultJavaElementComparator.java:157)
	at org.eclipse.jdt.core.tests.model.SortCompilationUnitElementsTests.sortUnit(SortCompilationUnitElementsTests.java:64)
	at org.eclipse.jdt.core.tests.model.SortCompilationUnitElementsTests.sortUnit(SortCompilationUnitElementsTests.java:57)
	at org.eclipse.jdt.core.tests.model.SortCompilationUnitElementsTests.test030(SortCompilationUnitElementsTests.java:1935)
	at java.lang.reflect.VMReflection.invokeMethod(VMReflection.java)
	at org.eclipse.jdt.core.tests.model.SuiteOfTestCases$Suite.runTest(SuiteOfTestCases.java:99)
	at org.eclipse.jdt.core.tests.model.SuiteOfTestCases$Suite.superRun(SuiteOfTestCases.java:83)
	at org.eclipse.jdt.core.tests.model.SuiteOfTestCases$1.protect(SuiteOfTestCases.java:71)
	at org.eclipse.jdt.core.tests.model.SuiteOfTestCases$Suite.run(SuiteOfTestCases.java:80)
	at org.eclipse.test.EclipseTestRunner.run(EclipseTestRunner.java:354)
	at org.eclipse.test.EclipseTestRunner.run(EclipseTestRunner.java:206)
	at org.eclipse.test.CoreTestApplication.runTests(CoreTestApplication.java:35)
	at org.eclipse.test.CoreTestApplication.run(CoreTestApplication.java:31)
	at java.lang.reflect.VMReflection.invokeMethod(VMReflection.java)
	at org.eclipse.equinox.internal.app.EclipseAppContainer.callMethod(EclipseAppContainer.java:533)
	at org.eclipse.equinox.internal.app.EclipseAppHandle.run(EclipseAppHandle.java:155)
	at org.eclipse.core.runtime.internal.adaptor.EclipseAppLauncher.runApplication(EclipseAppLauncher.java:106)
	at org.eclipse.core.runtime.internal.adaptor.EclipseAppLauncher.start(EclipseAppLauncher.java:76)
	at org.eclipse.core.runtime.adaptor.EclipseStarter.run(EclipseStarter.java:363)
	at org.eclipse.core.runtime.adaptor.EclipseStarter.run(EclipseStarter.java:176)
	at java.lang.reflect.VMReflection.invokeMethod(VMReflection.java)
	at org.eclipse.equinox.launcher.Main.invokeFramework(Main.java:504)
	at org.eclipse.equinox.launcher.Main.basicRun(Main.java:443)
	at org.eclipse.equinox.launcher.Main.run(Main.java:1169)
	at org.eclipse.equinox.launcher.Main.main(Main.java:1144)
	at org.eclipse.core.launcher.Main.main(Main.java:30)

Testcase: org.eclipse.jdt.core.tests.model.SortCompilationUnitElementsTests.test031:
java.lang.NoClassDefFoundError: com/ibm/icu/text/RuleBasedCollator
	at com.ibm.icu.text.CollatorServiceShim$1$CollatorFactory.handleCreate(CollatorServiceShim.java:114)
	at com.ibm.icu.impl.ICULocaleService$LocaleKeyFactory.create(ICULocaleService.java:378)
	at com.ibm.icu.impl.ICUService.getKey(ICUService.java:463)
	at com.ibm.icu.impl.ICUService.getKey(ICUService.java:383)
	at com.ibm.icu.impl.ICULocaleService.get(ICULocaleService.java:72)
	at com.ibm.icu.impl.ICULocaleService.get(ICULocaleService.java:56)
	at com.ibm.icu.text.CollatorServiceShim.getInstance(CollatorServiceShim.java:34)
	at com.ibm.icu.text.Collator.getInstance(Collator.java:483)
	at com.ibm.icu.text.Collator.getInstance(Collator.java:315)
	at org.eclipse.jdt.core.tests.model.DefaultJavaElementComparator.<init>(DefaultJavaElementComparator.java:157)
	at org.eclipse.jdt.core.tests.model.SortCompilationUnitElementsTests.sortUnit(SortCompilationUnitElementsTests.java:64)
	at org.eclipse.jdt.core.tests.model.SortCompilationUnitElementsTests.sortUnit(SortCompilationUnitElementsTests.java:57)
	at org.eclipse.jdt.core.tests.model.SortCompilationUnitElementsTests.test031(SortCompilationUnitElementsTests.java:1965)
	at java.lang.reflect.VMReflection.invokeMethod(VMReflection.java)
	at org.eclipse.jdt.core.tests.model.SuiteOfTestCases$Suite.runTest(SuiteOfTestCases.java:99)
	at org.eclipse.jdt.core.tests.model.SuiteOfTestCases$Suite.superRun(SuiteOfTestCases.java:83)
	at org.eclipse.jdt.core.tests.model.SuiteOfTestCases$1.protect(SuiteOfTestCases.java:71)
	at org.eclipse.jdt.core.tests.model.SuiteOfTestCases$Suite.run(SuiteOfTestCases.java:80)
	at org.eclipse.test.EclipseTestRunner.run(EclipseTestRunner.java:354)
	at org.eclipse.test.EclipseTestRunner.run(EclipseTestRunner.java:206)
	at org.eclipse.test.CoreTestApplication.runTests(CoreTestApplication.java:35)
	at org.eclipse.test.CoreTestApplication.run(CoreTestApplication.java:31)
	at java.lang.reflect.VMReflection.invokeMethod(VMReflection.java)
	at org.eclipse.equinox.internal.app.EclipseAppContainer.callMethod(EclipseAppContainer.java:533)
	at org.eclipse.equinox.internal.app.EclipseAppHandle.run(EclipseAppHandle.java:155)
	at org.eclipse.core.runtime.internal.adaptor.EclipseAppLauncher.runApplication(EclipseAppLauncher.java:106)
	at org.eclipse.core.runtime.internal.adaptor.EclipseAppLauncher.start(EclipseAppLauncher.java:76)
	at org.eclipse.core.runtime.adaptor.EclipseStarter.run(EclipseStarter.java:363)
	at org.eclipse.core.runtime.adaptor.EclipseStarter.run(EclipseStarter.java:176)
	at java.lang.reflect.VMReflection.invokeMethod(VMReflection.java)
	at org.eclipse.equinox.launcher.Main.invokeFramework(Main.java:504)
	at org.eclipse.equinox.launcher.Main.basicRun(Main.java:443)
	at org.eclipse.equinox.launcher.Main.run(Main.java:1169)
	at org.eclipse.equinox.launcher.Main.main(Main.java:1144)
	at org.eclipse.core.launcher.Main.main(Main.java:30)

Testcase: org.eclipse.jdt.core.tests.model.SortCompilationUnitElementsTests.test032:
java.lang.NoClassDefFoundError: com/ibm/icu/text/RuleBasedCollator
	at com.ibm.icu.text.CollatorServiceShim$1$CollatorFactory.handleCreate(CollatorServiceShim.java:114)
	at com.ibm.icu.impl.ICULocaleService$LocaleKeyFactory.create(ICULocaleService.java:378)
	at com.ibm.icu.impl.ICUService.getKey(ICUService.java:463)
	at com.ibm.icu.impl.ICUService.getKey(ICUService.java:383)
	at com.ibm.icu.impl.ICULocaleService.get(ICULocaleService.java:72)
	at com.ibm.icu.impl.ICULocaleService.get(ICULocaleService.java:56)
	at com.ibm.icu.text.CollatorServiceShim.getInstance(CollatorServiceShim.java:34)
	at com.ibm.icu.text.Collator.getInstance(Collator.java:483)
	at com.ibm.icu.text.Collator.getInstance(Collator.java:315)
	at org.eclipse.jdt.core.tests.model.DefaultJavaElementComparator.<init>(DefaultJavaElementComparator.java:157)
	at org.eclipse.jdt.core.tests.model.SortCompilationUnitElementsTests.sortUnit(SortCompilationUnitElementsTests.java:64)
	at org.eclipse.jdt.core.tests.model.SortCompilationUnitElementsTests.sortUnit(SortCompilationUnitElementsTests.java:57)
	at org.eclipse.jdt.core.tests.model.SortCompilationUnitElementsTests.test032(SortCompilationUnitElementsTests.java:1987)
	at java.lang.reflect.VMReflection.invokeMethod(VMReflection.java)
	at org.eclipse.jdt.core.tests.model.SuiteOfTestCases$Suite.runTest(SuiteOfTestCases.java:99)
	at org.eclipse.jdt.core.tests.model.SuiteOfTestCases$Suite.superRun(SuiteOfTestCases.java:83)
	at org.eclipse.jdt.core.tests.model.SuiteOfTestCases$1.protect(SuiteOfTestCases.java:71)
	at org.eclipse.jdt.core.tests.model.SuiteOfTestCases$Suite.run(SuiteOfTestCases.java:80)
	at org.eclipse.test.EclipseTestRunner.run(EclipseTestRunner.java:354)
	at org.eclipse.test.EclipseTestRunner.run(EclipseTestRunner.java:206)
	at org.eclipse.test.CoreTestApplication.runTests(CoreTestApplication.java:35)
	at org.eclipse.test.CoreTestApplication.run(CoreTestApplication.java:31)
	at java.lang.reflect.VMReflection.invokeMethod(VMReflection.java)
	at org.eclipse.equinox.internal.app.EclipseAppContainer.callMethod(EclipseAppContainer.java:533)
	at org.eclipse.equinox.internal.app.EclipseAppHandle.run(EclipseAppHandle.java:155)
	at org.eclipse.core.runtime.internal.adaptor.EclipseAppLauncher.runApplication(EclipseAppLauncher.java:106)
	at org.eclipse.core.runtime.internal.adaptor.EclipseAppLauncher.start(EclipseAppLauncher.java:76)
	at org.eclipse.core.runtime.adaptor.EclipseStarter.run(EclipseStarter.java:363)
	at org.eclipse.core.runtime.adaptor.EclipseStarter.run(EclipseStarter.java:176)
	at java.lang.reflect.VMReflection.invokeMethod(VMReflection.java)
	at org.eclipse.equinox.launcher.Main.invokeFramework(Main.java:504)
	at org.eclipse.equinox.launcher.Main.basicRun(Main.java:443)
	at org.eclipse.equinox.launcher.Main.run(Main.java:1169)
	at org.eclipse.equinox.launcher.Main.main(Main.java:1144)
	at org.eclipse.core.launcher.Main.main(Main.java:30)

Testcase: org.eclipse.team.tests.ccvs.core.subscriber.SyncSetTests.testConcurrentAccessToSyncSet:
java.lang.InterruptedException
	at org.eclipse.team.tests.ccvs.core.subscriber.SyncSetTests$TestSyncInfo.<init>(SyncSetTests.java:53)
	at org.eclipse.team.tests.ccvs.core.subscriber.SyncSetTests.testConcurrentAccessToSyncSet(SyncSetTests.java:107)
	at org.eclipse.team.tests.ccvs.core.EclipseTest.runTest(EclipseTest.java:1391)
	at org.eclipse.team.tests.ccvs.core.EclipseTest.runBare(EclipseTest.java:1238)
	at junit.extensions.TestDecorator.basicRun(TestDecorator.java:24)
	at junit.extensions.TestSetup$1.protect(TestSetup.java:21)
	at junit.extensions.TestSetup.run(TestSetup.java:25)
	at junit.extensions.TestDecorator.basicRun(TestDecorator.java:24)
	at junit.extensions.TestSetup$1.protect(TestSetup.java:21)
	at junit.extensions.TestSetup.run(TestSetup.java:25)
	at junit.extensions.TestDecorator.basicRun(TestDecorator.java:24)
	at junit.extensions.TestSetup$1.protect(TestSetup.java:21)
	at junit.extensions.TestSetup.run(TestSetup.java:25)
	at org.eclipse.test.EclipseTestRunner.run(EclipseTestRunner.java:354)
	at org.eclipse.test.EclipseTestRunner.run(EclipseTestRunner.java:206)
	at org.eclipse.test.UITestApplication$3.run(UITestApplication.java:195)
	at org.eclipse.swt.widgets.RunnableLock.run(RunnableLock.java:35)
	at org.eclipse.swt.widgets.Synchronizer.runAsyncMessages(Synchronizer.java:123)
	at org.eclipse.swt.widgets.Display.runAsyncMessages(Display.java:3659)
	at org.eclipse.swt.widgets.Display.readAndDispatch(Display.java:3296)
	at org.eclipse.ui.internal.Workbench.runEventLoop(Workbench.java:2389)
	at org.eclipse.ui.internal.Workbench.runUI(Workbench.java:2353)
	at org.eclipse.ui.internal.Workbench.access$4(Workbench.java:2219)
	at org.eclipse.ui.internal.Workbench$4.run(Workbench.java:466)
	at org.eclipse.core.databinding.observable.Realm.runWithDefault(Realm.java:289)
	at org.eclipse.ui.internal.Workbench.createAndRunWorkbench(Workbench.java:461)
	at org.eclipse.ui.PlatformUI.createAndRunWorkbench(PlatformUI.java:149)
	at org.eclipse.ui.internal.ide.application.IDEApplication.start(IDEApplication.java:106)
	at org.eclipse.test.UITestApplication.runApplication(UITestApplication.java:138)
	at org.eclipse.test.UITestApplication.run(UITestApplication.java:60)
	at org.eclipse.test.UITestApplication.start(UITestApplication.java:210)
	at org.eclipse.equinox.internal.app.EclipseAppHandle.run(EclipseAppHandle.java:153)
	at org.eclipse.core.runtime.internal.adaptor.EclipseAppLauncher.runApplication(EclipseAppLauncher.java:106)
	at org.eclipse.core.runtime.internal.adaptor.EclipseAppLauncher.start(EclipseAppLauncher.java:76)
	at org.eclipse.core.runtime.adaptor.EclipseStarter.run(EclipseStarter.java:363)
	at org.eclipse.core.runtime.adaptor.EclipseStarter.run(EclipseStarter.java:176)
	at org.eclipse.equinox.launcher.Main.invokeFramework(Main.java:504)
	at org.eclipse.equinox.launcher.Main.basicRun(Main.java:443)
	at org.eclipse.equinox.launcher.Main.run(Main.java:1169)
	at org.eclipse.equinox.launcher.Main.main(Main.java:1144)
	at org.eclipse.core.launcher.Main.main(Main.java:30)

Unexpected crashes (1):
org.eclipse.jdt.apt.tests.TestAll

BUILD FAILED:
	Ant Error Message:
C:\cc\cc-suites\scripts\cc-exec-adaptor.xml:101: The following error occurred while executing this line: C:\cc\cc-suites\adaptors\eut33\adaptor.xml:59: The following error occurred while executing this line: C:\cc\cc-suites\tests\eut\build.xml:549: EUT failed: There are unexpected failures

Date of build:	08/22/2007 23:03:57
Time to build:	234 minutes 1 second
Last changed:	08/22/2007 17:08:58
Last log entry:	snapshot

***********************************************************
Errors/Warnings:	(17)
            
File C:\cc\cc-suites\tests\eut\eut33.windows.efl does not exist.
[move] Warning: C:\cc\cc-suites\build\checkouts\eut33\eclipse-testing\results\chkpii not found.
[java] Java Result: 2
[java] Java Result: 1
[java] Java Result: 1
[java] Java Result: 1
[java] Java Result: 1
[java] Java Result: 2
[java] Java Result: 1
[copy] Warning: Could not find file C:\cc\cc-suites\build\checkouts\eut33\eclipse-testing\test-eclipse\eclipse\org.eclipse.ui.tests.performance.xml to copy.
[java] Java Result: 1
[java] Java Result: 2
[java] Java Result: -1
Processing: failure using file C:\cc\cc-suites/build/checkouts/eut33/tmpfile.unexpected.failures.errors.testcases
Processing: error using file C:\cc\cc-suites/build/checkouts/eut33/tmpfile.unexpected.failures.errors.testcases
The execution FAILED with the following exception:
The following error occurred while executing this line:
C:\cc\cc-suites\adaptors\eut33\adaptor.xml:59: The following error occurred while executing this line:
C:\cc\cc-suites\tests\eut\build.xml:549: EUT failed: There are unexpected failures

***********************************************************
Unit Tests: (0)
        
No Tests Run: This project doesn't have any tests

***********************************************************
Modifications since last successful build:	(2)
            
add cc-snapshot log20070822170858Lbuild.1 08/22/2007 17:08:58snapshot
add cc-snapshot log20070822100152Lbuild.10 08/22/2007 10:01:52snapshot

begin 644 execution_log.zip
M4$L#! H    ( $ 7%S<_5DQL85$  /L8!0 2    97AE8W5T:6]N7VQO9RYH
M=&UL[;UY<]PXLB_Z]YV(^0Z,?OWBJ"/:92W>;Y^.D&2Y6SV6K%#)[?ONN,-!
MD:@JCEAD'2Y:^M,_@$L5%Y#(! %J,>Z=X[:E_"7REP 2B96_+)*E_^LOEZ%[
M]^LOJXC\^HMMQ<F=3_[[OV9AD#R+O;_).^O-]O_[O__KUW_^(TJ#=__\QS__
MX1*?)&2RBL(5B1*/Q).9YQ/Z*\NR_IW_\B_K/?NO%\S?68?OOCH._=^S./42
M$G^]3#W?_>HLB',5IDG\E:3)WMY7XOC>*B;/J 2#?6UH9^4Z83#SYFG4*GKB
MA,MEF!O7+900>^E<Q_U2^6]]8@>32S(+J4#.FD?-<KV(.$D8W4ERC$B<^DFL
M27OQ[V'5$I%5&"63Y#9ACJ&^F)2NLQ.O<#G[*2LTSOU$2R.WQ/G+.F :,Z=:
M[->3VZ5?%ZC_R_;]=WV_CTGRQY\GLRA<?HY)-%T1QYMYQ 5@SM9UW"O\'S>A
M#6E%#8Z2,.PWYC]IX"4/QEQ[U6^+V%JJ+"&W0[50^\_3(/&69#]R%MXUZ97V
MVNJRORZO:-/_RSJ,B)T0E_4#V2!2=+"OK9:GJ1P63D<IZ,8+]G8G^9^W;UX)
MZB1=B6HM73W[VVM*:8E*[+_/JJ%)EZNZ"VJVPCBAH>>"BI_YZ9S^L]=9ZY'C
M@@XG#(1MX@W?,TK#5*1>QKF_Z]K7-D^J^+NS"/^R:,\-6 V'T7Q2^&U"P\*$
MQ84\OD_^<),+^B]&>\H,GUCG68.T\B@O55'/BS;]O-&FGV/LH!U\PF/&>.?L
MK6L2Q73$LG[8F;R<;'_;?O-#-^ /^N?6Q<E/UJY5Q#/K*+CVHC!8DB#YV9HF
M=N#:D6L=N1X;!JVMC*I5JGYVN;WW4[]ZZ_<PF:[")"OFT/>H7NO/$YZBGZVE
M=TO[PC)T28_2_D;K^[37/BM<S0NZ6=KWE_7%CH(L/4@6Q$KL^,H*;,K^E^S7
MOUI>;+F$)HH.ZYT3BXYLUB^WL9_\FG4C8KN<6BA57T1V$-.4:LD:F1<DH<X8
MR/Y&NRJU\R_K-+3(K9>!+0H.T\@AL45KT I"*Z!:J7-9X_K9<D,F$X3)@OZW
MUZ$L0Q2$U77BV%\IO3)S$IQWUAECN+JCP9+^R>S>R;JA-=BQ_-'R\360CM&X
M*(UF6;09Q*RLP>[ZVAVKOC6:*0M5PZN(4<,4VN^*CZ'M,C]D_XP7A"0*QMSR
MEU]7^:A:,Y<)?OWC\^GQQ>3_3#^J2RDCXA_1QGG/6:Q)P!Y/ @:)Y.(:S*:Z
M%YPY,-::,"+ZLCG:.T@P+W*HC<FC97%=Y9OLS61O8V9O)C/[/C.S:OP9*2_K
M+?(Q967YWY?A=;6E#7.6L[A:>1[KL-8L3(-F ZS_:^62U#.)G4GLGLC*&FW/
MD]0K<J%]WS][?S1N,M9I@,G&3#9FUM),QO80,K9JD!HI8^LM\C%E;/5_V<&]
M;^Z:[.F[RI[TKF71]ESD+JR<R7Z:A$M6->/N2_9;83(IDTF93,ID4@\ADZI'
MJI%R*4&ACS>;8@?O[*A_@#09E<FHJKY_V.M118O>K >-NQK54;S)H$P&93(H
MDT$]A RJ%J)&2J#ZRWS,^5-$HCP"FQS*Y%#@)25 >"Y:P\5#/XR5+1CEZ4[1
M$S;+1V/G7B)+3!IFTK QTS#Q7,DD8=]K$M:,5:-E8L*"'WDZ5G9=DY"9A$QI
M0E8VK$>5DI5&/X2DK,L6DY:UJZ_,8 _I/XYN';+*GBFP#NV G3-ULHZ9#^67
M=!Q-Z1"Z3EZRGX8SZX8RGEO)W:KX7?S.>O^.=LCEZJN;U6#V]$&/Y_^7G;0-
MHV,NB0+;SYZ9B._H>+V<G(6^Y]Q-2!2%T5;Q#Z;BW<N7/9P5J-]6H=X/'?J#
MC^S/#^R!C2SX;6W^G16U^_*U=%E9 7'"?L843K-BRW!R8@?VG$23FXCVO*WN
MWV=6O-V69PRRHI3^ K'FQ6OYZMT$ YIC_8>.9;D#WI/8B;RLL6^5O\C*VME^
M^VK$PE[+UW:[L+RWUHO8??D&6T(>17GU>1)>9PL%F0C[QX?0=TFT[T1A'/\9
M^NF2Q%MKH9SBV[X8Q\J/TX!RF;'IQ^24AHIK<D*21>CN.RPE#J/CY<JGUER'
M5V1[*Q>P<@EUBK<Z?Y^1V'N+*(KE3G.;1<CNXGIEBGH3%,G^-O'M8+XN.%=5
M%E'\*X]?;X3:6)XZF45T^G031E<35H&'=IR-#^SO6^L?Y+7ZZL4 A0=V1)H*
M]T0!AZ<PSRU^W&&O$B74!5N;'Y8=3-29N]4R2\]RO<1M:]Z5\<!&,\=442/K
M<VG3G;LR[LQ/855K//])WB"E:FBMLJ5.W,"-A8,M;$YO)T?Y/[+&1S-Z.L(R
MO>V?YF'OI:B-#]._*^R=+?TL365J]E<KFI[EB67A['B+]\N"B*)R>HK8,</<
MPQ_FJO5,_B?U@O!VD^C8JU79?FGU'H9!8GNLK=+TQ\^+V>+].B]Z3Y3F((K^
MG<X;?5+M.9L?YN$=/]\IYWF;(EU[19.Z2K$?[32@4_&LRU;:]Q9' CBX#K(B
M3NPHZ2S\M739C2*GK)AZG"I_E'>*5YB:'5+2CI"3B2$/-(;X9=L\H3&A4/NA
M',2WLA\6"PF8$96O_=*./8<.HQ6U+U[(1)^ZVJBF<6?GE:@BQ2J7](^:SA<8
M]EE7ZE78FTT)%M;RU/N=M6LV*AL%FXU*LU%YOQN595N[AZW*SJ(?[V9E&,_-
M0Q!FCU+I'N6GZ6_>@]^>9 V_/"!_/YN2W1:8K4AS0LSD28^Y-N\I3]J$E)&R
MHYX"'V].Q 8><DM;4LQ"K#G"9=(C>.T\]'N)U3,"E39^?S<5@0:9E,BD1&.N
M19F[BX^@@=SG:E0K5HVY'B4N_/%F7^G*M05CJ$FZ3-)5]?U#?UXK;]+WE6/Q
M2S<)E4FH3$)E$JJ'D%#5(M2(+VJ)RWV\:53V@=;0O*IE$JDGE$BQ1EU[(I2Y
M*F<^7C[5:X1)JTQ:-69:=:_+R1T]X?/Q@^B0I1FF2YHN:68Z9J;S$&8ZC5 U
MTCQ'5.KCG>7\QTT8HQ6)9F:B8R8Z3V:BP[Y 7#EYS-HWC7UVX)#)IR"_0#_F
MU^(%II@,RV18)L,R&=9#R+"ZP]6('X\'&O!X\RZ:O/SQY\DL"I>TC473%7&\
MF4=<4<)#,;3BJ4L23_0T7I[8901)9'([D]L]U=RN:.+Y)]Q)-.[2&<06=';W
M0\_U6CHX/;/]U<*VWF7?*F9OLK/^0#V4?P<F\2Y]3C,N\?%U8/VW%;U\]?K-
MV^V?K:W]=&[M[EB[V]NO?_K9^N(%;G@3/_?LO=WGR_C:L7;V=J@8^W"T30?#
MC%^W\D62K-X]?[ZPHV48W$WLE4U]/*'^ZH:<V+?6@M@K*_;^IC7EV,%_)=8E
M89D.B:Z)R\IV4X?E.*'U=N>-=7)@V0YU>1;:Z<]H7INDMF\MR9*% -];>HGH
M2;S:'>4=DWHV0ZQ)/4WJ>?^I9Q%,[R?M["K<I)R=PD7*R48AVIM,SFERSB>;
M<Y9M?+*R(]J9LH?D]GW_OM+.+G-,YFDRSP>56#SHDQ[W$T$B,B^NHCR8*,(Q
MR402$TE,)"G^1:YM/\WJYUO6<QY1XL),O^\X4[/!!):'%E@N%K2?>ZR+T(ZS
MRM[GIG\IOEU!7<QNF[O6Y5T1)*(Y85N_W&:YJ<2)%TZ./ZT_@=$MS-XI/ Q=
M,@V\U8HDWU[O9F\G?@ZN@O FL*99_T6_2/GGR7G^-T8]?T"R>'.V]AL&5/C:
MY=X.YOL#O%Z2NW=2<4C^PO./N\5[R8V?%^6^Z'OJE%N_[*,<TG6;N>.(J4#4
MZPM3KR/4Z[WUV[TW;TT%/\6.N_=VQU3L4^ZYK[=?F0I^BCWW]?8;4[%J*]9,
MPLU&LME(?N@;R>7"YOWL)'>6;K:2.X6+K61V9MPW^\AF'QE<.X]L'SEKX.R^
M+4LD3M@_[O7X8I<Y9I'VH2W2'OIV'%-7+;(*^G]8]1T'-,OUW/5O=K9^LI;V
M'4M@2,2^,UR=?7RP:2^UL@G$9-)3SK\K@G]9[_;>O=A[9QWYA%TDRC]*_(-3
M%DA_%-W]8"W3..,_H\E5>)//;8A'?QU9=I)$WF5*;8GS,2/_!E;\L_7#KS^P
M^O_A^:\_0/>\S+=EQDRW'U;<=,/EA(J-_A2<P P3)Q]"G#21X#N*!%3D [L>
MEB3W?/6C;8B)!B8://EH8);A'D$#>1C+<-GL\G[6X/A%/]X%N-1\<\ZLBHVY
M*J;S%;RT_(K;Y^RK=U-F[7B/>_,*-^^Q6,_8_[.8:[*O:*>K;M&*T#O6SS^O
M>I>4:N)T((S>AS=!+P)BY<7=BIS9\YX,N"H%M7,CK\Q05L=B0TLIJ*$;^>_/
MT-](\I[$3N2QS\'WEUX3A9K< *FT>]]A7WO_$D97ER1P%ODT3&@-%X5@TX%7
M28Q5<QB=DSF=;41W0HOJX@@J3:!*#F<TQ+/E<NHK,!$.!L&&BU9**2(S$I& 
MG-@![83BWM($8,BTH"J93!=V1-SC)=4<"TVI"B,8U&$JK6=]CV8H4Y) *Z*%
M0/#@8%63J002<74T 4@J=:@R)I]6)$!%8@X RH0+U<ED%VW/[@ NNXK)L(1A
M1VQ%)H8QNP HMQ7@[4P,:ZM*OQ[Z(6]R7"TV$X':6 AK"2SPL" 32DP#>*@-
M($]4Q9.0FB@Z$58\'9G"[9[*V#W59#=+V4#9U!DRC3I3GS]-%\3G+-VV\C<J
MA<KW,GGET0#6M[&Q0*&AQ_'^:N47IW%.2)#V6] 2AYK. :KK=HOPYD^/"'*V
M4@K<V=;RWTW<W<P68D'.596$6EO'Z#!:,/96)26,5CD"5]3N@0W8DS!Z3Z'1
MK#=\^_-X>GSP\4C@ZIHHU.P&2&DPSE>+7HCC:R&("<EKB :+H:7C[54[+'^;
MEBMR^Q&Q__3B_C,I?2C$L-V!UU /@+2^$,37A)ZV+H@K%4&\Q2JCRD;K2VCQ
M+_$6O]1B<?O 34?QK_ 6O]*VI(U9C)9;PE8[IP*;/I4RO8E2Z?6/]B41SU8R
M*82G"WF5AAX'JS01%IQ)(0PMY)49FLU^[430#$HIJ*$;>66&'D0T_[H(+T+!
MYOE&#FIL%:%Q*1^^AH;>@]2W^EU.V4Y27]"6JY+8"6&.T6+T!SM&&,ZD98S/
M<>K:>CI__>K5J[>"=EM(@=OY6EZ9H1]H>Q.O$Y124$,W\LH-/<^W41U!O&N)
M8TVO %6&%*9:O*:822'"1R&OS-#?/9<PG5^\9'%F1X+^UY2&&M[&:2$ ;#%<
MB P5'2V'Z9_:U\2F<SEQ=VU*8UC4<6J7^9AWF/Y30ES2<X&B X!: FQ"U8U-
M5.G1;$8SXS@_$9'=#!:,-%P,>)SJ0*NM',C:2D4051G*5U<J6@71M"HI8;/*
MJ)JIW?=]N-T;893I59C:=@]H(QLY5/M6W4*.WQ\QO5!WM\3!FSAMH%*70PG(
M6:_-]/5A1'&R@S2YBE ZX=C/7NJ:$L!L8RV*F6I40$KS J#=-5%,1J##[FEB
M.U>?(E=TU&\CASA+OT:HW>4Y/#_:OS@2; )6)5%[/&N,#J,A.U.%I(31*M?J
M*VH%B_5520FC=6T"0MI'*2JS":B\A11Z(=XN167L5KT]4EF>9JD^6[\13XQZ
M@*CS)ETJ=#)DJU0>*^;,MQVR"-GWN.+]Y")<?237H@D(7M\ ?P@UC^ZFXZ#R
MKP_9GVI8<12K=ARWB'OPH%JWZ?*5<@?1=/.4K>O\;4<NS>*BQ$D3<4[;AB#2
M6QY8[7'!?-T;3J>%0!TC;&$U[>'"^?! <KNZFE@U&KR841. 8-.&*FULU#_$
M17%I0S#-C0-6NX(#WGIO2J/6</1LOY?+0_#ZX"&PBU&::B/;#MM](S@B4TJA
M-MDR>:6K"_F:!>!(04,8L\)0@RE-$?8#EVV,Y05DPZ^=.(L/OCT7-!\!&), 
M]*HQ!Z>[^M]]'9PV)TSY"'/"%%X/YH2I.6':MMB<,.U"F1.FYH2I.6%J3IA"
MD-_?$<)'<_SND9[',4=;>A'F6(@Y%M(/^NZ/A93':,6E8X^U*AY*INQQ;>>C
M-R/.G2.:<C>$$2=9ZC!EUK^_"^PEV/RF--3^-DXU ?9FPF$8Y%]1Z?VJ9P\(
M2:<-5]RH<*3X&%P3TTB)O<S!)M>BT]X;.:CI5812<[,T V!N+H<QMT0H-1<V
M.:M*8DS6,$E[K \9[;LNT_C1BQ/V"2G!Y+8N#)X3-V'*K#\GRS!W"8Q 6Q[*
M@8=46@F;52-X7;0QF"KAH577#)95)PQ93UJY5;27D40463D(<,#B8G60.5S8
MP1Q!I9"7(+)&JKL8$7B"*0&3 %]_R&35)79>O&*7M^J+5?E4@WT/84[K]""=
MO]EYL2O8&\)H J> *)WJ(D0J2 *I +C7ITHS5E)\WQS4(9K2\*V")N[[Z RF
MWK75>Y$DAL&!#5B*VH@BD] 2]/T]]OA$]C;8;IJ@=6<BF-TYQ>T8-(U"3J T
MO*6:?><'X,M2$&/M&J+2XOR3 R0B[JF]%'NX+HZPO@E4&BO*"'H6A=>>\/@^
M#X&)(6VLR@,)2#(\!.)P@DXRU=%AO? &^%@+#R0S(M7@9FPR8Y,9F\S8! &:
ML8E'YJF-36P_"/HAGHHLHC9J**6-*K&3-/[HP3_IU$)@&E4;JY+,11CZ=+2&
M,JF+(V@T@2HY_.:'E[:?9QZ_VX'K XAP, @V7+3*OHZFQ,<@^KM>2L7=FFQW
M,GLQ*TP@#W1UPI!W>G@*M'"#6R/#P%0(FAN[PW4:GA#VV=<0;EH-)L.MH>#[
M;FP/>@5\6N[E@TYGUH41\;4.4WMB($K*?=6+4#P=XD)0IP?:8'U\()/G#I T
M)^73Z/*\PJ:0#U&X%%=5-PY[4H*G03,]2,WU(8=15%Z'K(#?/=<EP9<%"?)S
M5C16?@[B[+W,?AL%8/AQ*8$:W6RG\ERG*IA.]?+\=!D[*9)@B9%CMD$KI51<
MF,U*R XPPIMI)Q1#L$>)7I[0!MH!',118^,\(+,PR@YW>L$<VKYJ('SS;,"U
MU1NXSW% LO6EOM?EF=V', W<38OH-XH+@3+J *M,Q-9+@. SD"T$(@7C8!4G
M*$@^'2!<6J*3577)&;XX+;.@K>-8S]$UG1JSIGL<V* ;X%TX]%$?C@:-]("'
M4GN \@1U'%%]!%N"H TKY#:5^LVI(S];'0+<4BP$,=<4UQ"5ZR0PBZ=XBZ>Z
M+!:UU"FFI4X5M]0II*5.<2UUJKRE'L='RU5R)UB3RX7 2WBEN+IT)?_*,<WO
M+L)OYR0.T\@AF^^Q"K*/?C XB1&IT</VO1?1L'\8+E=VY,6B5* 7*L6TK40/
MS^-@02(OL85?V>E"2;&KX?40VW?M54(BP:O>7(@4I0U8*Y]BKU>"5HD<PFZC
M8PR2@HLB?4@%)%5>!&&+X5&X(E%REQ^)AU^ X\(PB_ ="E1R.R<.RXVA T,;
M@.#3AJID@N @9;T6NP\C0J<C4-.;TN!77%HX;0385@-H=[D'*$NKID(;P_6L
M\KUG^Z%@\5$ EF7:4J/VH&.]FXHG9"T$ZKAC"ZOZT#&D:]5$D4>-E7>JFEZQ
M^^4<K\?EQ>:CQ(C9AT1N?>H>-_-BH$VK*8TCHZ6!E3Z9VC,BFLK69:'&-U'J
M]A6B*&27*5Q/O,Q;EP7O)#10*M^:<:ZR3V>P,>K<FR]$[UNU 8A79MI034P^
MDAF*").7XY$C-=$0/F'9$I<CH?9!R[KN@S!)PB7&FAPAQZ3$JB7#;DH!5E6K
MHBCS-R"E3S&RF2A[&%^0R54D,8\P;C#*C#X)\Z\.BXVN2D*-KF-T/ AR3F+1
MT-N4EG@,I,#I(,#VJ,%V,&$)\W.8EO=8LB/+B1VX= H2 )X0[,?*O-/"TZ*-
M*NQK=UTH67H:OG-7*8)U4C2O*DB"5AVN@Q737-RO 7V>H1<JP9"G1-UK/83V
M:->F@V_*+J4<.\(G&-L \-L[/*@R)J?L 1\D&3X&RJ<+K>XQ=-L5<RB$P,^@
ME^(*F]#,3GU1@E5*P1M+*:\NK4ICFE]>>(FH!U<$P4E5%:)N=LJV<8L$\SV)
MG<A; ::I?!!XOMH%-PWFX3>8T]3W ?:NQ<"A;@-0[%WQ$8V-',ZWB@]JY$JQ
MG;$+A:.BM3MNO,7NIDGQZP3C:ZQ#C0D^#S_X/,W1RH0I$Z;&#U-_A)Z $I. 
MVIW+JIN7I//7NWM[KP4SC4(*/#-9RRN]SIU]8M0+YM#/0M;E,5>[FTAE--B'
ME# TVO)0&CSD0!K__F GMF]EVV!_6>]VZ/^WBJYC>;$5A(EE^WYX0US+"ZQ5
M%/KAO*>@AKIG.^Q_UEE$EG:21L2BTW$KG%DSSR<]6FJ;X\?OQ9OB5 9SXOZ]
MRDS@(O*6Q\$LC"A%8:1K"$.-;L&4[@ML7MD1K_)O9#%[ U644M/+M<4#6]#I
M&L(8XVLPQ<<*?B?V*G=.OQU-:=RQ@BI.Y2F\H]LDLEG;[#>B*HDX@U?!J%LX
M9KN90+/KLN"EX09*W7:I?=U\&+W?$@X O'7*@RIL^C1/B[*@D#T5DQ_=$35D
M'@;>#?AH;90^AHZ]>5@;9UP=*TNQJ47E>35VW2&,/=$W<:J2B.&Y@E%F-(O?
MQ4DQCPAB;5T6:G@3I?AN-=3XIC3N1K46 H!O\*(^P*OZZ[LLV+'#"^<DL:,Y
M282/#'  F,#:@JH;DO,+L $K85F]!0OXLC ?!QZN>S1HI0>[/]V''$)1PQWJ
M?;]XAU!@32D&-G\#4#CJN1!;UV+PL<Q5;NMI"#6W*@G?;-9B]$64$HC)&SGX
MC'*#4-D>/D4'/LSFAC"B;=1A2EMSX$)=WI3&M.TZ3N'DACV%G66 N6Y!KM"6
MAT]RVDAUX_%=G)!E>:X?4A<\!'A$YF+596^WJXC$\7KD $6@#A XE^N"FT&J
MNV@S2)E!R@Q29I#Z'@>I@XC.0R]"X9V8C1QXU[""4&;NZS<O7F_WEYN)0(TL
MA)7.4Z^]Y&XS5Q3/+.ORF#EI$ZF.1G"7[>-]\/Q$^ )"319L?@.E^"$RXGZQ
MHT"\G%,7QCTX5H$I7#";A>P$P\+SW4AT:Z0A#%]$:\ 4+J<M"=M!MCWA+>":
M*'P)K092>/0,>%I%XF2*GE,H-)_[%(#-;DHCLL8&3ETN$(4L;%W<K43+VE5)
M\/A?PZC<ZLG>MCJQ5RO:[X4;MW5IQ'9. Z=NW]R.KDAT2-.B>1@)-Q2:TN"=
M\Q9.X:-LAV'H7P(O_#2EX<^T-7$*"50N$$$O+G6 X'0ZX(H'W7-R36S!)PJK
MDKCAML0H,QKZK@/^10<M;SFPSW]XMG\6KE(?<-RH)0Y/#UI A>?E?++O0IYT
MJ$K"S\A5,>K6\;(,^SUQPL@6GO!K"(/7[9HP=;F-%R/,;TJ#LYP6SKC_:;C_
MG,PB$B_ G])MR\/SGC;2T#"=X0%UAM/PZ-8AH!G76A ^V:I 3(-Y&@TF>Z^4
M*1=,M39R\%.R&X3*J_IKO>L )EZH[X0A+NQW*5!W36D3D,L9=O&:;+]MW3CP
MY:0>#::C/XV.7HSZ'U+?Q^88#0PRSVBA55/ZR-Z4PW)J@I"DVG"53X\EGB-8
M<,AD$(^-9=+J.L-=8"]%-A9"X*9?BBM=/IF28AP29T0M<<QB2@.H=KO.3@"/
M6E4E45MT:XS*56A2?89(N)I<DT:L0C=PR@C\WS!<[@=NZ9Y^.QK"4/-;,.5M
MAFU&9>\,PAK!6AS;>BI Y1P^)0L2(4ALY+$LJDCE-&!/FS6EL10T/&:6O_<-
M,[\NBWM17(/IQ:4CF.T-8>3%)@W6EW4*N;1=E\6V&N5WSDWX-^'?A'\3_DWX
M'^!X]N0JBQ'9!YI9LR1N'JCW9PF)BBKW@CF@7C"J,"]!(Y2J]<OGX.^LY.EP
MOT!5H?P"5ZK6+^6-/V!_Y4%0/-M@M7SVL6SVY;DTH3IZ<M$>V">OA_3B?C42
M/5BD<%Q?0#)>A"*E_E">*_/BQ1"?0%4-B6>C^:4QO@QO*V)50\:_T?SRN^>Z
M)&B,NP![N3@4XPX-6ND!8R,'-82:OO$L=]J7A>=GZZYY(P*/4%RTQ$C7H4=K
M!V8%*4E?.Q0-Z;R=*K6&>GF/P!0-"?,C><0DK29I-4FK25I-TFJ25IZ])FF]
MOZ0U6YO-\H# A=[#[@#AUH,Y<-VLC@/H9@- P4"V=55ZF)_85Z2X9R5)O4.#
M%/=.7=K)9U.@/": IF)0-4/=P%&HQQ?E]M%Q4$DD$#9S\5+L.S1IH"W%=2!!
M_:QJ+I3JTCSXP*K4W)EEB YC-T9\*MTW)#AUZAA4H>.$)6G>"LCJ9,B^]7!T
MZ\6;-!L1B01@S/<F>M4H97M*;B06//N0&)[=.O201-8F'R=%4&<=UEL+NB)[
MX?*M5F^55D+>0/I031A/P'7J<HI\OP8HD73%2+V]T_G(W@_3HZ19Z(P.O J0
M]\3PD A0IG4\A^:C_=@AH[F6_%30OC"L06H4M7LMOOB-)) /XZS%$!^84/XI
MG./E*HR2C]0K_65OY,#OL%00BLV=9G=0(<7GDCB32XP6HZ&>WDC+&*_8ZU.2
M768DMP+3-W+PIY$V"*7F9O.U]5M[TR1*'?85-[$U'4 ,H4X5*AFRQX+BBS"O
M=:%--6D$EP9.)8%/UR2ZB;R$E'?*!>&2"T%0X8'5W0GQ5L"H7Y4$WP:I8=2]
M?FU'0*.KDN 7L&L8E9Z&M/FU&,+'RELY=0'$UK48PK4Z;)7HE%TH!),1NJ8$
ML2X4HCF-0(Q]+2U[-2XY#T-QCZB+(Z@T@2I;'89#2QS1SK1Q.+IE71'8KAK"
MB.]BU&'?Y62E\$(8KCT!\EI%'NGO&E(QC0^A[Y(H3Q;?>Q%QZ(3T#IBH0C3@
MJ(ITJ2;/\LI!W/L4(*GWJU+,?#TD0$Q;"^,856"*K8>$BJHDSFY- 8,.8)#2
MJ1C.W R@WE;V$5'V$231:CD'@+:_"M7 ).M4Y=<&RLXE_A"H$(_GV:UI1-I9
M"I(%VL$>J*A2YXR:TA']@F_Q8DWJO**QCUR(OOV^%L/1N5#ZO?>U3EP]U0!H
M^_5Z?5!DZL/C>8X6F?H*0T8FH"IUSM 9F?K*Q;=XU9$)JE/A&_>!._6"N4^$
M>5--%/[*?0VDP6YA5*V)XNU6&UTW>M>S#Z@A:P">0P6J[MW'\#1,IHN0?4S^
M/U0[Z[3L^9]3^G_]=O4AP2]$]NI0O9D'ZR -8>16GH9.DFLN5O2.EJOD+H^J
M$'O:*!P?'EY+M0C[?T-8IEK4QH!<<[%(B:R6-@K'AX?74BW \,:%R%21CA#'
MU<_<=QBN9'B5T$'\-DK&X?F>9B()*<+LOPA995OX02)('>5T*O%,CW;UH34O
MK"PA__'^W/8"8)#LQ*/#;8\FQ;3W(V?A79.3U$^\PLT0&SDP'$FN L7<3L/B
M4W!WM(1KSQ7-!;I0.&8\O&)B90'O0Q+3W"D[&P<QC8?#D>-K4-TF7?<B/"4W
M96&@]M3 (%MC"ZV#TID=T>Y,7#2O)E""7%N%8H;OTY7O.>S\%()="X1CQH$K
M9O4Y9F=.;ZM-'V(8!X9CQE6@>/D$&QZ[4+AE$:WAL>XQ>'CLQN'(:0Z/>2&X
M\,C'X&AI#(^5 G#AL0<H04YC>,Q+08;'#A".F<[PF)>0A:EZ9@ QC /#,>,J
M4'>R)@S=#S3W?D]F7@#X9&A;'GS6AH-41N/ =C]X49Q@J/ Q4#I=:(6?"<.0
M:4K#/PJFC8!I6J9IZ2) B!M/[6L:&04V; 3!9E<AJI]RI]ZP4U^T"-401C[E
MOH$IM'X97I-_$<&(MQ:#6[P&*+;U-'2%'^THY7#6Y@AUWU<(W#-[+K"U$ )_
M3:$45W=S,A(;F<N [SQ&BDT\9B^(!0[Y-!.;6I<%3U<;*,5-]J,=9S<122#:
M4VG+XYIP':GNOE1V,O)W.W!]$F4EV7Z_.3P$^+84%ZN5S"[>HMTA='85\CF+
M0C=UD@,O<.G(!JH=+@3*IP.L\,5".Q8,HYD(_"U"*KSUDS4+(RN,YA/B^-XJ
M)I/4F[!?QQ,W_[CCRD_G7A!/:O5UP224?G3'(50M^WSJ81C,O'D:V8!/!'?"
MX)_AZ53PL"M.C^^G3K@2?E2Z*2[AZQ+X'?F8M:K-U$#HXX8XYK-2#>!WYN,I
M$4TV-G(XK^8(]>9FK_G&<>AXL)#7 4.3:2OXKIK*M9?<'2]I7@MP^$86X^4J
M2IUKBR51B.EU6;"S&ZCOIE44J9O Q%(*O+BUEO]^'!F%-S&)INE*?,V^+@MV
M:@/UL%V+R+(+8JKSZ\-PN:29NXA9(04FMY9_V/Y7ZLCL71RA(W,IN"-+^>_&
MD<5$4F!B*06U<B/_W3CR+"(S$I% ^,A!11"^IE&!/&R/(F+LAA5;UE0=:O]%
M[F["2!1J2RDHQXW\PZX&M0MX*Q(E=ZR2#L,T$"02+7'$PET3J(E#D$3>92K>
M@.Q"R3&JXA]VXT'UX0U%U3WX=^*O0+EK11 \0%4A3Z8V*JQ45\:7,+JZI+%Z
M<10X(6!ZUI:'DN8AU6W6O3\"$JA*@C?J:IB'W:Q47FTD3IBM)PN,W,B!KRU6
M$ _;G8A>NB:ENH].$SM*TM5Y*AC7-G*(3<(UXLG40T%*=2WDKR<7 Z/XT82&
M-/B,9@NGF #[1IKXN:FJ*,[T->C)M*><E^KF=$SSQA!4&55)^-&2*D:MT= N
MT!!&F:ZE ]QW0\J8J6Y'['6#,Q+%*Y)]^/8X."=S+TX@[REP89A7%3H4J)O>
M;?1GGW;<$<S+FN+@"5T;J(V#X,Q/2UR6@\JS/O?=<2K<5'<?]D444!2N"$)I
MUB"J5W9!)Z[D3L)I.P.7?4K,2Q9A"KSRP@%@G-^"*F>"HR'+00.!:>(Y5W>L
M .APSD/ YQD\K/)-^ZS#Y9\@6)(@@3(3PK%;^SV*GDQ,9AQ5!^-3UMS_MB,7
M6G,< /Q:!@?Z9&IGS4['>$FBZJJW@"8'@ E_+:BZ*PB7[.&,0CN 2%L>?#6!
M@WPR+:U&+JLDU4WNH2^3LH5M+YA/6>$N'0$$ERU:XI@%] 90 P>6;QS8L><<
M^80-7ONNO4)PZH#C.78JTL3Y,(V3<"E/FH>78\W7I/*(S<SW1$\5E5*((S:%
MO.JS0.Q=]\@3W;YK""-/!FU@"C=/V#-4;G$\4;0=4I6%;Z+449I,W_?]\";.
M'WG &%3%R5&J:]!$[\RW$SK6+3&&E1@Y6ANT)DJ?@X X)([MR/,%,],>H!RY
MA@I-#%F8W'==P&7S;IP<O[H&C?0^QR2"A;Y^K#S-NA:%#^:FESY!A4<. OY 
M+@^KF PH.%8D<<8K#X ?0\?V":QQU66AAC=1ZE;3B]@),[XI#5Y+;^'4K;LY
M"YK7P<RORX+7VAHH3::_]V;9*4_@D6T!6(X<1XUNMA=WPAN<?<B!/ L=ZDAZ
MESX-B(7[8#,#/@9,K .MC!)\W)09)36-B=0/<?;QK5 PYZP((J8X&XBZ*WXN
M;.S>R(&O]KD:QNG?2'YED)37Q=Y[<43F=N1N&F._61 -X/>E0+I&)?^!#GG#
MC69:5#HAUZ?/$1]$_8V'D";X06D/7*O/QPJ@+;DPFD()4VD][#YH11!AM89;
MH51K=O&?N+DSCD5W4#@ !(,V5"63/$$7&I&+(:PN 2IM91?I/=L_L1/J"['/
MZ^((VYM I1Q(-"-.DND6&U(1QMA?@RFU'K1&5A'$6*U^-8Q]A1<6$]'14'D<
M/(ZKS:Z__+HL^#QE Z72='"KKLLB3-?3IO-GRV #4%T6]S":AF%HBAGVIW+#
M?@NFTGJ8UZ?X87^J9=B?P@;+*7:PG&H8+*?04#W%A^JIEE"]GR;AQ] 6O)Y?
M2H&GD&MYA2??LS>?R#2)PBOQR?>:,/SD>P.FS/J+* T<6[Q;LI&#VEQ%*#/W
M_Y(HS)W07_A&#FIN%:%N]2:)!.=PF01XO2:356K<42 \S+ 6PYA9 )3:>B(N
M]@1CXXEB^Z8+;Y8(#O%OY#"6E@CUYK[^-KWQXO@W$BUM003@8] T&F@=E#Y/
MP;9\GDH08""55SB=*[9P///#&\% 6Q5%7.2L@A2^['ZX(%1S<!H&V=\NP]M^
M2W@(^ OO/*S:QK.R'=%1HE(,U6AR@+IK76' WE\G@D79M1CXVM8&H*YQLPZS
M[XOVC0HI<)->RRM/@X+YH2WZK%%=%IL.E2CUTS[Q8^0U4?243\M3Y&*C-W*X
M&;9B<\]"Y@KVS7'Q*S)54?#)@CI(]5G)K H!>7Y+''E>L@HTKX8^ZE=#2Y^<
MV '5+)@E-(2Q?E_#E%L/*Q]KKX86 JME;*M0>B3D;^$!%R8"/_#QMY;V>F8G
M=/(9P%83.T#8]M""JWN;([ O?>(6!8E?%VF*@]_H: /5+9&Y)$B\F4>B&/;9
M$0X O%3&@^J*B3 V'2#)&*F1%8Z.+ \-!,IH!R/0E,;&5(TU\+1BU_J;M"1:
MI@GDD7T> EL]=:SR*CHG_Y-Z478%"U=-'""VJK@JE%=761J,7A<*6VUMO/K>
M!6Z'/ 2Z7^EMAYO'=('FK.711"I(A>N'I_:2Q&QQ[(/-CJ *$N"V/'SML(U4
M1N.$!.F?7NQ=>C[UU.:2)HB3  PE*%2C[F(L[9NB5>I<!GS!M9!6=^_&L_UP
M#GODO"X+OGO30*E;V;5]_])VKBY"B)^;TN!UWA9.&X$#/W2NB'MPE[L,9U<#
M+$NOI4;U<TN'"SN8DT,[C4F<7[_O-[ 3AGR$B:= W5V)P,U/F19?FCB.\S7@
MC^%\3@1G,OJQX/L4 BT*U\_9HNN^[Q=^G9+ C=<KL4?7POM[  7PM7: *G5+
MVG9$I\O3]'+IQ;%X5;LA#5[8;N%4]\"/Q+X"=1DFB.QE.42ERVDN0J=;WM_K
MEOUMSB:3M/_2?U]Z 20]!:M!5!)4H;J5+?J[[%D8V*R])0Y>V6H#U06/]#*)
M;.'%N$(*' ;6\LH-9?<$CZ)(=+NE)8XUO0)4N95U3:)DFD1T?G@1'@=TXBA<
MZ^%B$)M:7+1J2H7BBS O"614 X.DU$(K//Q-X\6*1HM+T<G8JB3\X'<5H_2M
MW,(E62@L0J @U>2#,._D<N$JKSN<DR2- M8;^XVIB2*N/51!"E.RB";K="B:
M+L*;RA.OHN2)CX(G7UUX/<3.21RFD4/D"'+04D2Y>I2>UUWG%J!.Q4-@SO"V
ML>K>!0P(C@L' 'X9D =5=]SI!EDK' #XX!,/JH[)(B+(6N%"P&SX8'4#41H$
M=]EZ)6P(:HJ#!Y\V4-V:J.VSRR#$+0---G7($PW!Q*87"EX/[5>B;9%$P*TE
M+KL4HOJ36\71K6-!6ZN)@J?1=9#"Q#ESQ6F8[?6[GV;3A,U4LS4Q40+<C80G
MT7TZ5)X-+[6>DQE;!2(T8P0%AEXHXNQXGQ+-/(L5&!D3"^@PGFLERGAFKY:"
M:%4EH2SJ&(7GS:.#B-A7.[M[@B%E(P@_<UZ!J+=X3W ;IR*(MGA/Y7V<4NON
M#M#'5!!K<091;_&>X-,K%4&TQ7LJ/[=2:MW; ;8**HBU.(.HMW@7Z&,JB+9X
M5[&/3\G<9I/(TW1Y*8IR+7&$]4V@RKD1;/>X(HB8"VG8-S[=3+#BT_"PV  5
M?2"!#X(?JNB :V&5?^H$S:L&DV'64*!^&PC#;""O45@MXXMP2HL!Y:AM>027
M%E(UC?73BF=1F(1.*+C(W85"4N+@5<^9+A91F,X7D#,F/ 1RCM3 *CRLF#?@
M0Y_80;H2V%(7AA]-;, 4G^IGYSC94!9&2]N'#3H]0-Q)_PX5ZABRPPHQEAT?
M!&;6!5?/ZKT79_<ED+R:,#2SM@+UW(JK($AJ#12:60NO.NZQ8:_03H/KK>C"
M%1^$C'YMN&I6HE6[M1C2<J6K=;SC)<!LI8(8<IA%(1GV\2GV;/Q<>-2O*@DU
MOHXQ9[U* GD"<;CP?/?+@@20$Z5<".Y@<@NL\!B_0VLY^RK\U F%3X>WQ.&'
M^%M U7?+11=$D"^Y:WBRO=PX@7BZ+HN,FK$N'S_J^_O9RC22"!^#6@O72:D(
M#SA.'2!D2-+(BKV9<1"&5^R_2&Z]4/CXT:M$"4\WLN?6TK[UEBP]L$[M:V_.
MHJ.5A%;DS1>)%<XLXGKL1W9$[&Y]6$T0+^!UZG7*+/1=HM(W_0H'N4BD6H>G
M:%;/)M/Q8 ^)%$EX1JQ2JT<4-1V@OB'^&:_AU/JS3V9(KXC@8">(%6GB+-$4
MU,754:-IK; D7 T@W4;+4>;IT43X,DR2<#F ,U>!'.T.59I[]?J',EUQ_<-A
M/;JB1G=_EJ+;1@_LR_H);QJ3%&,.?&BCUL_9(>PY7VG.'+@<9ZXBO1%;BG 3
M.RA:ZZ=:1HLR'Y*)-"5V6+S::-$=KF2XML #@Y5VMIL8(4.WC1X:J;03W@0(
M&<)M]- PI9UP$2-DV#:@@V*4=IXS.TZL:X_<6)<V*A37@'(<&RHT,=S\(RLJ
ML2_1*7.'"CG6G<HT\5]/QJ7I\S7(L>_2-0YY+_')4/IK'4H<4-&F-Y+="$XE
M"8"#HMB-RC-*?>,@GF03.W0DUDRUS.?P1.O(8=FD9I+K/ [/L@$=F$=JYKE)
M9TY"Y\IB!Q2L'8M*DL1V%GVO >%U#4VXNK2.Z)H]A:[9T^*:O3%<4ZV)VB J
MZ1Z(/CD7P31K<E.89ETX69"B&TNZIT^/G%OZ->IPQV8;9LC.2*\6"5<(].EU
MQ*#M$D4;9O>QP<HK<\ >2I^207X8:T=E4^*PC16!GD&^&'&;I=TG\>NT/3J4
M1 G-Z[:<OCC$!TIV8OK5C=4OAKA!S?:,0)]>1PS9K.G5,L@1HVW=M&+S$"\H
MV,CI4S9.:$0O#G>K4!(8]2X6<V+0  >HV/+IU3964!S@ R7[0/WJQHJ( [R@
M9'.H7]THX7" "X;O&/7HTDM>;O^H S^(^ B[29O"AFXJ"34-<L6H6TR;8@?N
M-(D4#7+)F/M.G:7BMY_$JE1Z1?-F5"M((=?W._ JPJ7.E7[>""W-7,%^59^R
M<1)G:?:#-[&Z58V4,DM3'[ZSU:-KK#1QX#X77*6B%'+,7:_^\J4VO^ JE?M+
M_U;8IGRE.V(XM8/\=G_[8QL;E&R3P=0-\M58FV;5JUWXS3(!&NP!H1X]A"4V
MQ93=KAOS3EVU+/3F5S]8BJ_>S:YJ23*;7$*\%&?MFUJ\/@1=LN[%#NK%6A:I
MN7U'ANN S2J1&MWM68;ND$TIH1X]A/&;4 *T%&'-FTZ<V"C#5GJ3J5^)WA %
M7$;N@PX*4#H6CKFQ08*H_*:10(ONX"3!=<#FD$B-[L@DP7; )I!(C=:P)$%5
M=K.G5X<>DIC-G4Z<%$%MFSG50N0V<0 :I"B/L&E3+4YJLT:L0(JZ_LV9GM*@
MFS(0%2K8:]F$X00/T$IT)VY(V%*_ZLP?\= ,I3=7^I7H31C1+"4W4?I4:$X5
MT11E-TMZ=>A.FZ0V1S"J!J94^C=#1.4B-D$PJI3Y1=>F1[5<!9L=6'52_AE[
M<Z-:]H!-#:@:*9^,OHDQY.(/3 G>#Z-=^^&4.&2#0]&E'[ ^K8Z0W_50<N,'
MJ$VK"P9MA:BZ[@-7.$IT0*^RJKCK U,V3EP8X  5>R=CW?/I;78#?*!D0V6T
M2SZ<$@=LKZBYX@-5-\;H,, %P[=>QKG>TQ-[L$N["B[W@'2-$PCEV2O8I!GI
M8D]OQ)%W@(J=F[%N]?2&&WD7J-C.&>M*3W?$D><_>(]GE/L\G-*D=GR&WN81
M*]+*>> VD+JK/!B56CTR;&](V3T>A,8QW8'>,%)XB0>E<XP8B5N:'WJ#1ZQH
MI.Q EO;P':9Q;N_T9**RU(=N.XUQ=:<O Y7E/7@O:I1[.[UIU["=*0VW=J1T
MC^XLF>TJ#5=VI'1K=9;*/2Q-]W6D]6MUG(J-+<67==!ZU3FH6!_?EENX$Z#!
M#A#JT4.XL7FVB["R"96BVE:BAV=S<PQ#M(658LK1HH=J?0L,0[2!E*+9TJ&'
M9&M["\.S#9:BRE.C.RQ)L&V#!P8EW6P;,6%;/IQLJXA)VV/%) S1%E9)3-)&
MM=55,%S;8#7=51O;5E?!L&V#U717;6PW?X>M\/5BI;ARM.BF"EV]$Z 'TM6R
M2L<9S4&+%IVX(7F$^B4*?DA ,Y1>@NM7HG=$1;.47&WK4Z%Y+$53E%U8Z]6A
M>UR16DK#J!HXYNA?/!.5BU@UPZA2YA==ZV35<A4LD&'52?EG["6Q:MD#UL*@
M:J1\,OKJUY#3:S E>#^,=GJ-4Z+LREBWAB'\1UDGZSY++L%>P:I9KS*M_"77
MT#H5#.$^QHI:S[EQ"?(JUM?ZM8T4_^1=H&+1K5_;F,$/O'[1K4%A\-.SDM$=
M;"38*UB>ZU4V;@B0<("*-;M^;>.&  D7J%C(Z]>FU072RWH]*H8X8)Q%/EYY
MZ+6^7B5J?*!WY4_N?)X(KB )TKB^(GT^#Z!!3>P;A;S<4N'@\WD 3>.,^;*\
M!R\CCG(^KW=@&;:HJ.%\GI3NT9TEL]*HX7R>E&ZMSE*Y_*CI?)ZT?JV.4[$F
MJ?A\'EJO<@?M#EJ:[$)C'="M1P]AN55(+E2*Z@CKCKL#%ASY6"FF8RPQ[DJO
M+?*04C3UKR;N#EE&[ !+41UEX; 1$"38#E\J[%0S2DP"+HUPH2IBDHZ%$&Y$
MP! =O #8I66D[HKA.GRMKU/-2-T5PW;XLEZG&CUL)1?R^%@IKF,LW34*0J[9
M=:$'TM6Y2E<=S3&+%FW<D#Q"VQ)%(R2@&0Y=@NM0HG=$1;,<MMK&5:%Y+$53
M'+BPQM>A>UP9LI0&4C5PS!EM\:RS7/RJ&4B5,K]H7B?;5;M !E8GY9][6A+;
M5;,6)E0CY9/15[\4G,\3*,'[8>SS>;N<[2'LC%O=^;Q^75K)2R^7*3R?)U"F
ME;_D&IJR\WF]JK0REU]84WD^3Z1MI/@G[P(5BVXCG\_K"3?@]0MUY_/Z=8T:
M_"38*UB>&_=\7F^'DW" BC6[D<_G]78X"1>H6,@;^7Q>M4#I93V%Y_,$RD;B
MCU[K4WH^3ZANC$0(MZJBZ'Q>CZ*1XI\L[>&+@Z.>S^.-M;+4AZX8CG@^CSO&
MRO(>O(PXYOD\_L R;%%1W_D\G.[1G26STJCO?!Y.MU9GJ5Q^U'L^#Z]?J^-4
MK$GJ.9\'UZO$00F)DX,P](D=O+<3^S ,KDD4>V'0#>R$0*CV@)7Q.0S],#JT
M8\=VR=$U[:$]#[?SY:%,>$BU-#[8#FT5=P S"DF4Z6N,6J//(C(C$0D<\M&+
M$Q*0Z)M+9M_BF\1AOP88)M" (BG4-0KY:'XYD'RI007YC:Y1R-/_LU,_(>Y 
M%]3UJ'!$4^,H[@C"D$:]R'/)0'\T%*EP2$NE=H\DBYV!H:&J8:@/ZKI&(3\L
M-%0UJ" _8FA@Q:D(#6T]*APQ>FA@A2H)#1Q%*ARB+S2P5/!?Y&Y*DF\N_>M.
MOXU-:2BW-DX7@9[M+)ZT) %56U0-U5Z0P"N "4N8G\-T6']))Q=P\S-I"?L+
MG X"!Y]^^SS]U]'_![:E!$C0V$"5,OE4A EH9Z[+8W@TD?IH +IT75Z:AM)N
M78YA65P'9AH=(#"A+K@N5I@4HA<JR5!;HM!;CJA!]F*5,-724#^$0?+MVO9G
M]+] VZH0-+$Z6!.?M=^PK&I .6X-%6,PA#9-#E(!1VW-<AVE\<VS"96BV5:B
MF:=TI79H&,9ZY$JN%;<WV. ]A>3W=) OBY+*%/A@-.4N-;K9RHVLO3H&<A]A
MI.TK$-K>>W4H=8'*-L]Z%F)_J"4.)<8!*N70N80+&J @&C!,Q;K&(#^4NCKB
MH])&9)A0+0I<H"OW[&UNY2+EP!Y05:.D&]05ZO8%6[ =TA<J^('L:YK&H#TL
M_M4T** ^8ORK[5H,<H#*0,#1-TXK&!P(VFJ4M =-@> WDAS8[L6"+$F_<15!
M*)\:1)G%QT&".734$H=:SP$JXW :_FG['X0M;"T&M;D"4&]KF6@#32C%T;9O
M@,HXG/EV,@NCY:%X=EH3A=K> "FW6]Q4JI)8JQ4WF//?#@!^+J6@QF[DE1L*
M:]A-::SA&IKUE"2 R%U*00W>R*LS-(F\8,["J:#HM1S8V I"G;E?+@ MN)0"
MF[J65VXHK 4WI;&&:VC!64-[3V(G\E8)'6/+G*_?H"X4E% W7A^QA/U L*W=
M 9*F5<*5L0)E+<B<17W&DOGAZ)9FSRQM.[5% ;(MC_)X ZF)ACAXMN7E:"@.
MIG7E@+C* <@141UMZ]K%':$M+\=#<?<X2^.%2Q4)DL-""IQ,KN75S?26]ES0
M=3,1\(PN%U9FWZ<5"?8#]] /8X&954FHM77,]VWT&9V!KXB3>-?DG%!+!$VQ
M(0UNPBV<NH'3(S?,*6DD<'I%$#R 5B'JSANS*CP./MAY 17?]%O3C0.?)N[1
MH)K>T7*5W&&Y-4%(8FVX:E:GH1PQ#@[)C:M!W71GT7<%O)0 3VL6RBYQYS-1
M.W O!9?N"B'X[+80UQ%)#Q=V(!I?6^(2L;0$ZN/PQ4L6>[O3Q'.N[@[(PK[V
MA*M\$!727/G*E/'?=^U58E_Z1' $82,'95)%*%Q #M9Z#VDJ&WF7*9N>"JSO
MA,$7E#L5*+R54^@-(YHRA&GDD*Q,(KR$TX6#W[GIUJ N6;S\#VW7- HEF0=)
MD%S<K41I(Q<#3B [T.I.,J4KWW.H>F@OX@# 9Y1X4'4W\.W8<ZH-N]^8ECCX
MYGT;J(Q#9:Z^T7]TNXI(+-[:$X"A_(1JU-;86;A*?1M87QMA5&U586JM/R%!
MBF)0!Z!8-*%*9V-0$G59S)Q,B^E?PNCJD@3.XBAP0M<+YH+HU9:'4N AU1W!
M\'S"EDM9IK2_7-$$BB:Z_?9P(>"C%7RPNN3?6ZY\<I2]QO*1V%>"M+XA#9X.
MM'"*";!F"S6_E,49OT$I/)L<)U%X1]SWGNV'<Z9=-*1S$/!SQSRL,C(GH6O[
M6>9SFUQ$=A#/1*DD#P$EP\<J#5;QR@;FQ$UI3*"JX]35AITX"QKZ"A<)G%D7
M!M=!$Z9RJ3?*QI]X_^S8"RX6$;%=0=?@8R!<3+4_D&HW[C?N_][<WQ>ZE#EF
M9^?EZU>"(QRY#-0-I;2Z]2C*.2%3ZEF?G-C1%8D^!VYX3MQ0L)K4B0.O1_5H
M4$SO)/43;U46$^=ELF4B#%>A$AQQ@#JM7F!%Q?+\:_ AS!N*E''^O'*E&G8W
M#LJR3X-B>G578@CRD3B*73H4D]P/W!,2S:7KL@^/(]RO21-M^3KNUR!'77N=
MOR<^2<JH"&/+A<"GYURPZMB[=M=Q<&W[GF#IJ@.$C+-MN&Y6@COM7:B!O%3>
M6R\B6]X<0'7%0R#C: .KE8R@BKB0(7145LY9%++-OKP9P&(#%P+>I^>#5?,Y
M":]Q;*H ))<Z5 >3HMX_ADXVMT(3Z\!+\.S4I+Q!AJL[7'.L +"-L095SH2=
MRG+Q?%HP+"N. AVUQ(Z:9B=NI)IGKP:)>NS1I:]B![I K$>ZZL=T1[6XBW!(
MS(*I&M(Z>I2J]LLY">PE;C"J0Y \FV#5?/+L'L6G#D'R:8+U=&,)5CR@5$?5
MS3#7S[;=B^-<$I7'04O5(U>/SBJ5I2W0,:"B];K@0_81FCR__DCL&8QT%PK^
M;$877@NQ4_IOXAX'A7?Q'#L4R-#M5*65>?XS>>)U_!#>34UZ6K(77!%7HBW7
M<%*MN:%!([W<H[(DZVAYJDT]B@G#9^9M>1PI3?-RJBX-7#M(INDEEE(_%OR:
MA4"+>JIY*>P GP17/AA-MDN-Z@X)GJBWY9&=3L_4?*.<]6<LE2H&3Z>.UD )
M,YGJ0N%I:9M2Y47@20TAI)D,9B+%0^#(:)LZY:-@(_A@N $4@"]1051I8TX#
M[A#>+;@L:XXB+4T7GVKR<#+-6%^J27V'GA%R,9BS_GIG@^L"Y.:"(CB>Z CS
MP%99J%F@ "W/6-\,<-.*,)VR R71=D?HD/B97R]6EJ2^61]JTB [2] Y+2A4
M[P?9,_<WD0=.;WJ06&)\'6H;)'SFTY!&-3I-LYY"-6+.PT%@B>B:[Q3J41,#
M+@9+2-_DH"A KA=U(;'T1NA%V#J3KR^M=86:QDGG^'J3>JH\']RP9'@H#"4^
M7BDQVI(W2W]3.WMS4O@YE$X<AER7!CWT6*]][\VR]]@3+,<V6(HH3\T(;-E=
M:6FV&7@XVT*-AA7E9I'05> F#K^.W-:@KS)E>F8-)UV%.GKF^L(;"VHG8<#N
MP/>;Q4.@K]?5L+H.&H(.)O,QDL<-U1].WGFU^^KERWXC<AGPY;A"6NG3E]G#
M(OD+"OVE-X0Q#V#68$JMORAZF]B&4A)C]P:C[LG<R':N#L/0/[!%K_Y6),'/
MY-8P:HW^E":^%XA>CJY(HHQ>8Q1?X:#5E]#!T[V(B.C)QY8\[MI&':F8QN&"
M.%>7X2V6#@^'H\77H/JBS1V66!V!O&!SIXE,%N>F)+KV' &)JB3J":@U1EWG
MO@F/Z-B7VH G".NRX [>0"E,8.,D\ASQFU4507B*6H$,M+C^F_J_G-#W:1[R
M+")QZM,$L:WEWW%RYY._K"]V%'C!G%JS(%9BQU<66W*P?LE^_:OEQ99+5A%A
MS^NY$^MS3']U&_L)_4T04P(NQ_12=?[431@MJ7XJGH36X;NOCD/_]RQ./>J.
MKY>IY[M?'18,PC2)OY(TV=O[2AS?6\7D&7,8A7XM2'R]\8*]W4G^Y^V;5ZV"
M_^V$ ;7S+^LTM,BMEX&MJ'BU,;;LP+6"T JR97"+O8?PL^6&3"8($_9*0I]#
M/9J;ONOW>)1;W"O%:HXG5?S=681_6>=IP&K$"J/YI'#%Y#\SFB1/&#">[/O^
M1?87ZSQSC#7+D@DIWSXO?/N\X=OGPL)OEWY/JV5_6L4'O:P?=B8O)]O?MM_\
MT WX@_ZY=7'RD[7+^"<>;8)'P;47A<&2SE%_MK(G>NW(M5C"QY1N9?RL4O6S
MR^V]G_K56[^'R705)EDQA[Y']5I_GO 4_6PMO5O:1I:A2WJ4"HK+:^>=M6,Z
MZO?345-OLK(CVC_R[G+&_GY>?FLP9EUGRCPZ6M^%VF.ZLQE/A_2JU-/:I_+6
M&^=/Q4ZF^7_''07[K3#]Q_2?/OX^L8-TU=L]HC00#%R9#WMEYB0X[W0Q&W=7
M=W]9;'62N6 GZS/68#_0MO\DZG.1]!$YBT*']7A:UF!W?>4%EF^-]L1BRO#*
M8:1@Q?73_QC:['5B*_MGO" DD32,_?=9\</REU]7?CJG%5XSE E^_>/SZ?'%
MY/],/_8//BL2L89@TZ2F?PA*10,9G<<7$7<_<A;LPRJ#QD6J3M#M,XEG?WM-
M*?8W-]M?_LO*]IF9]UV/=I4DC.X4.)]3U\LK6@ -$-F"ELM*DQQ1>PIJ.C!.
M['Q.>9:W 4$,#&;>/(W(!;&7%Z*$@T;4K*D/#YGK*'88ICZ;G;!\@TY3L@"J
ML!]P$XY*XRYC K.J)S(^ZJ#;[-LDV^+IKT33K[^G?BVN'49IF K-$YJB41<]
M/-_%O)_E 8$E9F)C)C9CKM^9F=(C:"#W-U.J1:OQ9DS]Q3[FF5-@7WMSFYVA
M,?F5R:^>3'Z59S/KQCTY+?]V+SD6P!J39YD\R^19)L]Z('E6(V*-O#;=4_!C
MSK5NRF_]L;Z:IY0FZS)9U]/)NM8-?+)IX46/7G_G\H+^)E]ENI=43-9$DY^9
M_,SD9R8_>R#Y67<8&R]50]CPF+.VR.GOA29+,UE:U??#LS3M1Y3S?(<V[,FY
ML[K'%;&6!2;+,EF6R;),EO5 LJQUE!I[_8M7Y&/.H:X]<F-.<)DLZ@FM=>4=
M-6O8DU44KDB4>"2>)/;E)8V8HU_2A%MD<BR38YD<R^18#RK'ZHA:8^==4#,>
M;R[V'S=QR64Z-\F82<:>2#)&F_0D:]/E&Q5I$BY9S8R[JB4PPZ1=EJ X\V"&
M2<],>O:0TK-&2!LI&Q.5^JB3K]0SF9?)O*"UD['X-.V5H?'[ZA%D:.LYUD=J
M[_A[CCTF/.W,C(X^)*+#6&*6Q1Y4WL7KLMI#ZGH<H]WAVRQ[2?QQ!(U[G--U
MV?"TPX991W]H <-,U!Y! [G'B=K([TCU%OG(IV@1F=ELR&6-SLS6S&SMZ:R3
M;TX8;9KXA'J,'0^@_SO?_'3<XPLRMID$S"1@)@$S"=A#2\"J\>L>DK'>XA]O
M8N8G5[7$+.-JLC.3G3V1[(RV;]:%J[E/L>PT]E%2L24F\S*9E\F\3.;U$#*O
MKF@U4N8%+OY19U[L1JK)O4SN]81S+];$'TKV);+%Y%\F_S+YE\F_'DK^Q8]7
M(V9@0 ,>;P[&.JQ)N$S"-6+"I?<5&M:@RV].Y#]BK^Y=C'XN5&2'2;5,JF52
M+9-J/814:Q.K1DJM>@I\O*E4]CESDTN97.K)Y%)9BZYF,G]\H#^XGWP*8HO)
MJ4Q.97(JDU,]A)RJ&:_&.K E*O:1YU>NG=B77N":$_0FU<+4SF-)M5AF4VGC
MDX/\O_>7;PD-,DF72;I,TF62KH>4=#6"ULBYEZCTQYN"L49^F<YF-)Z;[,MD
M7T\F^\JV^2N-N^C$'^A/#O*?C)^ 86PR.9C)P4P.9G*PAY"#\>/62"D8L/#'
MFX'9@7GIS^1>F-IYV"?D:7LN$IOBFG'>/2;[0?+Y^&+4 _( 4TR>9?(LDV>9
M/.LAY%G5<#52=M5;Y./-J>(;<P3>9%1/9S6+MN>BFV8M=_RKAIT&F/S)Y$\F
M?S+YTT/(G]9!:J3DJ;N\QYLYT9:R=*[-7J#)GI[*>A1KT47NXM"6G2\HT_SE
M,&0.&#.)$EMBLBF338V933W(CODP.J7ID+A/\>V:CCMBQS73H$?00.[M[N\F
MHA4!;;1+P.*2'^_4B-')R 7$K"Z;^='365W.4IZ\V]*FS9*?4Y*,FX7UF&!2
M,#,G,JF52:T>0FI5#U-CGH#L+O3Q)E0T*?GCSY-9%"YI6XJF*^)X,X^XHD2&
M8F@%KTB4>$2P4.TF]LKD:B97>RIKV>SC+;1%%]& T:69TJA?WFJ7CL[/?NA9
M4J+#RS/;7RULZQT;JVGU+E>LQ5,O9'^W$^_2YS34$A]?!]9_6]'+5Z_?O-W^
MV=K:3^?6[HZUN[W]^J>?K2]>X(8W\7//WMM]OHRO'6MG;X>*1;0WV70XRUS5
MK7R1)*MWSY\O[&@9!G?4%3;UZH1ZJ!MR8M]:"V*OK-C[F]:-8P?_E5B7A.4J
M)+HF+BO;31V6I836VYTWULF!93LTXF=!F_Z,9J9):OO6DBQ9)_>]I9?8+"_M
M\?EGFANE\T5"4R.'K+(DU@NLBP7MQ.ZSG9?<-K>IK8EO!_/)GR3R9G='4132
M'D\]_]R[I/_GI,\]6B'/CP\_GQ?9UD$:N#XY9C^=DR3_U]9/'\60__VSM;+C
M^)VU^W/6Z6DY>[O,'W8<!N_HC[+ZCK(*M^QHGK+\O-OT_V4G%?,/?:J:C7TD
MFKADY@4D^\GV5O473+PGZP9I;"E\]V+OC4!IM4^%\=R;9!_>#FQ_<DE;H>W2
M/A9&D_=D9M,NV54NY]=9\3NO=K#%5TOU<U696MK;%B=V8,]YE*N_S I^N:VE
M8%JLF_V0-;&.HE^\UE;TQ]"Q?6'Y>]OZR^\J>Z=O.CJHN37*[VQQ;]YB+9A%
M=&)Q$T97&UNR+#>/#/SB:[_+"MY[@78[N."\R@L93MDOMM&]'%<VC^\K?8[N
M+//E:UW-BS7[_I;U1M2T^>%YH[BE<6]'Y$(ZZDSHP#6A ]>$#5R3UL UR5)4
M.B.@*7$QWK5E\IZQ\_;E\.+6P^IQ5J[34]PKD<.JQ:6)YT\XA9V'87)QMR);
MW$)>[(@:OK",MO_X);UZI8!-PW5\Q^VJ\!NHI&U,@QA4TAN,][+GQ<Y3GQS0
M/NL>AKYOLU[["^W7=+[SZU;[5WDAKU^]P)92:IC2!-ASR'3A+7_<^;'\Z8?L
M7?Z[R<)F5/)YYQ8'4K9X3/%E_\H&%5(H^S'_U[_(75FTDQ?:%"P"R&M,\R]+
M+%70NJ,%;55^4K1T3/L#*MT31D^A;YCJ#C^\WM6H_"6ZZ?):"-6_[B*=+6A/
MNOUR]1?UB7(]5.O>CBAV5(?BU)O0]DSG?O'DC$Z_5X3^XYJ<D"#]<7?R2]ZK
M&[\H:E;D?%@I_64@F:Q3BD,:%^;D(NPHK.O71?HD1^PP#)+(NTS9OXX3LBSB
MQ(^ORDC1(2"3'5>Y>BZ9?*&IVR4)G,5^9LP!6Z"@N8SMNA6*^>_BK0[AS(Q7
M;S#Y*M",G'^^JL+\W&_!*]E*[[%@YOD^*_G CGH+?_$2,TMBE;]:^9Z3K[04
M^NQHW[WVXC O=?W#>*OU^[SB7V)F)PB^E9+[*.^]DBU_K36OV<Y"BU_GI>V^
M%452:'%%7^87\V8PJ4E ;AJZ-V65:<VN;%O=:+(=M@?UX\X+CO;!KOIQY\TD
M2H,O7K(X*A?Y6N5LHU9DJN5,$SM*TE6^9.@%\Q^+'[ U:?N2IIBT[*VF4#E*
M(<ID-RAN/)>.>?&DU$WS@:M,?^T'Q6144O?TCGHE"@/O;]H[J.[]F/[@A%:/
M/2?Q5NVWP E!5TGOO7CEVW?M0LI?%'WS)694X!9 G;X?N.R?=N(L&OIWWV('
MNTJ\VT25(IZ%*Q(4:^=;K5_F _I;S#(!OTGOOA0WZ;T7HKSS(37I6L-BK>&(
MPGG-[:4LJ\_'_#(:/R\F2Y@4@-?FUNIKC>W%MG3EM_Q=-( P3=9M(.ZHE>'C
MS80--.TFMC>X*3,:GX^;FG?%BT_@4:4UJ.SN#E?^XXNL$S0TBY=A6H<5JJ\+
MAY=LIROK8>?$]I=E%1=K?EOY#W,.TJGRQN0\):6!D?;K]4_;E) #XQF=AK'3
M*Y^/.PJH".2MZ,60K+\:C(_?'^U7_AFSOK#5^&$QW&/JB>WA3O)'<*J:V+"U
M^>=66Z#H(YA(TEU4EWY4YMJA/G=41P&[.Y@2R/^D7A#>;NJ(UD_Y"3BJ^O=L
MJ2KCT_IA$=XQV43^@<K\Q$FER&(=?5/"1SNE+:_(9RIUQI&0:!]H*W)_=Q6.
M6E2HE=TH,AL+<M);C1\5F96TKY$E[0@Y;78G(C)CYP$G?YZ<YW]C+=$+KL,K
M<D+H<.=NU7[#@&C=N:)"ZU;QKR)_P8QH96OWRPH\L;W2V _E=M)6]L-\L6X;
M,Q#SM5_:L>?0@%I1^^(%IB+Y:J.:QIT=U/X97^62_E'3^0+#/FMOO0I[=Y+_
ML"L7KI[M])^+,L>"S;%@<RRX6IJ^1^JK!^/&>IJ^M\S'>R@XM<UY77->%UP[
M#_N\;FH7AV5'O];>+MG<HS+WJ$S"9!*FAY PE=%II%RIL[C'E"8=?#[^^-Z:
M?CX\/)I./WSN3:+Z92]".F);+&2_LW;W=FCL#%):LO5RA^8R-"*X\3__\<]_
MY N=DU48)ZN\'4R2Y8IE%+FV ;E&6R<KD :#6FD9:D)AJY1%@'_^(TNT)F3F
MEQ8D8>HL"@O@C;1=^M?LA"Q5G.E=!T7V89:6SJPA,4VY-M:8V+X80]/82+W(
MKJUDL70R0!MKG%R-M%[")65 )A%9A5'"S@ME*P>38O!^QY%9$'8"EO<;)[)I
MP]Y$SF'1DE>O1F]5[S*\IH'E)+Q^'.:JU]MJ@>S&5RDTLSV?3@WB"4T\)H3=
M/7J,+;-%<4UK38GCA5Q'&I!;=JJ+)@9M5!'#L]G&9FA^9Q625IJ-U#-.G'F>
M6?]\;?WSS/KGU&(FW5-J-B(Y=DQBTS.Z6_" NLL$3,W=5\W1%+KB0^X(F64A
M,YNF3*6+)\G=BO!DO=DD"*L92^/W"<5/J'T](E0%$XB=R%OED8-O%I4KTMT)
MY38ARU5RQY.K&[[,3R-Q!/,$*\GVPQJSJ7I%[&85$7?71)F%Y_7 ;MYNO]G=
M_;:SL[V'3AQ[=)6_ZV@NKUX/L'.CF[J)36,[L^#A"WP=#35K=7%B)RFKB']<
MT)DD2]ZS,\;6A_WCCT?OK1LO661SS!F=)H<WK/3UC=]W&:3RBRS.A(Z31A'U
M^<V"]:9"([MIO*"S4M\+6--HVEWLBY8&E]ND=*KV[N7;=Y:R<C:Y<.:IO( 7
MM(2CSQ=6T1-8:1&[#DQ'NW6W+0? F#KNE^?VK[\\ITD%_?,R=._H?]@D[]?_
M'U!+ 0(4 PH    ( $ 7%S<_5DQL85$  /L8!0 2              "D@0  
J  !E>&5C=71I;VY?;&]G+FAT;6Q02P4&      $  0!     D5$      
end

Mime
View raw message