harmony-alerts mailing list archives

Site index · List index
Message view « Date » · « Thread »
Top « Date » · « Thread »
From nom...@intel.com
Subject [build-test alert] BUILD FAILED Linux x86: reliability
Date Tue, 21 Aug 2007 14:05:50 GMT
BUILD FAILED:
	Ant Error Message:
/export/users/cc/cc-reliability/scripts/cc-exec-adaptor.xml:101: The following error occurred
while executing this line: /export/users/cc/cc-reliability/adaptors/reliability/adaptor.xml:97:
Some reliability tests failed on /export/users/cc/cc-reliability/build/checkouts/snapshot/hdk/jdk/jre/bin/java

Date of build:	08/21/2007 20:42:31
Time to build:	23 minutes 14 seconds
Last changed:	08/21/2007 20:42:01
Last log entry:	snapshot

***********************************************************
Errors/Warnings:	(221)
            
[java] Java Result: 104
[java] Java Result: 104
[java] Java Result: 104
[java] Java Result: 104
[java] Java Result: 104
[java] Java Result: 104
[java] Java Result: 104
[java] Java Result: 104
[java] Java Result: 104
[java] Java Result: 104
[java] Java Result: 104
[java] Java Result: 104
[java] Java Result: 104
[java] Java Result: 104
[java] Java Result: 104
[java] Java Result: 104
[java] Java Result: 104
[java] Java Result: 104
[java] Java Result: 104
[java] Java Result: 104
[java] Java Result: 104
[java] Java Result: 104
[java] Java Result: 104
[java] Java Result: 104
[java] Java Result: 104
[java] Java Result: 104
[java] Java Result: 104
[java] Java Result: 104
[java] Java Result: 104
[java] Java Result: 104
[java] Java Result: 104
[java] Java Result: 104
[java] Java Result: 104
[java] Java Result: 104
[java] Java Result: 104
[java] Java Result: 104
[java] Java Result: 104
[java] Timeout: killed the sub-process
[java] 	at org.apache.tools.ant.taskdefs.Java.fork(Java.java:754)
[java] 	at org.apache.tools.ant.taskdefs.Java.executeJava(Java.java:171)
[java] 	at org.apache.tools.ant.taskdefs.Java.execute(Java.java:84)
[java] 	at org.apache.tools.ant.UnknownElement.execute(UnknownElement.java:275)
[java] 	at org.apache.tools.ant.Task.perform(Task.java:364)
[java] 	at org.apache.tools.ant.taskdefs.Sequential.execute(Sequential.java:64)
[java] 	at net.sf.antcontrib.logic.IfTask.execute(IfTask.java:197)
[java] 	at sun.reflect.GeneratedMethodAccessor5.invoke(Unknown Source)
[java] 	at sun.reflect.DelegatingMethodAccessorImpl.invoke(DelegatingMethodAccessorImpl.java:25)
[java] 	at java.lang.reflect.Method.invoke(Method.java:585)
[java] 	at org.apache.tools.ant.TaskAdapter.execute(TaskAdapter.java:123)
[java] 	at org.apache.tools.ant.UnknownElement.execute(UnknownElement.java:275)
[java] 	at org.apache.tools.ant.Task.perform(Task.java:364)
[java] 	at org.apache.tools.ant.taskdefs.Sequential.execute(Sequential.java:64)
[java] 	at org.apache.tools.ant.UnknownElement.execute(UnknownElement.java:275)
[java] 	at org.apache.tools.ant.Task.perform(Task.java:364)
[java] 	at org.apache.tools.ant.taskdefs.MacroInstance.execute(MacroInstance.java:378)
[java] 	at org.apache.tools.ant.UnknownElement.execute(UnknownElement.java:275)
[java] 	at org.apache.tools.ant.Task.perform(Task.java:364)
[java] 	at org.apache.tools.ant.Target.execute(Target.java:341)
[java] 	at org.apache.tools.ant.Target.performTasks(Target.java:369)
[java] 	at org.apache.tools.ant.Project.executeSortedTargets(Project.java:1216)
[java] 	at org.apache.tools.ant.Project.executeTarget(Project.java:1185)
[java] 	at org.apache.tools.ant.helper.DefaultExecutor.executeTargets(DefaultExecutor.java:40)
[java] 	at org.apache.tools.ant.Project.executeTargets(Project.java:1068)
[java] 	at org.apache.tools.ant.Main.runBuild(Main.java:668)
[java] 	at org.apache.tools.ant.Main.startAnt(Main.java:187)
[java] 	at org.apache.tools.ant.launch.Launcher.run(Launcher.java:246)
[java] 	at org.apache.tools.ant.launch.Launcher.main(Launcher.java:67)
[java] Java Result: 104
[java] Timeout: killed the sub-process
[java] 	at org.apache.tools.ant.taskdefs.Java.fork(Java.java:754)
[java] 	at org.apache.tools.ant.taskdefs.Java.executeJava(Java.java:171)
[java] 	at org.apache.tools.ant.taskdefs.Java.execute(Java.java:84)
[java] 	at org.apache.tools.ant.UnknownElement.execute(UnknownElement.java:275)
[java] 	at org.apache.tools.ant.Task.perform(Task.java:364)
[java] 	at org.apache.tools.ant.taskdefs.Sequential.execute(Sequential.java:64)
[java] 	at net.sf.antcontrib.logic.IfTask.execute(IfTask.java:197)
[java] 	at sun.reflect.GeneratedMethodAccessor5.invoke(Unknown Source)
[java] 	at sun.reflect.DelegatingMethodAccessorImpl.invoke(DelegatingMethodAccessorImpl.java:25)
[java] 	at java.lang.reflect.Method.invoke(Method.java:585)
[java] 	at org.apache.tools.ant.TaskAdapter.execute(TaskAdapter.java:123)
[java] 	at org.apache.tools.ant.UnknownElement.execute(UnknownElement.java:275)
[java] 	at org.apache.tools.ant.Task.perform(Task.java:364)
[java] 	at org.apache.tools.ant.taskdefs.Sequential.execute(Sequential.java:64)
[java] 	at org.apache.tools.ant.UnknownElement.execute(UnknownElement.java:275)
[java] 	at org.apache.tools.ant.Task.perform(Task.java:364)
[java] 	at org.apache.tools.ant.taskdefs.MacroInstance.execute(MacroInstance.java:378)
[java] 	at org.apache.tools.ant.UnknownElement.execute(UnknownElement.java:275)
[java] 	at org.apache.tools.ant.Task.perform(Task.java:364)
[java] 	at org.apache.tools.ant.Target.execute(Target.java:341)
[java] 	at org.apache.tools.ant.Target.performTasks(Target.java:369)
[java] 	at org.apache.tools.ant.Project.executeSortedTargets(Project.java:1216)
[java] 	at org.apache.tools.ant.Project.executeTarget(Project.java:1185)
[java] 	at org.apache.tools.ant.helper.DefaultExecutor.executeTargets(DefaultExecutor.java:40)
[java] 	at org.apache.tools.ant.Project.executeTargets(Project.java:1068)
[java] 	at org.apache.tools.ant.Main.runBuild(Main.java:668)
[java] 	at org.apache.tools.ant.Main.startAnt(Main.java:187)
[java] 	at org.apache.tools.ant.launch.Launcher.run(Launcher.java:246)
[java] 	at org.apache.tools.ant.launch.Launcher.main(Launcher.java:67)
[java] Java Result: 104
[java] Java Result: 104
[java] Java Result: 104
[java] Java Result: 104
[java] Java Result: 104
[java] Java Result: 104
[java] Java Result: 104
[java] Java Result: 104
[java] Java Result: 104
[java] Java Result: 104
[java] Java Result: 104
[java] Java Result: 104
[java] Java Result: 104
[java] Java Result: 104
[java] Java Result: 104
[java] Java Result: 104
[java] Java Result: 104
[java] Java Result: 104
[java] Java Result: 104
[java] Timeout: killed the sub-process
[java] 	at org.apache.tools.ant.taskdefs.Java.fork(Java.java:754)
[java] 	at org.apache.tools.ant.taskdefs.Java.executeJava(Java.java:171)
[java] 	at org.apache.tools.ant.taskdefs.Java.execute(Java.java:84)
[java] 	at org.apache.tools.ant.UnknownElement.execute(UnknownElement.java:275)
[java] 	at org.apache.tools.ant.Task.perform(Task.java:364)
[java] 	at org.apache.tools.ant.taskdefs.Sequential.execute(Sequential.java:64)
[java] 	at net.sf.antcontrib.logic.IfTask.execute(IfTask.java:197)
[java] 	at sun.reflect.GeneratedMethodAccessor5.invoke(Unknown Source)
[java] 	at sun.reflect.DelegatingMethodAccessorImpl.invoke(DelegatingMethodAccessorImpl.java:25)
[java] 	at java.lang.reflect.Method.invoke(Method.java:585)
[java] 	at org.apache.tools.ant.TaskAdapter.execute(TaskAdapter.java:123)
[java] 	at org.apache.tools.ant.UnknownElement.execute(UnknownElement.java:275)
[java] 	at org.apache.tools.ant.Task.perform(Task.java:364)
[java] 	at org.apache.tools.ant.taskdefs.Sequential.execute(Sequential.java:64)
[java] 	at org.apache.tools.ant.UnknownElement.execute(UnknownElement.java:275)
[java] 	at org.apache.tools.ant.Task.perform(Task.java:364)
[java] 	at org.apache.tools.ant.taskdefs.MacroInstance.execute(MacroInstance.java:378)
[java] 	at org.apache.tools.ant.UnknownElement.execute(UnknownElement.java:275)
[java] 	at org.apache.tools.ant.Task.perform(Task.java:364)
[java] 	at org.apache.tools.ant.Target.execute(Target.java:341)
[java] 	at org.apache.tools.ant.Target.performTasks(Target.java:369)
[java] 	at org.apache.tools.ant.Project.executeSortedTargets(Project.java:1216)
[java] 	at org.apache.tools.ant.Project.executeTarget(Project.java:1185)
[java] 	at org.apache.tools.ant.helper.DefaultExecutor.executeTargets(DefaultExecutor.java:40)
[java] 	at org.apache.tools.ant.Project.executeTargets(Project.java:1068)
[java] 	at org.apache.tools.ant.Main.runBuild(Main.java:668)
[java] 	at org.apache.tools.ant.Main.startAnt(Main.java:187)
[java] 	at org.apache.tools.ant.launch.Launcher.run(Launcher.java:246)
[java] 	at org.apache.tools.ant.launch.Launcher.main(Launcher.java:67)
[java] Java Result: 104
[java] Java Result: 139
[java] Java Result: 105
[java] Java Result: 104
[java] Java Result: 104
[java] Java Result: 104
[java] Timeout: killed the sub-process
[java] 	at org.apache.tools.ant.taskdefs.Java.fork(Java.java:754)
[java] 	at org.apache.tools.ant.taskdefs.Java.executeJava(Java.java:171)
[java] 	at org.apache.tools.ant.taskdefs.Java.execute(Java.java:84)
[java] 	at org.apache.tools.ant.UnknownElement.execute(UnknownElement.java:275)
[java] 	at org.apache.tools.ant.Task.perform(Task.java:364)
[java] 	at org.apache.tools.ant.taskdefs.Sequential.execute(Sequential.java:64)
[java] 	at net.sf.antcontrib.logic.IfTask.execute(IfTask.java:197)
[java] 	at sun.reflect.GeneratedMethodAccessor5.invoke(Unknown Source)
[java] 	at sun.reflect.DelegatingMethodAccessorImpl.invoke(DelegatingMethodAccessorImpl.java:25)
[java] 	at java.lang.reflect.Method.invoke(Method.java:585)
[java] 	at org.apache.tools.ant.TaskAdapter.execute(TaskAdapter.java:123)
[java] 	at org.apache.tools.ant.UnknownElement.execute(UnknownElement.java:275)
[java] 	at org.apache.tools.ant.Task.perform(Task.java:364)
[java] 	at org.apache.tools.ant.taskdefs.Sequential.execute(Sequential.java:64)
[java] 	at org.apache.tools.ant.UnknownElement.execute(UnknownElement.java:275)
[java] 	at org.apache.tools.ant.Task.perform(Task.java:364)
[java] 	at org.apache.tools.ant.taskdefs.MacroInstance.execute(MacroInstance.java:378)
[java] 	at org.apache.tools.ant.UnknownElement.execute(UnknownElement.java:275)
[java] 	at org.apache.tools.ant.Task.perform(Task.java:364)
[java] 	at org.apache.tools.ant.Target.execute(Target.java:341)
[java] 	at org.apache.tools.ant.Target.performTasks(Target.java:369)
[java] 	at org.apache.tools.ant.Project.executeSortedTargets(Project.java:1216)
[java] 	at org.apache.tools.ant.Project.executeTarget(Project.java:1185)
[java] 	at org.apache.tools.ant.helper.DefaultExecutor.executeTargets(DefaultExecutor.java:40)
[java] 	at org.apache.tools.ant.Project.executeTargets(Project.java:1068)
[java] 	at org.apache.tools.ant.Main.runBuild(Main.java:668)
[java] 	at org.apache.tools.ant.Main.startAnt(Main.java:187)
[java] 	at org.apache.tools.ant.launch.Launcher.run(Launcher.java:246)
[java] 	at org.apache.tools.ant.launch.Launcher.main(Launcher.java:67)
[java] Java Result: 104
[java] Java Result: 104
[java] Java Result: 104
[java] Java Result: 139
[java] Java Result: 104
[java] Timeout: killed the sub-process
[java] 	at org.apache.tools.ant.taskdefs.Java.fork(Java.java:754)
[java] 	at org.apache.tools.ant.taskdefs.Java.executeJava(Java.java:171)
[java] 	at org.apache.tools.ant.taskdefs.Java.execute(Java.java:84)
[java] 	at org.apache.tools.ant.UnknownElement.execute(UnknownElement.java:275)
[java] 	at org.apache.tools.ant.Task.perform(Task.java:364)
[java] 	at org.apache.tools.ant.taskdefs.Sequential.execute(Sequential.java:64)
[java] 	at net.sf.antcontrib.logic.IfTask.execute(IfTask.java:197)
[java] 	at sun.reflect.GeneratedMethodAccessor5.invoke(Unknown Source)
[java] 	at sun.reflect.DelegatingMethodAccessorImpl.invoke(DelegatingMethodAccessorImpl.java:25)
[java] 	at java.lang.reflect.Method.invoke(Method.java:585)
[java] 	at org.apache.tools.ant.TaskAdapter.execute(TaskAdapter.java:123)
[java] 	at org.apache.tools.ant.UnknownElement.execute(UnknownElement.java:275)
[java] 	at org.apache.tools.ant.Task.perform(Task.java:364)
[java] 	at org.apache.tools.ant.taskdefs.Sequential.execute(Sequential.java:64)
[java] 	at org.apache.tools.ant.UnknownElement.execute(UnknownElement.java:275)
[java] 	at org.apache.tools.ant.Task.perform(Task.java:364)
[java] 	at org.apache.tools.ant.taskdefs.MacroInstance.execute(MacroInstance.java:378)
[java] 	at org.apache.tools.ant.UnknownElement.execute(UnknownElement.java:275)
[java] 	at org.apache.tools.ant.Task.perform(Task.java:364)
[java] 	at org.apache.tools.ant.Target.execute(Target.java:341)
[java] 	at org.apache.tools.ant.Target.performTasks(Target.java:369)
[java] 	at org.apache.tools.ant.Project.executeSortedTargets(Project.java:1216)
[java] 	at org.apache.tools.ant.Project.executeTarget(Project.java:1185)
[java] 	at org.apache.tools.ant.helper.DefaultExecutor.executeTargets(DefaultExecutor.java:40)
[java] 	at org.apache.tools.ant.Project.executeTargets(Project.java:1068)
[java] 	at org.apache.tools.ant.Main.runBuild(Main.java:668)
[java] 	at org.apache.tools.ant.Main.startAnt(Main.java:187)
[java] 	at org.apache.tools.ant.launch.Launcher.run(Launcher.java:246)
[java] 	at org.apache.tools.ant.launch.Launcher.main(Launcher.java:67)
[java] Java Result: 104
[java] Java Result: 104
The execution FAILED with the following exception:
The following error occurred while executing this line:
/export/users/cc/cc-reliability/adaptors/reliability/adaptor.xml:97: Some reliability tests
failed on /export/users/cc/cc-reliability/build/checkouts/snapshot/hdk/jdk/jre/bin/java

***********************************************************
Unit Tests: (75)
        
error: test api.net.HttpConnectionTest
error: test api.net.MultiConnectTest
error: test api.net.SingleConnectTest
error: test api.nio.charset.DecodingModesTest
error: test api.nio.charset.EncodingModesTest
error: test api.util.ConcurrentTest
error: test vm.classloading.ClassCastTest
error: test vm.gc.WeakRefsTest
Unit Test Error Details:	(8)
                
Test: testClass: api.net.HttpConnectionTest
Test: testClass: api.net.MultiConnectTestSIGSEGV in VM code.
Stack trace:
Warning: Cannot get modules info, no symbolic information will be provided
  0: ?? (??:-1)
  1: org/apache/harmony/luni/platform/OSNetworkSystem.createServerStreamSocketImpl(Ljava/io/FileDescriptor;Z)V
(OSNetworkSystem.java:-2)
  2: org/apache/harmony/luni/platform/OSNetworkSystem.createServerStreamSocket(Ljava/io/FileDescriptor;Z)V
(OSNetworkSystem.java:223)
  3: org/apache/harmony/luni/net/PlainServerSocketImpl.create(Z)V (PlainServerSocketImpl.java:49)
  4: java/net/ServerSocket.LTinitGT(IILjava/net/InetAddress;)V (ServerSocket.java:117)
Test: testClass: api.net.SingleConnectTestServer thread 207 could not accept request: The
address is not available
FAILED
*** iteration: 0
test result is 105
Test FAILED
Test: testClass: api.nio.charset.DecodingModesTestSIGABRT in VM code.
Stack trace:
Test: testClass: api.nio.charset.EncodingModesTest
Test: testClass: api.util.ConcurrentTest
Test: testClass: vm.classloading.ClassCastTest
Test: testClass: vm.gc.WeakRefsTest

***********************************************************
Modifications since last successful build:	(11)
            
add cc-snapshot log20070821204201Lbuild.11 08/21/2007 20:42:01snapshot
add cc-snapshot log20070816185626Lbuild.10 08/16/2007 18:56:26snapshot
add cc-snapshot log20070810190745Lbuild.9 08/10/2007 19:07:45snapshot
add cc-snapshot log20070806194122Lbuild.8 08/06/2007 19:41:22snapshot
add cc-snapshot log20070801154520Lbuild.7 08/01/2007 15:45:20snapshot
add cc-snapshot log20070730190526Lbuild.6 07/30/2007 19:05:26snapshot
add cc-snapshot log20070724161634Lbuild.5 07/24/2007 16:16:34snapshot
add cc-snapshot log20070720170220Lbuild.4 07/20/2007 17:02:20snapshot
add cc-snapshot log20070719185009Lbuild.3 07/19/2007 18:50:09snapshot
add cc-snapshot log20070712182841Lbuild.2 07/12/2007 18:28:41snapshot
add cc-snapshot log20070711124837Lbuild.1 07/11/2007 12:48:37snapshot

begin 644 execution_log.zip
M4$L#! H    ( +>H%3>WY47-#0@  *Q<   2    97AE8W5T:6]N7VQO9RYH
M=&UL[5Q=;]NX$GW>_ J]7&SV(;*=[_IF SB.D[IPFB).6F"+H*"EL<6:(G5)
M*HG[Z^^0LE/935)+L;Q RZ*M18J<,QP.J3,4Q:-(Q^SX:"#"R?%1(N'XB'A*
M3QC\_>=0<+VEZ#=H>H?U__SWS^,-F?+FAF?^?/Y*[LBM=Y)2%@XIPR)XSW^(
MV=QM>QF/0RIOO;8$HB'T,-'T:O"0"*EKJ0*I:D& ?[<D,$H&E%$]J0V,W)H$
ME3*M:OD[V_7ZP5;]<&N[\:5^N+L]!S>7,/J0A/K?:-+\02GO,P21N/6N4LXI
M'WD:E&YZT^+^/S3I<"TG70T2=;Z.4/40BUUCJ2=$9=?O\'_ORFK<]!KUW8*8
MK9"!;%^U=[:K1#G'IG7Y9:K[&ML45PG5Y4-V"D-V#AJ%@*X2:WVM^H?1@6D5
MNH5< P[:[90&F@I.Y*1J/",?+8A-&TUZ< <_CN45@WTD$L<U@Q[PD8[*H3TY
MYL<@.3"?R)$J,O9SU?Q6DGR\:/<^$%F=0^7Q.@\0=/C=.J!LNZ1(0&H*JCSB
M2Z8';$X)TYMJ/MXUUEB]4I$0XS(.8>OA#!U>Q=_M]M9D5MQ=.>!^I,-[OC[0
M'%Y;8+YL$P75^(H8?(5 E^B7K*)_:7_:3/!7*%@<\(QRPI =K1,3'Z8!(TJ]
M)2H*1%A1AR3!>-1<NK32$A4OT7U9120*"KBBFMY5;<I'0'QX\[5B5<T@YT'[
M]N>US7RIS[5M4(D^SRJ.I$@3O\/3."/8U5HEP_2S3NBG*@$>&H$Q/)57O2)7
M$*12&7>W:=/Z7-Y:;-&?\""2@M-OQ)#+6?I?!]]>EQNTI"264"^FJU?@H\#H
M 4/F&?NU6IS">%Q=1+&$ A\ 9PLEJIX6IRI\ C*^@B%(X $0'N9&PO.W*IG&
MQ+TQ0;F9+*N+TRT)QM>2!-!Y"!)=$:.."2<CB(&784K?*^-H4QIBU$"D,H!+
M23$3*K)O(.($'4V6T'A6U7]'=7MZ78F22Q =#0^%C&[*^R?HMN-L!4G(+RW&
M>B(@#%05@\L"CD"W[@AE-J+.L+ZT!2L9Q3]I"$Z%'T1$*BADCUPUG.B0M^+M
M"V2O+X^4:QJ#2%'$F#(&H:<C\%0ZV$JD"$ ];\<_B/:$'*'")(C UT(PY1/T
M?$W4.(2A\DW#_:&0XTU[9:HU#_9V_WJM2!.]IAK,=4YRXZ"Q*LDYJ8=EU+WA
M8R[N>8=E4\%,ZD*VE;]]L%<"X!JU]C% 1N/&FS9AA>WLO\JX??A?BHI1PAY5
MSF59A)\!<'0]-31B \&1'@]\)D8T\+M#J^5,[#29]=N;@Y=E*AP5$H;,A&?G
MP"V5#2] 1R)L!<9%A=SS*;\3XT<3>WT[ZRXO]Q08C/!IC0-F3G W3MA,]HME
MLL[\25^:*Y\1#!UFN)FD&<(T967M'99UC%9($IP/'XV=S\LLOKWCG+J 4_]*
MYK@@@11=KC1!VO>H]7QNAG-P^,M;Y9I(?)KG!HI-9@)WRSQ-IA*F^AGUU+S4
M_3<EI'Z0PJY-3?7L"VF8I!6K-F<WIR.[L?]Z@$ST@N1&J?DH H;&P.EU2)#^
M=*Q\(>>!U.;B;8NX6U]52Q:-5-\OX]H7A.+S(N7V7>RF366S1WEI.-ZD;G&=
MD]8X_,G3\$EIC*08V_L]^X/V1C4W'Q/9:-LMXQB+<F/4<T'P_I/Z+D-1.SQ 
MEEI5(+R Y,AP6<F.##LR[,BP<^I?T!R.##LR[,BP(\/EY*Z4#'^2@H_:6>(]
MB5>]XV *Q3FP0CMS\O5\LP%UFO#;V>]9][)?,8-_ ELDDS-,5[9#YUED@SIM
M^05)U@Z/F F$)Q,-)^EP"/),(*^KP%,&5GIA1YE6\[\K2!@3 3+44RIQQJG2
M7L]CKQ?5O$,CZV[JAU1G%^N -9-4AM9G]#7N5P;RDR3)>76;G)\'70?BJ4@'
M#-;>T#,FB%X[:I>O'[.'S]BU@_8CI*@K0GUNQE[BY?IBH9<;@/IW+U>M9\&W
MV<B*WA%Y(UE;X-//[LZOK+\0ZZW6R9)(;I70K1*Z54*W2NB<^G<PAULE=*N$
M;I70K1*6D_OZ54*SFY-H,JKP"TF#<8'UZ)0 %\#9>5,0IX]9#(H#U?<* KT'
MW69FV_6*8IB[V'A?,%XVB)F5SS:NW_![RE>Y_QO%VV_4,'H/"WP8ME#MD<8)
M;G9'L"H\;!&R;1)MHE[N?1=DN2#+!5DNR')._3N8PP59+LAR098+LLK)72+(
M>HH_#[.C)2S[+<"?\]7\V?$4J_O2LSCVM?E&%L6ACZYR.P#"P4, B<%:>C/ 
M7"6_\WBY6KU&2Y]Z8PO/OG8NHL72@6V&<-Y>:0N7>*.7:LJ*O% SY7V,NX-4
M2G11%WRYX,L%7R_)=<&7<^K?PAPN^'+!EPN^7/!53FZ9X,OP467.XJ)Z4H3#
MSNK@#)Y=V'<)5V .BEWUX3H*)"T<'OY0$36=I@8,K+:K/ OTA3#AY*;;._7Z
M-^UVI]\_N^G-W;P6FC!/(\MO>ML[7DPY#@SE-;8]M+#@H67XGT,D-QIN/4-R
M#,7Q&GMUSVQ(5]Y0BO@5QTNC'686"$0RN?7,GOYY!"U>*W_C&J.6;-!C1WAG
MK6ZO<^K=4QW9>&8H&!/W!O0Q8&W:*KD;4@KIB<"&3*%W'Z%F,XFFRR.J/$8Y
M-#=^IBHQ7$O(>2VGF>8\[^:;@R82U!B\7 'K4VAK0DT,ADU8SB X#H,Q1F^J
MICA)5"1T+0K'M:_FGX3:@/*:\8*-HQHY/JK9P\AKV<'D-7M*^?\!4$L! A0#
M"@    @ MZ@5-[?E1<T-"   K%P  !(              *2!     &5X96-U
C=&EO;E]L;V<N:'1M;%!+!08      0 ! $     ]"      ! 
end

Mime
View raw message