harmony-alerts mailing list archives

Site index · List index
Message view « Date » · « Thread »
Top « Date » · « Thread »
From nom...@intel.com
Subject [build-test alert] FAILED Linux x86: jdktools-test
Date Tue, 21 Aug 2007 04:13:25 GMT
svn.revision=566013
BUILD FAILED:
	Ant Error Message:
/export/users2/cc/cc-suites/scripts/cc-exec-adaptor.xml:101: The following error occurred
while executing this line: /export/users2/cc/cc-suites/adaptors/jdktools-test/adaptor.xml:31:
The following error occurred while executing this line: /export/users2/cc/cc-suites/scripts/framework.xml:1069:
Java returned: 1

Date of build:	08/21/2007 11:13:12
Time to build:	7 seconds

***********************************************************
Errors/Warnings:	(2)
            
Build failed
The execution FAILED with the following exception:
The following error occurred while executing this line:
/export/users2/cc/cc-suites/adaptors/jdktools-test/adaptor.xml:31: The following error occurred
while executing this line:
/export/users2/cc/cc-suites/scripts/framework.xml:1069: Java returned: 1

***********************************************************
Unit Tests: (0)
        
No Tests Run: This project doesn't have any tests

***********************************************************
Modifications since last successful build:	(0)
            

begin 644 execution_log.zip
M4$L#! H    ( *I9%3>&Y?CI*@$   \"   2    97AE8W5T:6]N7VQO9RYH
M=&ULM5*Q3L,P$-W]%<> .J5NJ*C A$A%@ 1B9$,=W/A"W+IQY#LW*5^/4U0$
M8L;R8+WW[I[NGHN&=ZXLUMX<RJ(+6!8:B \.;R>U;SDC^X$*KF;G-Y-29(0<
MNVQCMNR]HZPG)406.Z,9?Z,PGC<<L%K!DB'@WI+U+5PN%K-\/A4BQ/:DVNB]
M7L%=M,[4UB6W]?B<#CL'QB-!ZQEPL,1G?PN@UJG$"/':((QVD4>;Q^73R\,]
M])8;X,34WCG?V_8]:2KL1HTZEOP@0O !?%7%$-! WZ2^IXZ)YL82.-NB$A*'
MS@>6D3#0A:RJ=#.*EI&D-KIC'TA^;R.A?(+'F=0\5_ ?UE0%VS').N@=]CYL
MCV[Y;'&MX#EM+(7 ,;1H%.2BD+HLY#%O^96]/'Z$3U!+ 0(4 PH    ( *I9
M%3>&Y?CI*@$   \"   2              "D@0    !E>&5C=71I;VY?;&]G
;+FAT;6Q02P4&      $  0!     6@$      
end

Mime
View raw message