harmony-alerts mailing list archives

Site index · List index
Message view « Date » · « Thread »
Top « Date » · « Thread »
From nom...@intel.com
Subject [build-test alert] BUILD FAILED Linux x86: reliability
Date Thu, 16 Aug 2007 12:22:22 GMT
BUILD FAILED:
	Ant Error Message:
/export/users/cc/cc-reliability/scripts/cc-exec-adaptor.xml:101: The following error occurred
while executing this line: /export/users/cc/cc-reliability/adaptors/reliability/adaptor.xml:97:
Some reliability tests failed on /export/users/cc/cc-reliability/build/checkouts/snapshot/hdk/jdk/jre/bin/java

Date of build:	08/16/2007 18:56:56
Time to build:	25 minutes 21 seconds
Last changed:	08/16/2007 18:56:26
Last log entry:	snapshot

***********************************************************
Errors/Warnings:	(279)
            
[java] Java Result: 104
[java] Java Result: 104
[java] Java Result: 104
[java] Java Result: 104
[java] Java Result: 104
[java] Java Result: 104
[java] Java Result: 104
[java] Java Result: 104
[java] Java Result: 104
[java] Java Result: 104
[java] Java Result: 104
[java] Java Result: 104
[java] Java Result: 104
[java] Java Result: 1
[java] Java Result: 104
[java] Java Result: 104
[java] Java Result: 104
[java] Java Result: 104
[java] Java Result: 104
[java] Java Result: 104
[java] Java Result: 104
[java] Java Result: 1
[java] Java Result: 104
[java] Java Result: 104
[java] Timeout: killed the sub-process
[java] 	at org.apache.tools.ant.taskdefs.Java.fork(Java.java:754)
[java] 	at org.apache.tools.ant.taskdefs.Java.executeJava(Java.java:171)
[java] 	at org.apache.tools.ant.taskdefs.Java.execute(Java.java:84)
[java] 	at org.apache.tools.ant.UnknownElement.execute(UnknownElement.java:275)
[java] 	at org.apache.tools.ant.Task.perform(Task.java:364)
[java] 	at org.apache.tools.ant.taskdefs.Sequential.execute(Sequential.java:64)
[java] 	at net.sf.antcontrib.logic.IfTask.execute(IfTask.java:197)
[java] 	at sun.reflect.GeneratedMethodAccessor5.invoke(Unknown Source)
[java] 	at sun.reflect.DelegatingMethodAccessorImpl.invoke(DelegatingMethodAccessorImpl.java:25)
[java] 	at java.lang.reflect.Method.invoke(Method.java:585)
[java] 	at org.apache.tools.ant.TaskAdapter.execute(TaskAdapter.java:123)
[java] 	at org.apache.tools.ant.UnknownElement.execute(UnknownElement.java:275)
[java] 	at org.apache.tools.ant.Task.perform(Task.java:364)
[java] 	at org.apache.tools.ant.taskdefs.Sequential.execute(Sequential.java:64)
[java] 	at org.apache.tools.ant.UnknownElement.execute(UnknownElement.java:275)
[java] 	at org.apache.tools.ant.Task.perform(Task.java:364)
[java] 	at org.apache.tools.ant.taskdefs.MacroInstance.execute(MacroInstance.java:378)
[java] 	at org.apache.tools.ant.UnknownElement.execute(UnknownElement.java:275)
[java] 	at org.apache.tools.ant.Task.perform(Task.java:364)
[java] 	at org.apache.tools.ant.Target.execute(Target.java:341)
[java] 	at org.apache.tools.ant.Target.performTasks(Target.java:369)
[java] 	at org.apache.tools.ant.Project.executeSortedTargets(Project.java:1216)
[java] 	at org.apache.tools.ant.Project.executeTarget(Project.java:1185)
[java] 	at org.apache.tools.ant.helper.DefaultExecutor.executeTargets(DefaultExecutor.java:40)
[java] 	at org.apache.tools.ant.Project.executeTargets(Project.java:1068)
[java] 	at org.apache.tools.ant.Main.runBuild(Main.java:668)
[java] 	at org.apache.tools.ant.Main.startAnt(Main.java:187)
[java] 	at org.apache.tools.ant.launch.Launcher.run(Launcher.java:246)
[java] 	at org.apache.tools.ant.launch.Launcher.main(Launcher.java:67)
[java] Timeout: killed the sub-process
[java] 	at org.apache.tools.ant.taskdefs.Java.fork(Java.java:754)
[java] 	at org.apache.tools.ant.taskdefs.Java.executeJava(Java.java:171)
[java] 	at org.apache.tools.ant.taskdefs.Java.execute(Java.java:84)
[java] 	at org.apache.tools.ant.UnknownElement.execute(UnknownElement.java:275)
[java] 	at org.apache.tools.ant.Task.perform(Task.java:364)
[java] 	at org.apache.tools.ant.taskdefs.Sequential.execute(Sequential.java:64)
[java] 	at net.sf.antcontrib.logic.IfTask.execute(IfTask.java:197)
[java] 	at sun.reflect.GeneratedMethodAccessor5.invoke(Unknown Source)
[java] 	at sun.reflect.DelegatingMethodAccessorImpl.invoke(DelegatingMethodAccessorImpl.java:25)
[java] 	at java.lang.reflect.Method.invoke(Method.java:585)
[java] 	at org.apache.tools.ant.TaskAdapter.execute(TaskAdapter.java:123)
[java] 	at org.apache.tools.ant.UnknownElement.execute(UnknownElement.java:275)
[java] 	at org.apache.tools.ant.Task.perform(Task.java:364)
[java] 	at org.apache.tools.ant.taskdefs.Sequential.execute(Sequential.java:64)
[java] 	at org.apache.tools.ant.UnknownElement.execute(UnknownElement.java:275)
[java] 	at org.apache.tools.ant.Task.perform(Task.java:364)
[java] 	at org.apache.tools.ant.taskdefs.MacroInstance.execute(MacroInstance.java:378)
[java] 	at org.apache.tools.ant.UnknownElement.execute(UnknownElement.java:275)
[java] 	at org.apache.tools.ant.Task.perform(Task.java:364)
[java] 	at org.apache.tools.ant.Target.execute(Target.java:341)
[java] 	at org.apache.tools.ant.Target.performTasks(Target.java:369)
[java] 	at org.apache.tools.ant.Project.executeSortedTargets(Project.java:1216)
[java] 	at org.apache.tools.ant.Project.executeTarget(Project.java:1185)
[java] 	at org.apache.tools.ant.helper.DefaultExecutor.executeTargets(DefaultExecutor.java:40)
[java] 	at org.apache.tools.ant.Project.executeTargets(Project.java:1068)
[java] 	at org.apache.tools.ant.Main.runBuild(Main.java:668)
[java] 	at org.apache.tools.ant.Main.startAnt(Main.java:187)
[java] 	at org.apache.tools.ant.launch.Launcher.run(Launcher.java:246)
[java] 	at org.apache.tools.ant.launch.Launcher.main(Launcher.java:67)
[java] Java Result: 104
[java] Java Result: 104
[java] Java Result: 1
[java] Java Result: 104
[java] Java Result: 104
[java] Java Result: 104
[java] Java Result: 104
[java] Java Result: 104
[java] Java Result: 104
[java] Java Result: 104
[java] Java Result: 104
[java] Timeout: killed the sub-process
[java] 	at org.apache.tools.ant.taskdefs.Java.fork(Java.java:754)
[java] 	at org.apache.tools.ant.taskdefs.Java.executeJava(Java.java:171)
[java] 	at org.apache.tools.ant.taskdefs.Java.execute(Java.java:84)
[java] 	at org.apache.tools.ant.UnknownElement.execute(UnknownElement.java:275)
[java] 	at org.apache.tools.ant.Task.perform(Task.java:364)
[java] 	at org.apache.tools.ant.taskdefs.Sequential.execute(Sequential.java:64)
[java] 	at net.sf.antcontrib.logic.IfTask.execute(IfTask.java:197)
[java] 	at sun.reflect.GeneratedMethodAccessor5.invoke(Unknown Source)
[java] 	at sun.reflect.DelegatingMethodAccessorImpl.invoke(DelegatingMethodAccessorImpl.java:25)
[java] 	at java.lang.reflect.Method.invoke(Method.java:585)
[java] 	at org.apache.tools.ant.TaskAdapter.execute(TaskAdapter.java:123)
[java] 	at org.apache.tools.ant.UnknownElement.execute(UnknownElement.java:275)
[java] 	at org.apache.tools.ant.Task.perform(Task.java:364)
[java] 	at org.apache.tools.ant.taskdefs.Sequential.execute(Sequential.java:64)
[java] 	at org.apache.tools.ant.UnknownElement.execute(UnknownElement.java:275)
[java] 	at org.apache.tools.ant.Task.perform(Task.java:364)
[java] 	at org.apache.tools.ant.taskdefs.MacroInstance.execute(MacroInstance.java:378)
[java] 	at org.apache.tools.ant.UnknownElement.execute(UnknownElement.java:275)
[java] 	at org.apache.tools.ant.Task.perform(Task.java:364)
[java] 	at org.apache.tools.ant.Target.execute(Target.java:341)
[java] 	at org.apache.tools.ant.Target.performTasks(Target.java:369)
[java] 	at org.apache.tools.ant.Project.executeSortedTargets(Project.java:1216)
[java] 	at org.apache.tools.ant.Project.executeTarget(Project.java:1185)
[java] 	at org.apache.tools.ant.helper.DefaultExecutor.executeTargets(DefaultExecutor.java:40)
[java] 	at org.apache.tools.ant.Project.executeTargets(Project.java:1068)
[java] 	at org.apache.tools.ant.Main.runBuild(Main.java:668)
[java] 	at org.apache.tools.ant.Main.startAnt(Main.java:187)
[java] 	at org.apache.tools.ant.launch.Launcher.run(Launcher.java:246)
[java] 	at org.apache.tools.ant.launch.Launcher.main(Launcher.java:67)
[java] Java Result: 104
[java] Timeout: killed the sub-process
[java] 	at org.apache.tools.ant.taskdefs.Java.fork(Java.java:754)
[java] 	at org.apache.tools.ant.taskdefs.Java.executeJava(Java.java:171)
[java] 	at org.apache.tools.ant.taskdefs.Java.execute(Java.java:84)
[java] 	at org.apache.tools.ant.UnknownElement.execute(UnknownElement.java:275)
[java] 	at org.apache.tools.ant.Task.perform(Task.java:364)
[java] 	at org.apache.tools.ant.taskdefs.Sequential.execute(Sequential.java:64)
[java] 	at net.sf.antcontrib.logic.IfTask.execute(IfTask.java:197)
[java] 	at sun.reflect.GeneratedMethodAccessor5.invoke(Unknown Source)
[java] 	at sun.reflect.DelegatingMethodAccessorImpl.invoke(DelegatingMethodAccessorImpl.java:25)
[java] 	at java.lang.reflect.Method.invoke(Method.java:585)
[java] 	at org.apache.tools.ant.TaskAdapter.execute(TaskAdapter.java:123)
[java] 	at org.apache.tools.ant.UnknownElement.execute(UnknownElement.java:275)
[java] 	at org.apache.tools.ant.Task.perform(Task.java:364)
[java] 	at org.apache.tools.ant.taskdefs.Sequential.execute(Sequential.java:64)
[java] 	at org.apache.tools.ant.UnknownElement.execute(UnknownElement.java:275)
[java] 	at org.apache.tools.ant.Task.perform(Task.java:364)
[java] 	at org.apache.tools.ant.taskdefs.MacroInstance.execute(MacroInstance.java:378)
[java] 	at org.apache.tools.ant.UnknownElement.execute(UnknownElement.java:275)
[java] 	at org.apache.tools.ant.Task.perform(Task.java:364)
[java] 	at org.apache.tools.ant.Target.execute(Target.java:341)
[java] 	at org.apache.tools.ant.Target.performTasks(Target.java:369)
[java] 	at org.apache.tools.ant.Project.executeSortedTargets(Project.java:1216)
[java] 	at org.apache.tools.ant.Project.executeTarget(Project.java:1185)
[java] 	at org.apache.tools.ant.helper.DefaultExecutor.executeTargets(DefaultExecutor.java:40)
[java] 	at org.apache.tools.ant.Project.executeTargets(Project.java:1068)
[java] 	at org.apache.tools.ant.Main.runBuild(Main.java:668)
[java] 	at org.apache.tools.ant.Main.startAnt(Main.java:187)
[java] 	at org.apache.tools.ant.launch.Launcher.run(Launcher.java:246)
[java] 	at org.apache.tools.ant.launch.Launcher.main(Launcher.java:67)
[java] Java Result: 104
[java] Java Result: 104
[java] Java Result: 104
[java] Java Result: 104
[java] Java Result: 139
[java] Java Result: 104
[java] Java Result: 104
[java] Java Result: 104
[java] Java Result: 104
[java] Java Result: 104
[java] Java Result: 104
[java] Java Result: 104
[java] Java Result: 104
[java] Java Result: 104
[java] Java Result: 104
[java] Java Result: 104
[java] Java Result: 104
[java] Java Result: 104
[java] Java Result: 104
[java] Timeout: killed the sub-process
[java] 	at org.apache.tools.ant.taskdefs.Java.fork(Java.java:754)
[java] 	at org.apache.tools.ant.taskdefs.Java.executeJava(Java.java:171)
[java] 	at org.apache.tools.ant.taskdefs.Java.execute(Java.java:84)
[java] 	at org.apache.tools.ant.UnknownElement.execute(UnknownElement.java:275)
[java] 	at org.apache.tools.ant.Task.perform(Task.java:364)
[java] 	at org.apache.tools.ant.taskdefs.Sequential.execute(Sequential.java:64)
[java] 	at net.sf.antcontrib.logic.IfTask.execute(IfTask.java:197)
[java] 	at sun.reflect.GeneratedMethodAccessor5.invoke(Unknown Source)
[java] 	at sun.reflect.DelegatingMethodAccessorImpl.invoke(DelegatingMethodAccessorImpl.java:25)
[java] 	at java.lang.reflect.Method.invoke(Method.java:585)
[java] 	at org.apache.tools.ant.TaskAdapter.execute(TaskAdapter.java:123)
[java] 	at org.apache.tools.ant.UnknownElement.execute(UnknownElement.java:275)
[java] 	at org.apache.tools.ant.Task.perform(Task.java:364)
[java] 	at org.apache.tools.ant.taskdefs.Sequential.execute(Sequential.java:64)
[java] 	at org.apache.tools.ant.UnknownElement.execute(UnknownElement.java:275)
[java] 	at org.apache.tools.ant.Task.perform(Task.java:364)
[java] 	at org.apache.tools.ant.taskdefs.MacroInstance.execute(MacroInstance.java:378)
[java] 	at org.apache.tools.ant.UnknownElement.execute(UnknownElement.java:275)
[java] 	at org.apache.tools.ant.Task.perform(Task.java:364)
[java] 	at org.apache.tools.ant.Target.execute(Target.java:341)
[java] 	at org.apache.tools.ant.Target.performTasks(Target.java:369)
[java] 	at org.apache.tools.ant.Project.executeSortedTargets(Project.java:1216)
[java] 	at org.apache.tools.ant.Project.executeTarget(Project.java:1185)
[java] 	at org.apache.tools.ant.helper.DefaultExecutor.executeTargets(DefaultExecutor.java:40)
[java] 	at org.apache.tools.ant.Project.executeTargets(Project.java:1068)
[java] 	at org.apache.tools.ant.Main.runBuild(Main.java:668)
[java] 	at org.apache.tools.ant.Main.startAnt(Main.java:187)
[java] 	at org.apache.tools.ant.launch.Launcher.run(Launcher.java:246)
[java] 	at org.apache.tools.ant.launch.Launcher.main(Launcher.java:67)
[java] Java Result: 104
[java] Java Result: 139
[java] Java Result: 105
[java] Java Result: 104
[java] Java Result: 104
[java] Java Result: 104
[java] Timeout: killed the sub-process
[java] 	at org.apache.tools.ant.taskdefs.Java.fork(Java.java:754)
[java] 	at org.apache.tools.ant.taskdefs.Java.executeJava(Java.java:171)
[java] 	at org.apache.tools.ant.taskdefs.Java.execute(Java.java:84)
[java] 	at org.apache.tools.ant.UnknownElement.execute(UnknownElement.java:275)
[java] 	at org.apache.tools.ant.Task.perform(Task.java:364)
[java] 	at org.apache.tools.ant.taskdefs.Sequential.execute(Sequential.java:64)
[java] 	at net.sf.antcontrib.logic.IfTask.execute(IfTask.java:197)
[java] 	at sun.reflect.GeneratedMethodAccessor5.invoke(Unknown Source)
[java] 	at sun.reflect.DelegatingMethodAccessorImpl.invoke(DelegatingMethodAccessorImpl.java:25)
[java] 	at java.lang.reflect.Method.invoke(Method.java:585)
[java] 	at org.apache.tools.ant.TaskAdapter.execute(TaskAdapter.java:123)
[java] 	at org.apache.tools.ant.UnknownElement.execute(UnknownElement.java:275)
[java] 	at org.apache.tools.ant.Task.perform(Task.java:364)
[java] 	at org.apache.tools.ant.taskdefs.Sequential.execute(Sequential.java:64)
[java] 	at org.apache.tools.ant.UnknownElement.execute(UnknownElement.java:275)
[java] 	at org.apache.tools.ant.Task.perform(Task.java:364)
[java] 	at org.apache.tools.ant.taskdefs.MacroInstance.execute(MacroInstance.java:378)
[java] 	at org.apache.tools.ant.UnknownElement.execute(UnknownElement.java:275)
[java] 	at org.apache.tools.ant.Task.perform(Task.java:364)
[java] 	at org.apache.tools.ant.Target.execute(Target.java:341)
[java] 	at org.apache.tools.ant.Target.performTasks(Target.java:369)
[java] 	at org.apache.tools.ant.Project.executeSortedTargets(Project.java:1216)
[java] 	at org.apache.tools.ant.Project.executeTarget(Project.java:1185)
[java] 	at org.apache.tools.ant.helper.DefaultExecutor.executeTargets(DefaultExecutor.java:40)
[java] 	at org.apache.tools.ant.Project.executeTargets(Project.java:1068)
[java] 	at org.apache.tools.ant.Main.runBuild(Main.java:668)
[java] 	at org.apache.tools.ant.Main.startAnt(Main.java:187)
[java] 	at org.apache.tools.ant.launch.Launcher.run(Launcher.java:246)
[java] 	at org.apache.tools.ant.launch.Launcher.main(Launcher.java:67)
[java] Java Result: 104
[java] Java Result: 104
[java] Java Result: 104
[java] Java Result: 104
[java] Java Result: 104
[java] Timeout: killed the sub-process
[java] 	at org.apache.tools.ant.taskdefs.Java.fork(Java.java:754)
[java] 	at org.apache.tools.ant.taskdefs.Java.executeJava(Java.java:171)
[java] 	at org.apache.tools.ant.taskdefs.Java.execute(Java.java:84)
[java] 	at org.apache.tools.ant.UnknownElement.execute(UnknownElement.java:275)
[java] 	at org.apache.tools.ant.Task.perform(Task.java:364)
[java] 	at org.apache.tools.ant.taskdefs.Sequential.execute(Sequential.java:64)
[java] 	at net.sf.antcontrib.logic.IfTask.execute(IfTask.java:197)
[java] 	at sun.reflect.GeneratedMethodAccessor5.invoke(Unknown Source)
[java] 	at sun.reflect.DelegatingMethodAccessorImpl.invoke(DelegatingMethodAccessorImpl.java:25)
[java] 	at java.lang.reflect.Method.invoke(Method.java:585)
[java] 	at org.apache.tools.ant.TaskAdapter.execute(TaskAdapter.java:123)
[java] 	at org.apache.tools.ant.UnknownElement.execute(UnknownElement.java:275)
[java] 	at org.apache.tools.ant.Task.perform(Task.java:364)
[java] 	at org.apache.tools.ant.taskdefs.Sequential.execute(Sequential.java:64)
[java] 	at org.apache.tools.ant.UnknownElement.execute(UnknownElement.java:275)
[java] 	at org.apache.tools.ant.Task.perform(Task.java:364)
[java] 	at org.apache.tools.ant.taskdefs.MacroInstance.execute(MacroInstance.java:378)
[java] 	at org.apache.tools.ant.UnknownElement.execute(UnknownElement.java:275)
[java] 	at org.apache.tools.ant.Task.perform(Task.java:364)
[java] 	at org.apache.tools.ant.Target.execute(Target.java:341)
[java] 	at org.apache.tools.ant.Target.performTasks(Target.java:369)
[java] 	at org.apache.tools.ant.Project.executeSortedTargets(Project.java:1216)
[java] 	at org.apache.tools.ant.Project.executeTarget(Project.java:1185)
[java] 	at org.apache.tools.ant.helper.DefaultExecutor.executeTargets(DefaultExecutor.java:40)
[java] 	at org.apache.tools.ant.Project.executeTargets(Project.java:1068)
[java] 	at org.apache.tools.ant.Main.runBuild(Main.java:668)
[java] 	at org.apache.tools.ant.Main.startAnt(Main.java:187)
[java] 	at org.apache.tools.ant.launch.Launcher.run(Launcher.java:246)
[java] 	at org.apache.tools.ant.launch.Launcher.main(Launcher.java:67)
[java] Java Result: 104
[java] Java Result: 104
The execution FAILED with the following exception:
The following error occurred while executing this line:
/export/users/cc/cc-reliability/adaptors/reliability/adaptor.xml:97: Some reliability tests
failed on /export/users/cc/cc-reliability/build/checkouts/snapshot/hdk/jdk/jre/bin/java

***********************************************************
Unit Tests: (75)
        
error: test api.kernel.hooks.AddRmPropertiesHooksTest
error: test api.kernel.string.InternThreadingTest
error: test api.kernel.thread.RecursiveThreadTest.RecursiveTest
error: test api.kernel.thread.ThreadArrayTest.ThreadArrayTest
error: test api.kernel.thread.ThreadSuspendResume.ThreadSuspendResume
error: test api.net.HttpConnectionTest
error: test api.net.MultiConnectTest
error: test api.net.SingleConnectTest
error: test api.nio.channels.filechannel.MappedByteBufferForceTest
error: test api.nio.charset.DecodingModesTest
error: test api.nio.charset.EncodingModesTest
error: test api.util.ConcurrentTest
error: test vm.classloading.ClassCastTest
Unit Test Error Details:	(13)
                
Test: testClass: api.kernel.hooks.AddRmPropertiesHooksTestOK
The GC did not provide gc_add_weak_root_set_entry()
OK
OK
OK
OK
OK
OK
OK
OK
OK
OK
OK
OK
OK
OK
OK
OK
OK
OK
OK
OK
OK
OK
OK
OK
OK
OK
Uncaught exception in main:
java.lang.OutOfMemoryError: Failed to create new thread
	at java.lang.Thread.start(Thread.java:744)
	at org.apache.harmony.test.reliability.api.kernel.hooks.AddRmPropertiesHooksTest.createExecutedHooks(Unknown
Source)
	at org.apache.harmony.test.reliability.api.kernel.hooks.AddRmPropertiesHooksTest.playWithShutdownHooks(Unknown
Source)
	at org.apache.harmony.test.reliability.api.kernel.hooks.AddRmPropertiesHooksTest.test(Unknown
Source)
	at org.apache.harmony.test.reliability.share.LongRunningTestStarter.test(Unknown Source)
	at org.apache.harmony.test.reliability.share.ReliabilityTestStarter.test(Unknown Source)
	at org.apache.harmony.test.reliability.share.ReliabilityTestStarter.main(Unknown Source)
Test: testClass: api.kernel.string.InternThreadingTestThe GC did not provide gc_add_weak_root_set_entry()
OK
OK
OK
OK
OK
OK
OK
OK
OK
OK
OK
OK
OK
OK
OK
OK
OK
OK
OK
OK
OK
OK
OK
OK
OK
OK
OK
OK
OK
OK
OK
OK
OK
OK
OK
OK
OK
OK
OK
OK
OK
OK
OK
OK
OK
OK
OK
OK
OK
OK
OK
OK
OK
OK
OK
OK
OK
OK
OK
OK
OK
OK
OK
OK
OK
OK
OK
OK
OK
OK
OK
OK
OK
OK
OK
OK
OK
OK
OK
OK
OK
OK
OK
OK
OK
OK
OK
OK
OK
OK
OK
OK
OK
OK
OK
OK
OK
OK
OK
OK
OK
OK
OK
OK
OK
OK
OK
OK
OK
Uncaught exception in main:
java.lang.OutOfMemoryError: Failed to create new thread
	at java.lang.Thread.start(Thread.java:744)
	at org.apache.harmony.test.reliability.api.kernel.string.InternThreadingTest.test(Unknown
Source)
	at org.apache.harmony.test.reliability.share.LongRunningTestStarter.test(Unknown Source)
	at org.apache.harmony.test.reliability.share.ReliabilityTestStarter.test(Unknown Source)
	at org.apache.harmony.test.reliability.share.ReliabilityTestStarter.main(Unknown Source)
Test: testClass: api.kernel.thread.RecursiveThreadTest.RecursiveTestOK
The GC did not provide gc_add_weak_root_set_entry()
OK
OK
OK
OK
OK
OK
OK
OK
OK
OK
OK
OK
OK
OK
OK
OK
OK
OK
OK
OK
OK
OK
OK
OK
OK
OK
OK
OK
OK
OK
OK
OK
OK
OK
OK
OK
OK
OK
OK
OK
OK
OK
OK
OK
OK
OK
OK
OK
OK
OK
OK
OK
OK
Uncaught exception in Thread-5528:
java.lang.OutOfMemoryError: Failed to create new thread
	at java.lang.Thread.start(Thread.java:744)
	at org.apache.harmony.test.reliability.api.kernel.thread.RecursiveThreadTest.recurThread.run(Unknown
Source)
Test: testClass: api.kernel.thread.ThreadArrayTest.ThreadArrayTestThe GC did not provide gc_add_weak_root_set_entry()
OK
Uncaught exception in main:
java.lang.OutOfMemoryError: Failed to create new thread
	at java.lang.Thread.start(Thread.java:744)
	at org.apache.harmony.test.reliability.api.kernel.thread.ThreadArrayTest.ThreadArrayTest.test(Unknown
Source)
	at org.apache.harmony.test.reliability.share.LongRunningTestStarter.test(Unknown Source)
	at org.apache.harmony.test.reliability.share.ReliabilityTestStarter.test(Unknown Source)
	at org.apache.harmony.test.reliability.share.ReliabilityTestStarter.main(Unknown Source)
Test: testClass: api.kernel.thread.ThreadSuspendResume.ThreadSuspendResumeThe GC did not provide
gc_add_weak_root_set_entry()
Test: testClass: api.net.HttpConnectionTest
Test: testClass: api.net.MultiConnectTestThe GC did not provide gc_add_weak_root_set_entry()
SIGSEGV in VM code.
Stack trace:
Warning: Cannot get modules info, no symbolic information will be provided
  0: ?? (??:-1)
  1: org/apache/harmony/luni/platform/OSNetworkSystem.createServerStreamSocketImpl(Ljava/io/FileDescriptor;Z)V
(OSNetworkSystem.java:-2)
  2: org/apache/harmony/luni/platform/OSNetworkSystem.createServerStreamSocket(Ljava/io/FileDescriptor;Z)V
(OSNetworkSystem.java:223)
  3: org/apache/harmony/luni/net/PlainServerSocketImpl.create(Z)V (PlainServerSocketImpl.java:49)
  4: java/net/ServerSocket.LTinitGT(IILjava/net/InetAddress;)V (ServerSocket.java:117)
  5: java/net/ServerSocket.LTinitGT(I)V (ServerSocket.java:76)
  6: org/apache/harmony/test/reliability/api/net/ServerRunner.run()V (??:-1)
  7: java/lang/Thread.runImpl()V (Thread.java:673)
LTend of stack traceGT
Test: testClass: api.net.SingleConnectTestThe GC did not provide gc_add_weak_root_set_entry()
Server thread 207 could not accept request: The address is not available
FAILED
*** iteration: 0
test result is 105
Test FAILED
Test: testClass: api.nio.channels.filechannel.MappedByteBufferForceTestThe GC did not provide
gc_add_weak_root_set_entry()
Test: testClass: api.nio.charset.DecodingModesTestSIGABRT in VM code.
Stack trace:
Test: testClass: api.nio.charset.EncodingModesTestThe GC did not provide gc_add_weak_root_set_entry()
Test: testClass: api.util.ConcurrentTest
Test: testClass: vm.classloading.ClassCastTestThe GC did not provide gc_add_weak_root_set_entry()

***********************************************************
Modifications since last successful build:	(10)
            
add cc-snapshot log20070816185626Lbuild.10 08/16/2007 18:56:26snapshot
add cc-snapshot log20070810190745Lbuild.9 08/10/2007 19:07:45snapshot
add cc-snapshot log20070806194122Lbuild.8 08/06/2007 19:41:22snapshot
add cc-snapshot log20070801154520Lbuild.7 08/01/2007 15:45:20snapshot
add cc-snapshot log20070730190526Lbuild.6 07/30/2007 19:05:26snapshot
add cc-snapshot log20070724161634Lbuild.5 07/24/2007 16:16:34snapshot
add cc-snapshot log20070720170220Lbuild.4 07/20/2007 17:02:20snapshot
add cc-snapshot log20070719185009Lbuild.3 07/19/2007 18:50:09snapshot
add cc-snapshot log20070712182841Lbuild.2 07/12/2007 18:28:41snapshot
add cc-snapshot log20070711124837Lbuild.1 07/11/2007 12:48:37snapshot

begin 644 execution_log.zip
M4$L#! H    ( ,F:$#<V(N[79P@   IQ   2    97AE8W5T:6]N7VQO9RYH
M=&UL[5W?<]JZ$GZ^^2O\<N?D/L20-#\Y.9E)"$GID)-.(.W,Z60ZPEZPBBSY
M2'(2^M??E0P4:$*PP3RTZK3%LJW]5JN5]*TDVZ>1CMG9:5>$P[/31,+9*?&4
M'C+XZX^>X'I'T>]0\XZK__WSC[,MF?+:EF?^?/E&'LF#=Y%2%O8HPUOPFO\<
MLYG+]C >A%0^>'4)1$/H8:+F5> Y$5)74@5258( _^Y(8)1T*:-Z6.D:N14)
M*F5:5::O[%6K1SO5XYW=PZ_5PX/#&;B9A-&')-3_3I/:3TIY7R"(Q(-WEW).
M>=_3H'3-&]WN_T.3!M=RV-0@4>=.A*J'>%L'[WI!5';\ ?_W[JS&-6^WNI\3
M\SQD(.MW]7=[9:)<8]&:_#;5;8UEBLN$:O(>NX0>NP:-0D"7B;6Y4OW#:->4
M"MU";@ '[79) TT%)W)8-IZ1CQ;$HO6'+7B$G]ORFL$^$8GMFD$+>%]'Q=!>
M;/,#D!R83V1?Y6G[4]G\\R3Y=%-O?22R/(>:QFL\0]#@CYN LN62(@&I*:CB
MB(M,#UB< J8WV7R\:JRQ?J4B(09%',+FPQXZO(M_V.V].9G#>"O!MB,=/O&\
MD$4\) .=PJL+/"_K1$$YGB*ZWR#0!6HER^C?VI\Z$WP%!?,#7E%.&'*C36+B
M4!HPHM1[HJ) A"552!(,^K6E[U9:HN(%JB_+B#1! 5=4T\>R33D!Q*&;;Q2K
M '\L#-FV/ZL6<E&-:UN< C6>9>Q+D29^@Z=Q1J[+K8@,T\^JH)VJ!'AH!,;P
MTKE7%>G0&$2*H@>4,0QB= 2>2KL[B10!*/5JOO\0[0G91_.1( )?"\&43[CV
M-5&#$/F=;XKH]X0<;-LCDZUV=+#_OU5%FI$TU6".IR3O'NVN2_*4U.,BZM[S
M 1=/O,$@!DR.I<Z=MO+WC@X* '10:Q\':S1NO&T35MB[PY6,VX9_4U2,$C91
M>>J417@+@(/V5<^(#3#"EK3K,]&G@=_L62W'8D?)K-Y.CA;+5-A&)<8E9K"X
M!FZ;5G@#.A+A>6!<5,@#G_)',9B8V&N+5 :PO-Q+8- G&MO9K.!FG+"Q[(7W
M9)7Y1EV:(Y\1[,K&N)FD,<(H964='!=UC/.0)-A%3HP]?2ZS^-X[Y]0YG/I7
M,L<-":1 8J()#V"B]>S9#.?H^)>W2@=C1M!3#<4F,X'[14:3D821?D8]-2OU
M\*2 5 S,+%,>Z=D6$CO 3*S:'E\<M>S=P]4!,M%SDG<+]4<1,#0&=J\]@D2G
M8>4+.0NDMN<O6\3]ZKI*,F^DZF$1U[XA%,>+E-MYX6V;RGJ/XM*PO4E]SO64
MM-WC-T;#%Z4QDO(@\EOV!^V-:FY/$EEKVR_B&/-R8]1S3O#AB_HN1UWOL)*D
M,N&131N^/'5N$7MVI-615D=:'6EU3OT[F,.15D=:'6EUI+68W#63UO80!4G!
MZ7=B%J_'Z<U,]BX W]O45/.YE,0NV,^G2YO_'\%_$@Q+S6"\MFYUN(3!H+S]
M"DLH\!&0HRA1]K++2(7/0 9WT ,)..@1'DY%3J]?*F6A1#P9$Q1;*\GR^FU-
M@D%'D@ :ST&B2UJOCPDG?3N&%U#V1V9L:TI#C!I8FGXK*9Z$DNP;B#A!1Y,%
M-!YG]3]071\=EZ+D$@NI&IYS&=W<[U^@VPZR_6E"?CUGK"4"PN#UH'Z%QF4!
M<;0]?R24V?TZ&=;7NF %]PB]: A.A1]$1"K(98^I;-C1!<*LM-Z(\(V=+6YR
MQ$V.N,D1-SGBG#I_+]O@ 7:T"[O77\V>;G;%S:ZXV14WNU),[M*S*RMS];EN
MVI'AHI(=&79DV)%AY]2_H#D<EW5<UG%9QV6+R5UYI7":HGZ6@O?K6>)O$J_[
MB:81%.? <CWW-YW/-X^WCQ)^/?N]:MZVRUK*>AU;),,K3)?V!."KR 9U5/(;
MDFP<'C$3""^&&B[27@_DE4!>ET.+=R?+>4K72L_M**-L_@\%"6,B0(9Z227V
M.&7:ZW7LS:*:-32RZ:)^3'5VL E8TTEE:&U&<[G?&B _2Y)<E_<*A==!-X%X
M*=(N@XT7](H)HC>.VN2;QVSA&+MQT':$%'5-J*_UV$LLKL_?M+@ J'_S=MUZ
MYES-1E;T@<A[R>H"1S_[[H_2Z@NQWFN=+(GD9@G=+*&;)72SA,ZI?P=SN%E"
M-TOH9@G=+&$QN:O/$IK=G$23?HGO7S,8-YB/C@AP\3FEMW':>(I!?J#J04Z@
MOT'7F=EVO:88YC$VWA<,E@UBQO=G&]?O^1/EZ]S_C>+M.[ P>@]SO'AJ+MN$
MQ@EN=D>P,CQL'K)N$G6B%M>^"[)<D.6"+!=D.:?^'<SA@BP79+D@RP59Q>0N
M$62]Q)][V:MK+?O-P9^GL_GCU]^N[TG/_-@=\XPLBD,?7>?&$82#YP 2@[7T
M9H"93'YC<KA>O?I+OU/;WCQ^VKF4'2,9PG5]K25<8D4OU93E65 S]_L8=P>I
ME.BB+OARP9<+OA;)=<&7<^K?PAPN^'+!EPN^7/!53&Z1X,OP467>W4KU, ^'
M'>?!'CP[L&L)=V ^0[7NE^LHD#1W>/A31M1TE.HRL-JN\TM#"\*$B_MFZ])K
MW]?KC7;[ZKXU<[$C-&&>1I9?\_8.O)AR;!C*VSWQT,*"AY;A?PF1W&AX\ S)
M,13'VSVH>F9#NO)Z4L0K?+P.[3"V0""2X8-G]O3/(FBQJORM#D8M6:/'BO"N
MSINMQJ7W1'5DXYF>8$P\&=!)P%JS6:8N2"FD)P(;,H7>4X2:C26:*H^H\ACE
M4-MZ2U5BN):0LUJ.3IJO!=9.CFI(4&/PIFZP/H6V)M3$8%B$Y0R"[3 88/2F
M*HJ31$5"5Z)P4/EF_DFH="FO&"_8.JV0L].*_=1A)?OL8<5^ _'_4$L! A0#
M"@    @ R9H0-S8B[M=G"   "G$  !(              *2!     &5X96-U
C=&EO;E]L;V<N:'1M;%!+!08      0 ! $    "7"      ! 
end

Mime
View raw message