harmony-alerts mailing list archives

Site index · List index
Message view « Date » · « Thread »
Top « Date » · « Thread »
From nom...@intel.com
Subject [build-test alert] BUILD FAILED Linux x86: ega. (Eclipse x 48h)
Date Thu, 16 Aug 2007 12:07:43 GMT
BUILD FAILED:
	Ant Error Message:
/export/users/cc/cc-EGAx48/scripts/cc-exec-adaptor.xml:101: The following error occurred while
executing this line: /export/users/cc/cc-EGAx48/adaptors/ega/adaptor.xml:58: EGA scenario
failed.

Date of build:	08/16/2007 18:52:14
Time to build:	15 minutes 22 seconds
Last changed:	08/16/2007 18:51:44
Last log entry:	snapshot

***********************************************************
Errors/Warnings:	(186)
            
[exec] Result: 25
[echo]
[echo]
[echo] ========================== EGA.log =======================
[echo]
[echo] --- Automated EGA scenario for Eclipse 3.2.1 ---
[echo]
[echo]
[echo] Eclipse Home = /export/users/cc/cc-EGAx48/build/libs/eclipse-3.2.l-lnx-x86/eclipse
[echo] Tested JRE Home = /export/users/cc/cc-EGAx48/build/checkouts/snapshot/hdk/jdk
[echo] OS_ARCH = x86
[echo]
[echo] Tested JRE options for Eclipse launching = -showversion -Xmx600M -Xms512M
[echo] Tested JRE options for debug step =
[echo]
[echo] Time frame for the scenario run = 48 hours
[echo] Delay factor = 2
[echo] Kill Eclipse if EGA scenario fails = 1
[echo] Start:
[echo] 	Run Eclipse
[echo] 	Select workspace
[echo] 	wait window 'Workspace Launcher' to appear ...
[echo] 	window 'Workspace Launcher' (29360183) appeared
[echo] 	Select /export/users/cc/cc-EGAx48/tests/ega/workspace as workspace
[echo] 	Press 'OK' button
[echo] 	wait window (29360183) to close ...
[echo] 	window (29360183) successfully closed
[echo]
[echo] Prepare Eclipse environment:
[echo] 	Close Welcome page
[echo] 	wait window 'Java - Eclipse SDK' to appear ...
[echo] 	window 'Java - Eclipse SDK' (29360616) appeared
[echo] 	Uncheck Project->Build Automatically
[echo] 	Select Window->Preferences
[echo] 	wait window 'Preferences' to appear ...
[echo] 	window 'Preferences' (29362440) appeared
[echo] 	Select Java->Build Path->Classpath Variables
[echo] 	Create M2_REPO variable
[echo] 	wait window 'New Variable Entry' to appear ...
[echo] 	window 'New Variable Entry' (29363790) appeared
[echo] 	Set M2_REPO value to /export/users/cc/cc-EGAx48/tests/ega/project/.m2/repository
[echo] 	Press OK button
[echo] 	wait window (29363790) to close ...
[echo] 	window (29363790) successfully closed
[echo] 	Press OK button to apply new preferences
[echo] 	wait window (29362440) to close ...
[echo] 	window (29362440) successfully closed
[echo] 	wait window 'Java - Eclipse SDK' to appear ...
[echo] 	window 'Java - Eclipse SDK' (29360616) appeared
[echo]
[echo] Import geronimo modules into workspace:
[echo] 	Select File->Import...
[echo] 	wait window 'Import' to appear ...
[echo] 	window 'Import' (29365145) appeared
[echo] 	Select import existing project
[echo] 	Type path to search projects: /export/users/cc/cc-EGAx48/tests/ega/project/geronimo-1.2-beta/modules
[echo] 	Uncheck all builders
[echo] 	Import
[echo] 	wait window (29365145) to close ...
[echo] 	window (29365145) successfully closed
[echo]
[echo] Import testsupport module into workspace:
[echo] 	wait window 'Java - Eclipse SDK' to appear ...
[echo] 	window 'Java - Eclipse SDK' (29360616) appeared
[echo] 	Select File->Import...
[echo] 	wait window 'Import' to appear ...
[echo] 	window 'Import' (29377007) appeared
[echo] 	Select import existing project
[echo] 	Type path to search projects: /export/users/cc/cc-EGAx48/tests/ega/project/geronimo-1.2-beta/testsupport
[echo] 	Import
[echo] 	wait window (29377007) to close ...
[echo] 	window (29377007) successfully closed
[echo]
[echo] Start repetable part:
[echo]
[echo] -------------------- Iteration 1 start ------------------
[echo]
[echo] Clean all Geronimo modules:
[echo] 	wait window 'Java - Eclipse SDK' to appear ...
[echo] 	window 'Java - Eclipse SDK' (29360616) appeared
[echo] 	Select Project->Clean...
[echo] 	wait window 'Clean' to appear ...
[echo] 	window 'Clean' (29380173) appeared
[echo] 	Uncheck start build immediatelly
[echo] 	wait window (29380173) to close ...
[echo] 	window (29380173) successfully closed
[echo] 	window 'Cleaning selected projects' (29380693) appeared
[echo] 	wait window (29380693) to close ...
[echo] 	window (29380693) successfully closed
[echo]
[echo] Build all Geronimo modules:
[echo] 	wait window 'Java - Eclipse SDK' to appear ...
[echo] 	window 'Java - Eclipse SDK' (29360616) appeared
[echo] 	Select Project->Build All
[echo] 	wait window 'Building Workspace' to appear ...
[echo] 	window 'Building Workspace' (29381654) appeared
[echo] 	wait window (29381654) to close ...
[echo] 	window (29381654) successfully closed
[echo] 	wait window 'Java - Eclipse SDK' to appear ...
[echo] 	window 'Java - Eclipse SDK' (29360616) appeared
[echo]
[echo] Open Navigator view:
[echo]
[echo] Fix org.apache.geronimo.common.propertyeditor.PropertyEditorsTest:
[echo] 	Select 'Navigate->Open Resource'
[echo] 	wait window 'Open Resource' to appear ...
[echo] 	window 'Open Resource' (29383289) appeared
[echo] 	Type PropertyEditorsTest.java into 'Open Resource' dialog
[echo] 	wait window (29383289) to close ...
[echo] 	window (29383289) successfully closed
[echo] 	wait window 'Java - PropertyEditorsTest.java - Eclipse SDK' to appear ...
[echo] 	window 'Java - PropertyEditorsTest.java - Eclipse SDK' (29360616) appeared
[echo] 	Go to line 'protected void setUp() throws Exception {'
[echo] 	wait window 'Go to Line' to appear ...
[echo] 	window 'Go to Line' (29387628) appeared
[echo] 	wait window (29387628) to close ...
[echo] 	window (29387628) successfully closed
[echo] 	wait window 'Java - PropertyEditorsTest.java - Eclipse SDK' to appear ...
[echo] 	window 'Java - PropertyEditorsTest.java - Eclipse SDK' (29360616) appeared
[echo] 	Add line Class.forName("org.apache.geronimo.common.propertyeditor.PropertyEditors");
to setUp() method
[echo] 	Save PropertyEditorsTest.java
[echo] 	Close PropertyEditorsTest.java
[echo] 	wait window 'Java - Eclipse SDK' to appear ...
[echo] 	window 'Java - Eclipse SDK' (29360616) appeared
[echo]
[echo] Run JUnit tests from geronimo-common module:
[echo] 	Select geronimo-common module
[echo] 	Open Run->Run
[echo] 	wait window 'Run' to appear ...
[echo] 	window 'Run' (29392402) appeared
[echo] 	Create new JUnit run configuration
[echo] 	Run
[echo] 	wait window (29392402) to close ...
[echo] 	window (29392402) successfully closed
[echo]
[echo] Modify GBeanData class from geronimo-kernel module:
[echo] 	wait window 'Java - Eclipse SDK' to appear ...
[echo] 	window 'Java - Eclipse SDK' (29360616) appeared
[echo] 	Select geronimo-kernel module
[echo] 	Select Navigate->Go Into
[echo] 	Open GBeanData.java
[echo] 	wait window 'Java - GBeanData.java - Eclipse SDK' to appear ...
[echo]
[echo] ERROR: Window 'Java - GBeanData.java - Eclipse SDK' didn't appear for 200 sec!
[echo]
[echo] Print error screen picture:
[echo] 	Picture was saved to /export/users/cc/cc-EGAx48/build/results/ega/20070816_0652/error.xwd
[echo] 	Please, use command 'xwud -in ./error.xwd' to view the error screen picture
[echo]
[echo] Kill Eclipse:
[echo] 	Found 1 Eclipse processes
[echo] 	Process 0:
[echo] 	Eclipse process was killed
[echo]
[echo]
[echo] EGA FAILED!
[echo]
[echo] ======================= eclipse.log =======================
[echo] Apache Harmony Launcher : (c) Copyright 1991, 2006 The Apache Software Foundation or
its licensors, as applicable.
[echo] java version "1.5.0"
[echo] pre-alpha : not complete or compatible
[echo] svn = r566013, (Aug 15 2007), Linux/ia32/gcc 3.3.3, release build
[echo] http://harmony.apache.org
[echo] Install location:
[echo]     file:/export/users/cc/cc-EGAx48/build/libs/eclipse-3.2.l-lnx-x86/eclipse/
[echo] Configuration file:
[echo]     file:/export/users/cc/cc-EGAx48/build/libs/eclipse-3.2.l-lnx-x86/eclipse/configuration/config.ini
loaded
[echo] Configuration location:
[echo]     file:/export/users/cc/cc-EGAx48/build/libs/eclipse-3.2.l-lnx-x86/eclipse/configuration/
[echo] Framework located:
[echo]     file:/export/users/cc/cc-EGAx48/build/libs/eclipse-3.2.l-lnx-x86/eclipse/plugins/org.eclipse.osgi_3.2.1.R32x_v20060919.jar
[echo] Framework classpath:
[echo]     file:/export/users/cc/cc-EGAx48/build/libs/eclipse-3.2.l-lnx-x86/eclipse/plugins/org.eclipse.osgi_3.2.1.R32x_v20060919.jar
[echo] Debug options:
[echo]     file:/export/users/cc/cc-EGAx48/tests/ega/.options not found
[echo] The GC did not provide gc_add_weak_root_set_entry()
[echo] Time to load bundles: 397
[echo] Starting application: 8264
[echo] Application Started: 38302
[echo]
[echo] ===========================================================
BUILD FAILED
/export/users/cc/cc-EGAx48/tests/ega/build.xml:464: EGA FAILED!
Total time: 15 minutes 21 seconds
The execution FAILED with the following exception:
The following error occurred while executing this line:
/export/users/cc/cc-EGAx48/adaptors/ega/adaptor.xml:58: EGA scenario failed.

***********************************************************
Unit Tests: (0)
        
No Tests Run: This project doesn't have any tests

***********************************************************
Modifications since last successful build:	(7)
            
add cc-snapshot log20070816185144Lbuild.7 08/16/2007 18:51:44snapshot
add cc-snapshot log20070810185923Lbuild.6 08/10/2007 18:59:23snapshot
add cc-snapshot log20070806193341Lbuild.5 08/06/2007 19:33:41snapshot
add cc-snapshot log20070801153819Lbuild.4 08/01/2007 15:38:19snapshot
add cc-snapshot log20070730185843Lbuild.3 07/30/2007 18:58:43snapshot
add cc-snapshot log20070724161107Lbuild.2 07/24/2007 16:11:07snapshot
add cc-snapshot log20070720165026Lbuild.1 07/20/2007 16:50:26snapshot

begin 644 execution_log.zip
M4$L#! H    ( /.8$#?N>3"G= H   \[   2    97AE8W5T:6]N7VQO9RYH
M=&ULY5OK;MNX$OZ]>0IN@8.D0"SYDCB.-PV0)FF:WA(X[7:!H@@8B;;92*(@
M4K[TO/P9#B5'=BQ9\GK;=(]W4=@19S@S_#@7<G0T5+YW?'0GW.GQ41BQXR-*
MI)IZ[,5V7P2J)OEWUB6=^G_^V#[>BN*@NT7TY\LW.J)?R<N8>VZ?>S#D3G^U
M)KXW-V#NQR-R\YTY0_&5U/2'].* G%^<$.FP@$9<$!$0-62D+SQ/C'DP((X(
M^GP01U1Q>(94N3P_,JF82][TSLD+8K-)*")EQY)%TG8<^+\&4TWV.C;*;CM#
MYMR+6$E;!C240Z'LH7MO?W/O<R<X=SP>2D9>"Y^5F<+C=])FAJC6LIJ65_."
M26W2::=_S;=>=MZ;U#Q<L<020>S?L0B$J*^F@H4@BJ/(>YW<X6?,HU/2IXX2
MFF\S=^!;[GDS4_#^P^+U*?<DD#;*:959+A%JI22L>S3C[-$X<(8: R](#99G
M/ (K(PC^\B?M>OV]_B+W&\WWE6< Q+GL+AX ]%D([(M1NN8GWPB(/(O&2G#5
M735,?U\Y*$%3V7%68LJ5XT>^E1BN:*CP0_ )E@)K6XY'I5RZ[2?,^4I.0@J<
MR6L:^2*8DG>XQH#C+MEQGI-3$4XC/A@JTC@\;.R29KW>)A]A?$)V(_IJ3"-&
M7HDX<,U&@/7D2A*/ PJEB.0NH9+0,(0_T#N0*E<4_1>28NI9P]JWZL^6(@%'
M@Z^L42\<4A U$ J5]IAB>G[]'82!V7+)Y2@ G$7[[7:]T=HE.R< OL:^5O#@
M^2YYQX-X8G/::MH#QR$M"_[;)1'S&(6-@+XDE_-0J;!KVT-C48NBI2P1#4JL
M+6Z"S:TP;IE3$#K0NS;=Q_,>W+(>K<@7EVE+H@=B2I.Z/&+:#4TWX6+M.0%L
ML,QL&P@YX$]'&D=$S )?K5WUTY$J#F&C_61Y+,F4GD2N%*/[#\QN?ED\X/D[
MQ%@ILY1( AE,P:Y:3@.R/-I<7P9Q\)V'D(!,0AJXVMPKU:21,YRI>7/V%E5M
MU#SM:FH#=6\I&EF#[T2):KQNE1]JVD<.X L@ET89&4NLQ3+&A =E9,I?QDV 
MI)3&J<OK,5^,LBYO+*)["8Z8;=#=:=\+"@^H/>.>[X,C1I%SQ&3L071\F&&)
M0.2+?P\#$C+(E^!'"1,EO%$D'<?JG4;[MM[>ST\<;\"(:B[?SQUZC:%OETC&
M_H8D-@RS/#' K,]E2N>GN8&TAURZI+F?G__W>E>]+OG, U>,R?8;G4'4R,5+
MB'AG5%',U> /*0Q@UVV#,=U@6^F,A &VM2 @(NCE_$ZH(I86^C8%&FY1*_0@
MFPD8.6AWK'SO$4:P3RR=<EL^DY(.6'Y,SGV0_^1%[H>D1LU[7ET,70J>0#KL
M(_SF"L)L18#FP<'5I_A9-5UVJDPY4G:V-8K4JYO;D][I:^"^Q!>NML=/J\K*
M563Y7'6!VX^H_A>XZ5,$F2V =>U+AB*.9#Z/Q1(X?^1B#3R/V;0.+JCHM2OL
MYC__#4]&$O[YHVX@A#@J$V_RAXXIAX&)Y_H\(T@KL&V=""1.:EF,>.!3P&*G
M>=B" J?3>IZP8DOKECG9JX4\7=R5T?8:8H(DVU?@@.]BI0"?Y2R3T0#LX7A"
M+HWAC\R1H9.QX\#D_=CSIH:#NP:<08%05[HI!E@PXI$(?!84PN84)?[,/$<[
MF!"B0EE(O%D2NRI"8AD+8YAVHUT&$I\"]'>@O/@&V*@=XX%C&AJ@H-<F78DH
M$YYKQV#"/HM8 *M1U@@9DLK:S]&BVLV]O7J%G:#-EZI\3=6P=GRJ2^T0OI(_
MP;'HXXPB34SZ1MXW;WOGUU=DE)"4U?T#&\^F(>>!BJ:53;",!5JB=7!8TA(J
M([\7LQ7ER8.'" UD;,MO0CX8"LDQW5WE(:[>)OZA@GLPRE1W#X:NDGM8E#)9
M$* ,P-1A98!G8%E=?D-73?ZGYF)R'USZ&F-DP,#)<E\07[BQWFY8C,XB3I'K
M37;Q*^ZQVK%A!RJ5M8TAJ&R/E QML-_8VZ_@;[A1F4VXQ&(QV4(%$G^<ACJH
M@#\",27317)*)0LKQL?[-#5TK6$U:W=0FMFIQ5>'!P@#YE"4%25SOR5+6F%G
M& -6WQF&;C.!/Y$:+1:'^-U8I@(4G]JN^_E[X^! G[3_LGLCBX8- CZQ2F7 
M)W2; ;PY%8*8#8KJO"$LKHPJW=61R]F%:0-*2SW1BHNZ4E/A'0>ZH8N%>/$K
M[LI9MHUJ5=B7.+ZRV F5EK13;QR4JA53SV^6$'T_;%&?N1PRWN*B8!'SR9R5
M,9_054Q_LCIK/R+1Y$"3NH;4$.W#4H9XK T2KJ$-TFUF!YN2Y5^W'9+B$]0J
MJ002Z%6>G8U45F(9"URO1GM_;RV &,+J #%T_])L_RID ?E 1WQ ]5'?B+/Q
M.B'G%9\0?5>:7+JG<=MRA.^+P((]'K)(3<%-P2S6=?+S'']*?0Q:HI[83L2$
MQ FE[C$IXDCCHN0Z+%!57((%:H1&J]DY+(-%3(F6:&WN23"=7>0/#EU?+53 
MMQ&F.KX-W=_'=ZY^&X%^6>Z5'-V%T-+@'=,V8%29B#02W(7XI#Z%.V#/823&
MDIQ/'(9'].2_I?%FN+\#[I65SI+B(AVTFYVUO)XAK(X*0_=_B8H3US68P%-'
MJR^B#]1G.\_6=G#/GO]A:B$#*9^IH2BRXPT=%;B+56?>:Q#^,N%*7P:]^13P
MY%B ]"/ASXZJ:F8QDI2K1$193EA 9WQT'-2.M2 E[0E#*QL0:;3%#IM[]689
MT"9GWOHTU!A(7_7-=YP5W[&5]RF)3)5]2D*WF53[O7!Y?_K0<D"P&V\!$/<L
M"IA7 A!/;0,\0NB<)JN1_9 J022YA/QB!:87.C>J&:JX[:.<Y7(?;+C39)W[
M1\C/"(LB8".=B(&U0NZH."H$U+490L94$@GNW"W57I;?OX/S6Y-QX15)TBH4
M8Z^I[]/ )=N3<>R2&@]T@TW* Q=%I_K8'+!,M37LE&T$*+(,=BR3QFS%('1J
M=U!XWGUMQI!Z$>,%AFCZ>Q!J+?>2C\>+$_+JY/+=^5D!F*JW$Y&T^7&M?J*G
MT4R.HN!^+--,CJ/7;R9'\G^DF1PYEVLFSU)<!E+IDQ]/.&C"_"8T_<%WAS;1
MH9M_-#L7^W&^'R-17L\P6(:Z!3%O7N ?;,9YH?//.71;E;YY,O(Q]P>)%WKQ
M@ ?R4<]^TBC9:S4GMR.]K^N'C4.(B?DMN@\:.&E/Q2^GPQDVR"U]6Z.J] ]W
M3NG;'^B'^MH3YC+6OO/B5*<9.!@"SHB[C R<6^JZMV-&[V\C(=0M%'RW3#=_
M[#S/YZ6[]?0A!&P.\$F!BX?%K<.#XFLB?3*:N&/<):33;.\5Q(?92$,.P"6M
M3JN>WZ*\3D/LRL\<S[D?+S]=OCM+ NO<@U)K-WL'L[O7WNMF8W3^C!\%N&M\
M&["K8X8/P0(8DF9#)XHB<.?[HS'O3!NC&UM;&@*Z6SI&FYK)("_6EYYS;VVR
M]-RHBR29!YAU"<>)(R@$R'@(0$TYPF,UY!(/(;I;!1:@+@UUC8]&2'Z@&?8[
MW<>=F,RUMHYL>GQDX_NNMGGWU<878?\'4$L! A0#"@    @ \Y@0-^YY,*=T
M"@  #SL  !(              *2!     &5X96-U=&EO;E]L;V<N:'1M;%!+
4!08      0 ! $    "D"@     ! 
end

Mime
View raw message