harmony-alerts mailing list archives

Site index · List index
Message view « Date » · « Thread »
Top « Date » · « Thread »
From nom...@intel.com
Subject [build-test alert] BUILD FAILED Linux SUSE 9 gcc debug: drlvm test
Date Mon, 13 Aug 2007 16:34:35 GMT
BUILD FAILED:
	Ant Error Message:
/export/cruise/trunk/cc/projects/drlvm/trunk/build/make/build.xml:398: The following error occurred while executing this line: /export/cruise/trunk/cc/projects/drlvm/trunk/build/make/build_component.xml:73: The following error occurred while executing this line: /export/cruise/trunk/cc/projects/drlvm/trunk/build/lnx_ia32_gcc_debug/semis/build/targets/test.xml:6: Some tests failed

Date of build:	08/13/2007 17:08:43
Time to build:	385 minutes 24 seconds
Last changed:	08/13/2007 16:13:48
Last log entry:	GCC compilation fixed

***********************************************************
Execution log (errors/warnings messages):	
/usr/lib/gcc-lib/i586-suse-linux/3.3.3/../../../../i586-suse-linux/bin/ld: warning: libhysig.so, needed by /export/cruise/trunk/cc/projects/classlib/trunk/deploy/jdk/jre/bin/libhyzlib.so, not found (try using -rpath or -rpath-link)
/usr/lib/gcc-lib/i586-suse-linux/3.3.3/../../../../i586-suse-linux/bin/ld: warning: libhysig.so, needed by /export/cruise/trunk/cc/projects/classlib/trunk/deploy/jdk/jre/bin/libhyzlib.so, not found (try using -rpath or -rpath-link)
/usr/lib/gcc-lib/i586-suse-linux/3.3.3/../../../../i586-suse-linux/bin/ld: warning: libhysig.so, needed by /export/cruise/trunk/cc/projects/classlib/trunk/deploy/jdk/jre/bin/libhyzlib.so, not found (try using -rpath or -rpath-link)
/usr/lib/gcc-lib/i586-suse-linux/3.3.3/../../../../i586-suse-linux/bin/ld: warning: libhysig.so, needed by /export/cruise/trunk/cc/projects/classlib/trunk/deploy/jdk/jre/bin/libhyzlib.so, not found (try using -rpath or -rpath-link)
/usr/lib/gcc-lib/i586-suse-linux/3.3.3/../../../../i586-suse-linux/bin/ld: warning: libhysig.so, needed by /export/cruise/trunk/cc/projects/classlib/trunk/deploy/jdk/jre/bin/libhyzlib.so, not found (try using -rpath or -rpath-link)
/usr/lib/gcc-lib/i586-suse-linux/3.3.3/../../../../i586-suse-linux/bin/ld: warning: libhysig.so, needed by /export/cruise/trunk/cc/projects/classlib/trunk/deploy/jdk/jre/bin/libhyzlib.so, not found (try using -rpath or -rpath-link)
/usr/lib/gcc-lib/i586-suse-linux/3.3.3/../../../../i586-suse-linux/bin/ld: warning: libhysig.so, needed by /export/cruise/trunk/cc/projects/classlib/trunk/deploy/jdk/jre/bin/libhyzlib.so, not found (try using -rpath or -rpath-link)
/usr/lib/gcc-lib/i586-suse-linux/3.3.3/../../../../i586-suse-linux/bin/ld: warning: libhysig.so, needed by /export/cruise/trunk/cc/projects/classlib/trunk/deploy/jdk/jre/bin/libhyzlib.so, not found (try using -rpath or -rpath-link)
/usr/lib/gcc-lib/i586-suse-linux/3.3.3/../../../../i586-suse-linux/bin/ld: warning: libhysig.so, needed by /export/cruise/trunk/cc/projects/classlib/trunk/deploy/jdk/jre/bin/libhyzlib.so, not found (try using -rpath or -rpath-link)
/usr/lib/gcc-lib/i586-suse-linux/3.3.3/../../../../i586-suse-linux/bin/ld: warning: libhysig.so, needed by /export/cruise/trunk/cc/projects/classlib/trunk/deploy/jdk/jre/bin/libhyzlib.so, not found (try using -rpath or -rpath-link)
/usr/lib/gcc-lib/i586-suse-linux/3.3.3/../../../../i586-suse-linux/bin/ld: warning: libhysig.so, needed by /export/cruise/trunk/cc/projects/classlib/trunk/deploy/jdk/jre/bin/libhyzlib.so, not found (try using -rpath or -rpath-link)
/usr/lib/gcc-lib/i586-suse-linux/3.3.3/../../../../i586-suse-linux/bin/ld: warning: libhysig.so, needed by /export/cruise/trunk/cc/projects/classlib/trunk/deploy/jdk/jre/bin/libhyzlib.so, not found (try using -rpath or -rpath-link)
/usr/lib/gcc-lib/i586-suse-linux/3.3.3/../../../../i586-suse-linux/bin/ld: warning: libhysig.so, needed by /export/cruise/trunk/cc/projects/classlib/trunk/deploy/jdk/jre/bin/libhyzlib.so, not found (try using -rpath or -rpath-link)
/usr/lib/gcc-lib/i586-suse-linux/3.3.3/../../../../i586-suse-linux/bin/ld: warning: libhysig.so, needed by /export/cruise/trunk/cc/projects/classlib/trunk/deploy/jdk/jre/bin/libhyzlib.so, not found (try using -rpath or -rpath-link)
/usr/lib/gcc-lib/i586-suse-linux/3.3.3/../../../../i586-suse-linux/bin/ld: warning: libhysig.so, needed by /export/cruise/trunk/cc/projects/classlib/trunk/deploy/jdk/jre/bin/libhyzlib.so, not found (try using -rpath or -rpath-link)
/usr/lib/gcc-lib/i586-suse-linux/3.3.3/../../../../i586-suse-linux/bin/ld: warning: libhysig.so, needed by /export/cruise/trunk/cc/projects/classlib/trunk/deploy/jdk/jre/bin/libhyzlib.so, not found (try using -rpath or -rpath-link)
/usr/lib/gcc-lib/i586-suse-linux/3.3.3/../../../../i586-suse-linux/bin/ld: warning: libhysig.so, needed by /export/cruise/trunk/cc/projects/classlib/trunk/deploy/jdk/jre/bin/libhyzlib.so, not found (try using -rpath or -rpath-link)
/usr/lib/gcc-lib/i586-suse-linux/3.3.3/../../../../i586-suse-linux/bin/ld: warning: libhysig.so, needed by /export/cruise/trunk/cc/projects/classlib/trunk/deploy/jdk/jre/bin/libhyzlib.so, not found (try using -rpath or -rpath-link)
Java Result: 1
Java Result: 1
Java Result: 130
Java Result: 1
Java Result: 1
Java Result: 130
Timeout: killed the sub-process
	at org.apache.tools.ant.taskdefs.Java.fork(Java.java:754)
	at org.apache.tools.ant.taskdefs.Java.executeJava(Java.java:171)
	at org.apache.tools.ant.taskdefs.Java.execute(Java.java:84)
	at org.apache.tools.ant.UnknownElement.execute(UnknownElement.java:275)
	at org.apache.tools.ant.Task.perform(Task.java:364)
	at org.apache.tools.ant.taskdefs.Sequential.execute(Sequential.java:64)
	at net.sf.antcontrib.logic.IfTask.execute(IfTask.java:197)
	at sun.reflect.GeneratedMethodAccessor150.invoke(Unknown Source)
	at sun.reflect.DelegatingMethodAccessorImpl.invoke(DelegatingMethodAccessorImpl.java:25)
	at java.lang.reflect.Method.invoke(Method.java:585)
	at org.apache.tools.ant.TaskAdapter.execute(TaskAdapter.java:123)
	at org.apache.tools.ant.UnknownElement.execute(UnknownElement.java:275)
	at org.apache.tools.ant.Task.perform(Task.java:364)
	at org.apache.tools.ant.taskdefs.Sequential.execute(Sequential.java:64)
	at org.apache.tools.ant.UnknownElement.execute(UnknownElement.java:275)
	at org.apache.tools.ant.Task.perform(Task.java:364)
	at org.apache.tools.ant.taskdefs.MacroInstance.execute(MacroInstance.java:378)
	at net.sf.antcontrib.logic.ForDelegate.doSequentialIteration(ForDelegate.java:228)
	at net.sf.antcontrib.logic.ForDelegate.doTheTasks(ForDelegate.java:281)
	at net.sf.antcontrib.logic.ForDelegate.execute(ForDelegate.java:213)
	at net.sf.antcontrib.logic.For.execute(For.java:166)
	at org.apache.tools.ant.UnknownElement.execute(UnknownElement.java:275)
	at org.apache.tools.ant.Task.perform(Task.java:364)
	at org.apache.tools.ant.Target.execute(Target.java:341)
	at org.apache.tools.ant.Target.performTasks(Target.java:369)
	at org.apache.tools.ant.Project.executeSortedTargets(Project.java:1216)
	at org.apache.tools.ant.helper.SingleCheckExecutor.executeTargets(SingleCheckExecutor.java:37)
	at org.apache.tools.ant.Project.executeTargets(Project.java:1068)
	at org.apache.tools.ant.taskdefs.Ant.execute(Ant.java:382)
	at org.apache.tools.ant.taskdefs.CallTarget.execute(CallTarget.java:107)
	at org.apache.tools.ant.UnknownElement.execute(UnknownElement.java:275)
	at org.apache.tools.ant.Task.perform(Task.java:364)
	at org.apache.tools.ant.taskdefs.Sequential.execute(Sequential.java:64)
	at org.apache.tools.ant.UnknownElement.execute(UnknownElement.java:275)
	at org.apache.tools.ant.Task.perform(Task.java:364)
	at org.apache.tools.ant.taskdefs.MacroInstance.execute(MacroInstance.java:378)
	at net.sf.antcontrib.logic.ForDelegate.doSequentialIteration(ForDelegate.java:228)
	at net.sf.antcontrib.logic.ForDelegate.doTheTasks(ForDelegate.java:253)
	at net.sf.antcontrib.logic.ForDelegate.execute(ForDelegate.java:213)
	at net.sf.antcontrib.logic.For.execute(For.java:166)
	at org.apache.tools.ant.UnknownElement.execute(UnknownElement.java:275)
	at org.apache.tools.ant.Task.perform(Task.java:364)
	at org.apache.tools.ant.Target.execute(Target.java:341)
	at org.apache.tools.ant.Target.performTasks(Target.java:369)
	at org.apache.tools.ant.Project.executeSortedTargets(Project.java:1216)
	at org.apache.tools.ant.Project.executeTarget(Project.java:1185)
	at net.sf.antcontrib.logic.AntFetch.execute(AntFetch.java:345)
	at org.apache.tools.ant.UnknownElement.execute(UnknownElement.java:275)
	at org.apache.tools.ant.Task.perform(Task.java:364)
	at org.apache.tools.ant.Target.execute(Target.java:341)
	at org.apache.tools.ant.Target.performTasks(Target.java:369)
	at org.apache.tools.ant.Project.executeSortedTargets(Project.java:1216)
	at org.apache.tools.ant.helper.SingleCheckExecutor.executeTargets(SingleCheckExecutor.java:37)
	at org.apache.tools.ant.Project.executeTargets(Project.java:1068)
	at org.apache.tools.ant.taskdefs.Ant.execute(Ant.java:382)
	at org.apache.tools.ant.UnknownElement.execute(UnknownElement.java:275)
	at org.apache.tools.ant.Task.perform(Task.java:364)
	at org.apache.tools.ant.Target.execute(Target.java:341)
	at org.apache.tools.ant.Target.performTasks(Target.java:369)
	at org.apache.tools.ant.Project.executeSortedTargets(Project.java:1216)
	at org.apache.tools.ant.helper.SingleCheckExecutor.executeTargets(SingleCheckExecutor.java:37)
	at org.apache.tools.ant.Project.executeTargets(Project.java:1068)
	at org.apache.tools.ant.taskdefs.Ant.execute(Ant.java:382)
	at org.apache.tools.ant.taskdefs.SubAnt.execute(SubAnt.java:277)
	at org.apache.tools.ant.taskdefs.SubAnt.execute(SubAnt.java:201)
	at org.apache.tools.ant.UnknownElement.execute(UnknownElement.java:275)
	at org.apache.tools.ant.Task.perform(Task.java:364)
	at org.apache.tools.ant.Target.execute(Target.java:341)
	at org.apache.tools.ant.Target.performTasks(Target.java:369)
	at org.apache.tools.ant.Project.executeSortedTargets(Project.java:1216)
	at org.apache.tools.ant.Project.executeTarget(Project.java:1185)
	at org.apache.tools.ant.helper.DefaultExecutor.executeTargets(DefaultExecutor.java:40)
	at org.apache.tools.ant.Project.executeTargets(Project.java:1068)
	at org.apache.tools.ant.Main.runBuild(Main.java:668)
	at org.apache.tools.ant.Main.startAnt(Main.java:187)
	at org.apache.tools.ant.launch.Launcher.run(Launcher.java:246)
	at org.apache.tools.ant.launch.Launcher.main(Launcher.java:67)
Java Result: 1
Java Result: 1
Java Result: 130
Timeout: killed the sub-process
	at org.apache.tools.ant.taskdefs.Java.fork(Java.java:754)
	at org.apache.tools.ant.taskdefs.Java.executeJava(Java.java:171)
	at org.apache.tools.ant.taskdefs.Java.execute(Java.java:84)
	at org.apache.tools.ant.UnknownElement.execute(UnknownElement.java:275)
	at org.apache.tools.ant.Task.perform(Task.java:364)
	at org.apache.tools.ant.taskdefs.Sequential.execute(Sequential.java:64)
	at net.sf.antcontrib.logic.IfTask.execute(IfTask.java:197)
	at sun.reflect.GeneratedMethodAccessor157.invoke(Unknown Source)
	at sun.reflect.DelegatingMethodAccessorImpl.invoke(DelegatingMethodAccessorImpl.java:25)
	at java.lang.reflect.Method.invoke(Method.java:585)
	at org.apache.tools.ant.TaskAdapter.execute(TaskAdapter.java:123)
	at org.apache.tools.ant.UnknownElement.execute(UnknownElement.java:275)
	at org.apache.tools.ant.Task.perform(Task.java:364)
	at org.apache.tools.ant.taskdefs.Sequential.execute(Sequential.java:64)
	at org.apache.tools.ant.UnknownElement.execute(UnknownElement.java:275)
	at org.apache.tools.ant.Task.perform(Task.java:364)
	at org.apache.tools.ant.taskdefs.MacroInstance.execute(MacroInstance.java:378)
	at net.sf.antcontrib.logic.ForDelegate.doSequentialIteration(ForDelegate.java:228)
	at net.sf.antcontrib.logic.ForDelegate.doTheTasks(ForDelegate.java:281)
	at net.sf.antcontrib.logic.ForDelegate.execute(ForDelegate.java:213)
	at net.sf.antcontrib.logic.For.execute(For.java:166)
	at org.apache.tools.ant.UnknownElement.execute(UnknownElement.java:275)
	at org.apache.tools.ant.Task.perform(Task.java:364)
	at org.apache.tools.ant.Target.execute(Target.java:341)
	at org.apache.tools.ant.Target.performTasks(Target.java:369)
	at org.apache.tools.ant.Project.executeSortedTargets(Project.java:1216)
	at org.apache.tools.ant.helper.SingleCheckExecutor.executeTargets(SingleCheckExecutor.java:37)
	at org.apache.tools.ant.Project.executeTargets(Project.java:1068)
	at org.apache.tools.ant.taskdefs.Ant.execute(Ant.java:382)
	at org.apache.tools.ant.taskdefs.CallTarget.execute(CallTarget.java:107)
	at org.apache.tools.ant.UnknownElement.execute(UnknownElement.java:275)
	at org.apache.tools.ant.Task.perform(Task.java:364)
	at org.apache.tools.ant.taskdefs.Sequential.execute(Sequential.java:64)
	at org.apache.tools.ant.UnknownElement.execute(UnknownElement.java:275)
	at org.apache.tools.ant.Task.perform(Task.java:364)
	at org.apache.tools.ant.taskdefs.MacroInstance.execute(MacroInstance.java:378)
	at net.sf.antcontrib.logic.ForDelegate.doSequentialIteration(ForDelegate.java:228)
	at net.sf.antcontrib.logic.ForDelegate.doTheTasks(ForDelegate.java:253)
	at net.sf.antcontrib.logic.ForDelegate.execute(ForDelegate.java:213)
	at net.sf.antcontrib.logic.For.execute(For.java:166)
	at org.apache.tools.ant.UnknownElement.execute(UnknownElement.java:275)
	at org.apache.tools.ant.Task.perform(Task.java:364)
	at org.apache.tools.ant.Target.execute(Target.java:341)
	at org.apache.tools.ant.Target.performTasks(Target.java:369)
	at org.apache.tools.ant.Project.executeSortedTargets(Project.java:1216)
	at org.apache.tools.ant.Project.executeTarget(Project.java:1185)
	at net.sf.antcontrib.logic.AntFetch.execute(AntFetch.java:345)
	at org.apache.tools.ant.UnknownElement.execute(UnknownElement.java:275)
	at org.apache.tools.ant.Task.perform(Task.java:364)
	at org.apache.tools.ant.Target.execute(Target.java:341)
	at org.apache.tools.ant.Target.performTasks(Target.java:369)
	at org.apache.tools.ant.Project.executeSortedTargets(Project.java:1216)
	at org.apache.tools.ant.helper.SingleCheckExecutor.executeTargets(SingleCheckExecutor.java:37)
	at org.apache.tools.ant.Project.executeTargets(Project.java:1068)
	at org.apache.tools.ant.taskdefs.Ant.execute(Ant.java:382)
	at org.apache.tools.ant.UnknownElement.execute(UnknownElement.java:275)
	at org.apache.tools.ant.Task.perform(Task.java:364)
	at org.apache.tools.ant.Target.execute(Target.java:341)
	at org.apache.tools.ant.Target.performTasks(Target.java:369)
	at org.apache.tools.ant.Project.executeSortedTargets(Project.java:1216)
	at org.apache.tools.ant.helper.SingleCheckExecutor.executeTargets(SingleCheckExecutor.java:37)
	at org.apache.tools.ant.Project.executeTargets(Project.java:1068)
	at org.apache.tools.ant.taskdefs.Ant.execute(Ant.java:382)
	at org.apache.tools.ant.taskdefs.SubAnt.execute(SubAnt.java:277)
	at org.apache.tools.ant.taskdefs.SubAnt.execute(SubAnt.java:201)
	at org.apache.tools.ant.UnknownElement.execute(UnknownElement.java:275)
	at org.apache.tools.ant.Task.perform(Task.java:364)
	at org.apache.tools.ant.Target.execute(Target.java:341)
	at org.apache.tools.ant.Target.performTasks(Target.java:369)
	at org.apache.tools.ant.Project.executeSortedTargets(Project.java:1216)
	at org.apache.tools.ant.Project.executeTarget(Project.java:1185)
	at org.apache.tools.ant.helper.DefaultExecutor.executeTargets(DefaultExecutor.java:40)
	at org.apache.tools.ant.Project.executeTargets(Project.java:1068)
	at org.apache.tools.ant.Main.runBuild(Main.java:668)
	at org.apache.tools.ant.Main.startAnt(Main.java:187)
	at org.apache.tools.ant.launch.Launcher.run(Launcher.java:246)
	at org.apache.tools.ant.launch.Launcher.main(Launcher.java:67)
Java Result: 1
Java Result: 1
Java Result: 130
Timeout: killed the sub-process
	at org.apache.tools.ant.taskdefs.Java.fork(Java.java:754)
	at org.apache.tools.ant.taskdefs.Java.executeJava(Java.java:171)
	at org.apache.tools.ant.taskdefs.Java.execute(Java.java:84)
	at org.apache.tools.ant.UnknownElement.execute(UnknownElement.java:275)
	at org.apache.tools.ant.Task.perform(Task.java:364)
	at org.apache.tools.ant.taskdefs.Sequential.execute(Sequential.java:64)
	at net.sf.antcontrib.logic.IfTask.execute(IfTask.java:197)
	at sun.reflect.GeneratedMethodAccessor157.invoke(Unknown Source)
	at sun.reflect.DelegatingMethodAccessorImpl.invoke(DelegatingMethodAccessorImpl.java:25)
	at java.lang.reflect.Method.invoke(Method.java:585)
	at org.apache.tools.ant.TaskAdapter.execute(TaskAdapter.java:123)
	at org.apache.tools.ant.UnknownElement.execute(UnknownElement.java:275)
	at org.apache.tools.ant.Task.perform(Task.java:364)
	at org.apache.tools.ant.taskdefs.Sequential.execute(Sequential.java:64)
	at org.apache.tools.ant.UnknownElement.execute(UnknownElement.java:275)
	at org.apache.tools.ant.Task.perform(Task.java:364)
	at org.apache.tools.ant.taskdefs.MacroInstance.execute(MacroInstance.java:378)
	at net.sf.antcontrib.logic.ForDelegate.doSequentialIteration(ForDelegate.java:228)
	at net.sf.antcontrib.logic.ForDelegate.doTheTasks(ForDelegate.java:281)
	at net.sf.antcontrib.logic.ForDelegate.execute(ForDelegate.java:213)
	at net.sf.antcontrib.logic.For.execute(For.java:166)
	at org.apache.tools.ant.UnknownElement.execute(UnknownElement.java:275)
	at org.apache.tools.ant.Task.perform(Task.java:364)
	at org.apache.tools.ant.Target.execute(Target.java:341)
	at org.apache.tools.ant.Target.performTasks(Target.java:369)
	at org.apache.tools.ant.Project.executeSortedTargets(Project.java:1216)
	at org.apache.tools.ant.helper.SingleCheckExecutor.executeTargets(SingleCheckExecutor.java:37)
	at org.apache.tools.ant.Project.executeTargets(Project.java:1068)
	at org.apache.tools.ant.taskdefs.Ant.execute(Ant.java:382)
	at org.apache.tools.ant.taskdefs.CallTarget.execute(CallTarget.java:107)
	at org.apache.tools.ant.UnknownElement.execute(UnknownElement.java:275)
	at org.apache.tools.ant.Task.perform(Task.java:364)
	at org.apache.tools.ant.taskdefs.Sequential.execute(Sequential.java:64)
	at org.apache.tools.ant.UnknownElement.execute(UnknownElement.java:275)
	at org.apache.tools.ant.Task.perform(Task.java:364)
	at org.apache.tools.ant.taskdefs.MacroInstance.execute(MacroInstance.java:378)
	at net.sf.antcontrib.logic.ForDelegate.doSequentialIteration(ForDelegate.java:228)
	at net.sf.antcontrib.logic.ForDelegate.doTheTasks(ForDelegate.java:253)
	at net.sf.antcontrib.logic.ForDelegate.execute(ForDelegate.java:213)
	at net.sf.antcontrib.logic.For.execute(For.java:166)
	at org.apache.tools.ant.UnknownElement.execute(UnknownElement.java:275)
	at org.apache.tools.ant.Task.perform(Task.java:364)
	at org.apache.tools.ant.Target.execute(Target.java:341)
	at org.apache.tools.ant.Target.performTasks(Target.java:369)
	at org.apache.tools.ant.Project.executeSortedTargets(Project.java:1216)
	at org.apache.tools.ant.Project.executeTarget(Project.java:1185)
	at net.sf.antcontrib.logic.AntFetch.execute(AntFetch.java:345)
	at org.apache.tools.ant.UnknownElement.execute(UnknownElement.java:275)
	at org.apache.tools.ant.Task.perform(Task.java:364)
	at org.apache.tools.ant.Target.execute(Target.java:341)
	at org.apache.tools.ant.Target.performTasks(Target.java:369)
	at org.apache.tools.ant.Project.executeSortedTargets(Project.java:1216)
	at org.apache.tools.ant.helper.SingleCheckExecutor.executeTargets(SingleCheckExecutor.java:37)
	at org.apache.tools.ant.Project.executeTargets(Project.java:1068)
	at org.apache.tools.ant.taskdefs.Ant.execute(Ant.java:382)
	at org.apache.tools.ant.UnknownElement.execute(UnknownElement.java:275)
	at org.apache.tools.ant.Task.perform(Task.java:364)
	at org.apache.tools.ant.Target.execute(Target.java:341)
	at org.apache.tools.ant.Target.performTasks(Target.java:369)
	at org.apache.tools.ant.Project.executeSortedTargets(Project.java:1216)
	at org.apache.tools.ant.helper.SingleCheckExecutor.executeTargets(SingleCheckExecutor.java:37)
	at org.apache.tools.ant.Project.executeTargets(Project.java:1068)
	at org.apache.tools.ant.taskdefs.Ant.execute(Ant.java:382)
	at org.apache.tools.ant.taskdefs.SubAnt.execute(SubAnt.java:277)
	at org.apache.tools.ant.taskdefs.SubAnt.execute(SubAnt.java:201)
	at org.apache.tools.ant.UnknownElement.execute(UnknownElement.java:275)
	at org.apache.tools.ant.Task.perform(Task.java:364)
	at org.apache.tools.ant.Target.execute(Target.java:341)
	at org.apache.tools.ant.Target.performTasks(Target.java:369)
	at org.apache.tools.ant.Project.executeSortedTargets(Project.java:1216)
	at org.apache.tools.ant.Project.executeTarget(Project.java:1185)
	at org.apache.tools.ant.helper.DefaultExecutor.executeTargets(DefaultExecutor.java:40)
	at org.apache.tools.ant.Project.executeTargets(Project.java:1068)
	at org.apache.tools.ant.Main.runBuild(Main.java:668)
	at org.apache.tools.ant.Main.startAnt(Main.java:187)
	at org.apache.tools.ant.launch.Launcher.run(Launcher.java:246)
	at org.apache.tools.ant.launch.Launcher.main(Launcher.java:67)
Java Result: 1
Java Result: 1
Java Result: 130
Timeout: killed the sub-process
	at org.apache.tools.ant.taskdefs.Java.fork(Java.java:754)
	at org.apache.tools.ant.taskdefs.Java.executeJava(Java.java:171)
	at org.apache.tools.ant.taskdefs.Java.execute(Java.java:84)
	at org.apache.tools.ant.UnknownElement.execute(UnknownElement.java:275)
	at org.apache.tools.ant.Task.perform(Task.java:364)
	at org.apache.tools.ant.taskdefs.Sequential.execute(Sequential.java:64)
	at net.sf.antcontrib.logic.IfTask.execute(IfTask.java:197)
	at sun.reflect.GeneratedMethodAccessor157.invoke(Unknown Source)
	at sun.reflect.DelegatingMethodAccessorImpl.invoke(DelegatingMethodAccessorImpl.java:25)
	at java.lang.reflect.Method.invoke(Method.java:585)
	at org.apache.tools.ant.TaskAdapter.execute(TaskAdapter.java:123)
	at org.apache.tools.ant.UnknownElement.execute(UnknownElement.java:275)
	at org.apache.tools.ant.Task.perform(Task.java:364)
	at org.apache.tools.ant.taskdefs.Sequential.execute(Sequential.java:64)
	at org.apache.tools.ant.UnknownElement.execute(UnknownElement.java:275)
	at org.apache.tools.ant.Task.perform(Task.java:364)
	at org.apache.tools.ant.taskdefs.MacroInstance.execute(MacroInstance.java:378)
	at net.sf.antcontrib.logic.ForDelegate.doSequentialIteration(ForDelegate.java:228)
	at net.sf.antcontrib.logic.ForDelegate.doTheTasks(ForDelegate.java:281)
	at net.sf.antcontrib.logic.ForDelegate.execute(ForDelegate.java:213)
	at net.sf.antcontrib.logic.For.execute(For.java:166)
	at org.apache.tools.ant.UnknownElement.execute(UnknownElement.java:275)
	at org.apache.tools.ant.Task.perform(Task.java:364)
	at org.apache.tools.ant.Target.execute(Target.java:341)
	at org.apache.tools.ant.Target.performTasks(Target.java:369)
	at org.apache.tools.ant.Project.executeSortedTargets(Project.java:1216)
	at org.apache.tools.ant.helper.SingleCheckExecutor.executeTargets(SingleCheckExecutor.java:37)
	at org.apache.tools.ant.Project.executeTargets(Project.java:1068)
	at org.apache.tools.ant.taskdefs.Ant.execute(Ant.java:382)
	at org.apache.tools.ant.taskdefs.CallTarget.execute(CallTarget.java:107)
	at org.apache.tools.ant.UnknownElement.execute(UnknownElement.java:275)
	at org.apache.tools.ant.Task.perform(Task.java:364)
	at org.apache.tools.ant.taskdefs.Sequential.execute(Sequential.java:64)
	at org.apache.tools.ant.UnknownElement.execute(UnknownElement.java:275)
	at org.apache.tools.ant.Task.perform(Task.java:364)
	at org.apache.tools.ant.taskdefs.MacroInstance.execute(MacroInstance.java:378)
	at net.sf.antcontrib.logic.ForDelegate.doSequentialIteration(ForDelegate.java:228)
	at net.sf.antcontrib.logic.ForDelegate.doTheTasks(ForDelegate.java:253)
	at net.sf.antcontrib.logic.ForDelegate.execute(ForDelegate.java:213)
	at net.sf.antcontrib.logic.For.execute(For.java:166)
	at org.apache.tools.ant.UnknownElement.execute(UnknownElement.java:275)
	at org.apache.tools.ant.Task.perform(Task.java:364)
	at org.apache.tools.ant.Target.execute(Target.java:341)
	at org.apache.tools.ant.Target.performTasks(Target.java:369)
	at org.apache.tools.ant.Project.executeSortedTargets(Project.java:1216)
	at org.apache.tools.ant.Project.executeTarget(Project.java:1185)
	at net.sf.antcontrib.logic.AntFetch.execute(AntFetch.java:345)
	at org.apache.tools.ant.UnknownElement.execute(UnknownElement.java:275)
	at org.apache.tools.ant.Task.perform(Task.java:364)
	at org.apache.tools.ant.Target.execute(Target.java:341)
	at org.apache.tools.ant.Target.performTasks(Target.java:369)
	at org.apache.tools.ant.Project.executeSortedTargets(Project.java:1216)
	at org.apache.tools.ant.helper.SingleCheckExecutor.executeTargets(SingleCheckExecutor.java:37)
	at org.apache.tools.ant.Project.executeTargets(Project.java:1068)
	at org.apache.tools.ant.taskdefs.Ant.execute(Ant.java:382)
	at org.apache.tools.ant.UnknownElement.execute(UnknownElement.java:275)
	at org.apache.tools.ant.Task.perform(Task.java:364)
	at org.apache.tools.ant.Target.execute(Target.java:341)
	at org.apache.tools.ant.Target.performTasks(Target.java:369)
	at org.apache.tools.ant.Project.executeSortedTargets(Project.java:1216)
	at org.apache.tools.ant.helper.SingleCheckExecutor.executeTargets(SingleCheckExecutor.java:37)
	at org.apache.tools.ant.Project.executeTargets(Project.java:1068)
	at org.apache.tools.ant.taskdefs.Ant.execute(Ant.java:382)
	at org.apache.tools.ant.taskdefs.SubAnt.execute(SubAnt.java:277)
	at org.apache.tools.ant.taskdefs.SubAnt.execute(SubAnt.java:201)
	at org.apache.tools.ant.UnknownElement.execute(UnknownElement.java:275)
	at org.apache.tools.ant.Task.perform(Task.java:364)
	at org.apache.tools.ant.Target.execute(Target.java:341)
	at org.apache.tools.ant.Target.performTasks(Target.java:369)
	at org.apache.tools.ant.Project.executeSortedTargets(Project.java:1216)
	at org.apache.tools.ant.Project.executeTarget(Project.java:1185)
	at org.apache.tools.ant.helper.DefaultExecutor.executeTargets(DefaultExecutor.java:40)
	at org.apache.tools.ant.Project.executeTargets(Project.java:1068)
	at org.apache.tools.ant.Main.runBuild(Main.java:668)
	at org.apache.tools.ant.Main.startAnt(Main.java:187)
	at org.apache.tools.ant.launch.Launcher.run(Launcher.java:246)
	at org.apache.tools.ant.launch.Launcher.main(Launcher.java:67)
Tests FAILED
 Using CLASSLIB = /export/cruise/trunk/cc/projects/classlib/trunk
jars: true
using proxy settings: proxy.ims.intel.com port:911
Configuration:
     Hosting Java = 1.5.0_08 (Sun Microsystems Inc.)
    classlib root = /export/cruise/trunk/cc/projects/classlib/trunk
               os = Linux
             arch = ia32
              cxx = gcc
              cfg = debug
     svn revision = 565265
       components = deploy
## Compiling JVMTI natives in: /export/cruise/trunk/cc/projects/drlvm/trunk/vm/tests/jvmti/Breakpoint1
## Compiling JVMTI natives in: /export/cruise/trunk/cc/projects/drlvm/trunk/vm/tests/jvmti/PopFrame1
## Compiling JVMTI natives in: /export/cruise/trunk/cc/projects/drlvm/trunk/vm/tests/jvmti/SingleStep1
## Compiling JVMTI natives in: /export/cruise/trunk/cc/projects/drlvm/trunk/vm/tests/jvmti/VMInit1

        ==================================
        Run JVMTI tests using interpreter
        ==================================
        
Running Breakpoint1
Running PopFrame1
Running SingleStep1
Running VMInit1

        ==================================
        Run JVMTI tests using Client mode JIT (default)
        ==================================
        
Running Breakpoint1
Running PopFrame1
Running SingleStep1
Running VMInit1

        ==================================
        Run JVMTI tests using jitrino.JET
        ==================================
        
Running Breakpoint1
Running PopFrame1
Running SingleStep1
Running VMInit1

        ==================================
        Run JVMTI tests using jitrino.OPT
        ==================================
        

Using exclude file = /export/cruise/trunk/cc/projects/drlvm/trunk/build/make/excludes/exclude.drlvm_jvmti.linux.x86.opt   
        
Breakpoint1/Breakpoint1.java
SingleStep1/SingleStep1.java
VMInit1/VMInit1.java
PopFrame1/PopFrame1.java

                  
Running Breakpoint1
Running PopFrame1
Running SingleStep1
Running VMInit1

        ==================================
        Run JVMTI tests using Server mode JIT
        ==================================
        

Using exclude file = /export/cruise/trunk/cc/projects/drlvm/trunk/build/make/excludes/exclude.drlvm_jvmti.linux.x86.srv   
        
Breakpoint1/Breakpoint1.java
SingleStep1/SingleStep1.java
VMInit1/VMInit1.java
PopFrame1/PopFrame1.java

                  
Running Breakpoint1
Running PopFrame1
Running SingleStep1
Running VMInit1
## Compiling framework...
## Compiling C unit tests
## Linking C unit test: test_java_attrs
## Linking C unit test: test_java_basic
## Linking C unit test: test_java_identify
## Linking C unit test: test_java_interrupt
## Linking C unit test: test_java_monitors
## Linking C unit test: test_java_park
## Linking C unit test: test_java_ptr_conv
## Linking C unit test: test_java_suspend
## Linking C unit test: test_native_basic
## Linking C unit test: test_native_fat_monitor
## Linking C unit test: test_native_suspend
## Linking C unit test: test_native_thin_monitor
## Linking C unit test: test_ti_instrum
## Linking C unit test: test_ti_local_storage
## Linking C unit test: test_ti_monitor_info
## Linking C unit test: test_ti_peak_count
## Linking C unit test: test_ti_raw_monitors
## Linking C unit test: test_ti_state
## Linking C unit test: test_ti_timing
## Executing C unit test: test_java_attrs
INFO: TEST test_jthread_get_priority start
INFO: TEST test_jthread_get_priority: PASSED
INFO: TEST test_jthread_set_priority start
INFO: TEST test_jthread_set_priority: PASSED
## TEST PASSED
## Executing C unit test: test_java_basic
INFO: TEST test_jthread_attach start
INFO: TEST test_jthread_attach: PASSED
INFO: TEST test_jthread_detach start
INFO: TEST test_jthread_detach: PASSED
INFO: TEST test_hythread_create start
INFO: TEST test_hythread_create: PASSED
INFO: TEST test_hythread_create_with_function start
INFO: TEST test_hythread_create_with_function: PASSED
INFO: TEST test_jthread_get_JNI_env start
INFO: TEST test_jthread_get_JNI_env: PASSED
INFO: TEST test_jthread_join start
INFO: TEST test_jthread_join: PASSED
INFO: TEST test_jthread_timed_join start
-------- status = 00011177 (70007) 100
-------- status = 00000000 (0) 100
-------- status = 00000000 (0) 100
-------- status = 00000000 (0) 100
-------- status = 00000000 (0) 50000
-------- status = 00000000 (0) 50000
-------- status = 00000000 (0) 50000
-------- status = 00000000 (0) 50000
INFO: TEST test_jthread_timed_join: PASSED
INFO: TEST test_jthread_exception_stop start
INFO: TEST test_jthread_exception_stop: PASSED
INFO: TEST test_jthread_stop start
INFO: TEST test_jthread_stop: PASSED
INFO: TEST test_jthread_sleep start
INFO: TEST test_jthread_sleep: PASSED
INFO: TEST test_hythread_yield start
INFO: TEST test_hythread_yield: PASSED
## TEST PASSED
## Executing C unit test: test_java_identify
INFO: TEST test_jthread_self start
INFO: TEST test_jthread_self: PASSED
INFO: TEST test_jthread_get_id start
INFO: TEST test_jthread_get_id: PASSED
INFO: TEST test_jthread_get_thread start
INFO: TEST test_jthread_get_thread: PASSED
## TEST PASSED
## Executing C unit test: test_java_interrupt
INFO: TEST test_jthread_interrupt start
INFO: TEST test_jthread_interrupt: PASSED
INFO: TEST test_jthread_is_interrupted start
INFO: TEST test_jthread_is_interrupted: PASSED
INFO: TEST test_jthread_clear_interrupted start
INFO: TEST test_jthread_clear_interrupted: PASSED
## TEST PASSED
## Executing C unit test: test_java_monitors
INFO: TEST test_jthread_monitor_init start
INFO: TEST test_jthread_monitor_init: PASSED
INFO: TEST test_jthread_monitor_enter start
INFO: TEST test_jthread_monitor_enter: PASSED
INFO: TEST test_jthread_monitor_try_enter start
INFO: TEST test_jthread_monitor_try_enter: PASSED
INFO: TEST test_jthread_monitor_exit start
INFO: TEST test_jthread_monitor_exit: PASSED
INFO: TEST test_jthread_monitor_notify_all start
INFO: TEST test_jthread_monitor_notify_all: PASSED
INFO: TEST test_jthread_monitor_wait start
INFO: TEST test_jthread_monitor_wait: PASSED
INFO: TEST test_jthread_monitor_timed_wait start
INFO: TEST test_jthread_monitor_timed_wait: PASSED
INFO: TEST test_jthread_monitor_timed_wait_timeout start
INFO: TEST test_jthread_monitor_timed_wait_timeout: PASSED
## TEST PASSED
## Executing C unit test: test_java_park
INFO: TEST test_jthread_park_unpark start
INFO: TEST test_jthread_park_unpark: PASSED
INFO: TEST test_jthread_park_interrupt start
INFO: TEST test_jthread_park_interrupt: PASSED
INFO: TEST test_jthread_timed_park start
INFO: TEST test_jthread_timed_park: PASSED
## TEST PASSED
## Executing C unit test: test_java_ptr_conv
INFO: TEST test_jthread_get_java_thread start
INFO: TEST test_jthread_get_java_thread: PASSED
INFO: TEST test_jthread_get_native_thread start
INFO: TEST test_jthread_get_native_thread: PASSED
## TEST PASSED
## Executing C unit test: test_java_suspend
INFO: TEST test_jthread_suspend_resume start
INFO: TEST test_jthread_suspend_resume: PASSED
INFO: TEST test_jthread_suspend_all_resume_all start
INFO: TEST test_jthread_suspend_all_resume_all: PASSED
## TEST PASSED
## Executing C unit test: test_native_basic
INFO: TEST test_hythread_self_base start
INFO: TEST test_hythread_self_base: PASSED
INFO: TEST test_hythread_create start
INFO: TEST test_hythread_create: PASSED
INFO: TEST test_hythread_create_many start
INFO: TEST test_hythread_create_many: PASSED
INFO: TEST test_hythread_iterator start
iterator size: 100
INFO: TEST test_hythread_iterator: PASSED
INFO: TEST test_hythread_iterator_default start
default group iterator: 105
INFO: TEST test_hythread_iterator_default: PASSED
## TEST PASSED
## Executing C unit test: test_native_fat_monitor
INFO: TEST test_wait_signal start
INFO: TEST test_wait_signal: PASSED
## TEST PASSED
## Executing C unit test: test_native_suspend
INFO: TEST test_hythread_thread_suspend start
INFO: TEST test_hythread_thread_suspend: PASSED
INFO: TEST test_hythread_thread_suspend_all start
INFO: TEST test_hythread_thread_suspend_all: PASSED
## TEST PASSED
## Executing C unit test: test_native_thin_monitor
INFO: TEST test_hythread_thin_monitor_enter start
INFO: TEST test_hythread_thin_monitor_enter: PASSED
INFO: TEST test_hythread_thin_monitor_try_enter start
INFO: TEST test_hythread_thin_monitor_try_enter: PASSED
INFO: TEST test_hythread_thin_monitor_wait_timed_illegal start
INFO: TEST test_hythread_thin_monitor_wait_timed_illegal: PASSED
INFO: TEST test_hythread_thin_monitor_wait_timed start
INFO: TEST test_hythread_thin_monitor_wait_timed: PASSED
INFO: TEST test_hythread_thin_monitor_fat_unlock start
status: 70007
INFO: TEST test_hythread_thin_monitor_fat_unlock: PASSED
INFO: TEST test_hythread_thin_monitor_enter_contended start
INFO: TEST test_hythread_thin_monitor_enter_contended: PASSED
## TEST PASSED
## Executing C unit test: test_ti_instrum
INFO: TEST test_jthread_get_all_threads start
INFO: TEST test_jthread_get_all_threads: PASSED
INFO: TEST test_jthread_get_thread_count start
INFO: TEST test_jthread_get_thread_count: PASSED
INFO: TEST test_jthread_get_blocked_count start
INFO: TEST test_jthread_get_blocked_count: PASSED
## TEST PASSED
## Executing C unit test: test_ti_local_storage
INFO: TEST test_jthread_set_and_get_local_storage start
INFO: TEST test_jthread_set_and_get_local_storage: PASSED
## TEST PASSED
## Executing C unit test: test_ti_monitor_info
INFO: TEST test_jthread_get_contended_monitor start
INFO: TEST test_jthread_get_contended_monitor: PASSED
INFO: TEST test_jthread_holds_lock start
INFO: TEST test_jthread_holds_lock: PASSED
INFO: TEST test_jthread_get_lock_owner start
INFO: TEST test_jthread_get_lock_owner: PASSED
INFO: TEST test_jthread_get_owned_monitors start
INFO: TEST test_jthread_get_owned_monitors: PASSED
## TEST PASSED
## Executing C unit test: test_ti_peak_count
## TEST PASSED
## Executing C unit test: test_ti_raw_monitors
INFO: TEST test_jthread_raw_monitor_create start
INFO: TEST test_jthread_raw_monitor_create: PASSED
INFO: TEST test_jthread_raw_monitor_destroy start
INFO: TEST test_jthread_raw_monitor_destroy: PASSED
INFO: TEST test_jthread_raw_monitor_enter start
INFO: TEST test_jthread_raw_monitor_enter: PASSED
INFO: TEST test_jthread_raw_monitor_try_enter start
INFO: TEST test_jthread_raw_monitor_try_enter: PASSED
INFO: TEST test_jthread_raw_monitor_exit start
INFO: TEST test_jthread_raw_monitor_exit: PASSED
## TEST PASSED
## Executing C unit test: test_ti_state
INFO: TEST test_jthread_get_jvmti_state_6 start
state = 00000002 (00000002)
state = 00000002 (00000002)
state = 00000002 (00000002)
state = 00000002 (00000002)
state = 00000002 (00000002)
INFO: TEST test_jthread_get_jvmti_state_6: PASSED
## TEST PASSED
## Executing C unit test: test_ti_timing
## TEST PASSED
## Please find tests and results at /export/cruise/trunk/cc/projects/drlvm/trunk/build/lnx_ia32_gcc_debug/semis/vm/_cunit.tests/
Note: /export/cruise/trunk/cc/projects/drlvm/trunk/vm/tests/smoke/gc/RunFinalizersOnExitTest.java uses or overrides a deprecated API.
Note: Recompile with -Xlint:deprecation for details.
Note: Some input files use unchecked or unsafe operations.
Note: Recompile with -Xlint:unchecked for details.
Compiling /export/cruise/trunk/cc/projects/drlvm/trunk/build/lnx_ia32_gcc_debug/semis/vm/_smoke.tests/natives/shutdown/TestDaemonOnWait
Compiling /export/cruise/trunk/cc/projects/drlvm/trunk/build/lnx_ia32_gcc_debug/semis/vm/_smoke.tests/natives/shutdown/TestFatalError
Compiling /export/cruise/trunk/cc/projects/drlvm/trunk/build/lnx_ia32_gcc_debug/semis/vm/_smoke.tests/natives/shutdown/TestInterrupt

        ==================================
        Smoke tests on interpreter
        ==================================
        

Using exclude file = /export/cruise/trunk/cc/projects/drlvm/trunk/build/make/excludes/exclude.drlvm_smoke.linux.x86.int   
        
Check.java
PerfCheck.java

# slow
gc/Mark.java

# HARMONY-2977
io/Integers.java

# fails on ubuntu 6

stress/Threads.java

# HARMONY-3917
gc/PhantomReferenceTest.java
gc/WeakReferenceTest.java

# HARMONY-3639
thread/ManyThreadsTest.java

# This stress test is very slow on interpreter
stress/Intern.java

                  
Running test : Hi
 PASSED : Hi
Running test : StackTest
 PASSED : StackTest
Running test : classloader.ClassTestGetDeclaringClass
 PASSED : classloader.ClassTestGetDeclaringClass
Running test : classloader.ExceptionInInitializerTest
 PASSED : classloader.ExceptionInInitializerTest
Running test : classloader.LogLoader
 PASSED : classloader.LogLoader
Running test : classloader.NotFound
 PASSED : classloader.NotFound
Running test : classloader.StressLoader
 PASSED : classloader.StressLoader
Running test : exception.ExceptionStackTest
 PASSED : exception.ExceptionStackTest
Running test : exception.FinalizeStackTest
 PASSED : exception.FinalizeStackTest
Running test : exception.NPE
 PASSED : exception.NPE
Running test : gc.FinAlloc
 PASSED : gc.FinAlloc
Running test : gc.Finalizer
 PASSED : gc.Finalizer
Running test : gc.Force
 PASSED : gc.Force
Running test : gc.Fragment
 PASSED : gc.Fragment
Running test : gc.Free
 PASSED : gc.Free
Running test : gc.LOS
 PASSED : gc.LOS
Running test : gc.List
 PASSED : gc.List
Running test : gc.MultiThreads
 PASSED : gc.MultiThreads
Running test : gc.NPE
 PASSED : gc.NPE
Running test : gc.PhantomReferenceQueueTest
 PASSED : gc.PhantomReferenceQueueTest
Running test : gc.RefRemove
 PASSED : gc.RefRemove
Running test : gc.RunFinalizersOnExitTest
 PASSED : gc.RunFinalizersOnExitTest
Running test : gc.StressRef
 PASSED : gc.StressRef
Running test : gc.SynchronizedFinalizersTest
 PASSED : gc.SynchronizedFinalizersTest
Running test : gc.ThreadSuspension
 PASSED : gc.ThreadSuspension
Running test : init.ErrorInInitializer
 PASSED : init.ErrorInInitializer
Running test : init.Other
 PASSED : init.Other
Running test : io.ArrayList
 PASSED : io.ArrayList
Running test : jni.LoadLibrary
 PASSED : jni.LoadLibrary
Running test : outofmemory.Double
 PASSED : outofmemory.Double
Running test : outofmemory.Int
 PASSED : outofmemory.Int
Running test : outofmemory.Plain
 PASSED : outofmemory.Plain
Running test : outofmemory.Ref
 PASSED : outofmemory.Ref
Running test : outofmemory.Throw
 PASSED : outofmemory.Throw
Running test : outofmemory.Vector
 PASSED : outofmemory.Vector
Running test : outofmemory.VectorDouble
 PASSED : outofmemory.VectorDouble
Running test : outofmemory.VectorInt
 PASSED : outofmemory.VectorInt
Running test : outofmemory.VectorRef
 PASSED : outofmemory.VectorRef
Running test : perf.CreateManyExceptions
 PASSED : perf.CreateManyExceptions
Running test : perf.CreateManyExceptions_depth
 PASSED : perf.CreateManyExceptions_depth
Running test : perf.MultiThreadsSimple
 PASSED : perf.MultiThreadsSimple
Running test : perf.SeveralThreads
 PASSED : perf.SeveralThreads
Running test : perf.StressCornerSize
 PASSED : perf.StressCornerSize
Running test : perf.StressCornerSize_a
 PASSED : perf.StressCornerSize_a
Running test : perf.ThrowMany
 PASSED : perf.ThrowMany
Running test : perf.ThrowManyExceptions
 PASSED : perf.ThrowManyExceptions
Running test : perf.ThrowManyExceptions_depth
 PASSED : perf.ThrowManyExceptions_depth
Running test : perf.ThrowMany_depth
 PASSED : perf.ThrowMany_depth
Running test : reflect.GetMethod
 PASSED : reflect.GetMethod
Running test : shutdown.TestDaemonOnWait
 PASSED : shutdown.TestDaemonOnWait
Running test : shutdown.TestFatalError
 PASSED : shutdown.TestFatalError
Running test : shutdown.TestInterrupt
 PASSED : shutdown.TestInterrupt
Running test : shutdown.TestLock
 PASSED : shutdown.TestLock
Running test : stress.BigStringBuffer
 PASSED : stress.BigStringBuffer
Running test : stress.Finalizer
 PASSED : stress.Finalizer
Running test : stress.Mix
 PASSED : stress.Mix
Running test : stress.Stack
 PASSED : stress.Stack
Running test : stress.Sync
 PASSED : stress.Sync
Running test : stress.Vector
 PASSED : stress.Vector
Running test : stress.WeakHashmapTest
 PASSED : stress.WeakHashmapTest
Running test : thread.ExitShutdownHook
 PASSED : thread.ExitShutdownHook
Running test : thread.InfiniteFinalizer
 PASSED : thread.InfiniteFinalizer
Running test : thread.InterruptWait
 PASSED : thread.InterruptWait
Running test : thread.Sleep
 PASSED : thread.Sleep
Running test : thread.SmallStackThreadTest
 PASSED : thread.SmallStackThreadTest
Running test : thread.ThreadInterrupt
 PASSED : thread.ThreadInterrupt
Running test : thread.ThreadOOM
 PASSED : thread.ThreadOOM
Running test : util.Date
 PASSED : util.Date
Running test : util.DoPriveleged
 PASSED : util.DoPriveleged
Running test : util.Prop
 PASSED : util.Prop
Running test : util.StringIntern
 PASSED : util.StringIntern
Please find test classes and results at /export/cruise/trunk/cc/projects/drlvm/trunk/build/lnx_ia32_gcc_debug/semis/vm/_smoke.tests/

        ==================================
        Smoke tests on Client mode JIT (default)
        ==================================
        

Using exclude file = /export/cruise/trunk/cc/projects/drlvm/trunk/build/make/excludes/exclude.drlvm_smoke.linux.x86.jit   
        
Check.java
PerfCheck.java

# breaks on ubuntu 6 w/ OOME
stress/Threads.java

# HARMONY-3495 hangs intermittently
gc/NPE.java

# HARMONY-3010 HARMONY-4292
stress/Stack.java

# HARMONY-3917
gc/PhantomReferenceTest.java
gc/WeakReferenceTest.java

# HARMONY-3639
thread/ManyThreadsTest.java

                  
Running test : Hi
 PASSED : Hi
Running test : StackTest
 PASSED : StackTest
Running test : classloader.ClassTestGetDeclaringClass
 PASSED : classloader.ClassTestGetDeclaringClass
Running test : classloader.ExceptionInInitializerTest
 PASSED : classloader.ExceptionInInitializerTest
Running test : classloader.LogLoader
 PASSED : classloader.LogLoader
Running test : classloader.NotFound
 PASSED : classloader.NotFound
Running test : classloader.StressLoader
 PASSED : classloader.StressLoader
Running test : exception.ExceptionStackTest
 PASSED : exception.ExceptionStackTest
Running test : exception.FinalizeStackTest
 PASSED : exception.FinalizeStackTest
Running test : exception.NPE
 PASSED : exception.NPE
Running test : gc.FinAlloc
 PASSED : gc.FinAlloc
Running test : gc.Finalizer
 PASSED : gc.Finalizer
Running test : gc.Force
 PASSED : gc.Force
Running test : gc.Fragment
 PASSED : gc.Fragment
Running test : gc.Free
 PASSED : gc.Free
Running test : gc.LOS
 PASSED : gc.LOS
Running test : gc.List
 PASSED : gc.List
Running test : gc.Mark
 PASSED : gc.Mark
Running test : gc.MultiThreads
 PASSED : gc.MultiThreads
Running test : gc.PhantomReferenceQueueTest
 PASSED : gc.PhantomReferenceQueueTest
Running test : gc.RefRemove
 PASSED : gc.RefRemove
Running test : gc.RunFinalizersOnExitTest
 PASSED : gc.RunFinalizersOnExitTest
Running test : gc.StressRef
 PASSED : gc.StressRef
Running test : gc.SynchronizedFinalizersTest
 PASSED : gc.SynchronizedFinalizersTest
Running test : gc.ThreadSuspension
 PASSED : gc.ThreadSuspension
Running test : init.ErrorInInitializer
 PASSED : init.ErrorInInitializer
Running test : init.Other
 PASSED : init.Other
Running test : io.ArrayList
 PASSED : io.ArrayList
Running test : io.Integers
 PASSED : io.Integers
Running test : jni.LoadLibrary
 PASSED : jni.LoadLibrary
Running test : outofmemory.Double
 PASSED : outofmemory.Double
Running test : outofmemory.Int
 PASSED : outofmemory.Int
Running test : outofmemory.Plain
 PASSED : outofmemory.Plain
Running test : outofmemory.Ref
 PASSED : outofmemory.Ref
Running test : outofmemory.Throw
 PASSED : outofmemory.Throw
Running test : outofmemory.Vector
 PASSED : outofmemory.Vector
Running test : outofmemory.VectorDouble
 PASSED : outofmemory.VectorDouble
Running test : outofmemory.VectorInt
 PASSED : outofmemory.VectorInt
Running test : outofmemory.VectorRef
 PASSED : outofmemory.VectorRef
Running test : perf.CreateManyExceptions
 PASSED : perf.CreateManyExceptions
Running test : perf.CreateManyExceptions_depth
 PASSED : perf.CreateManyExceptions_depth
Running test : perf.MultiThreadsSimple
 PASSED : perf.MultiThreadsSimple
Running test : perf.SeveralThreads
 PASSED : perf.SeveralThreads
Running test : perf.StressCornerSize
 PASSED : perf.StressCornerSize
Running test : perf.StressCornerSize_a
 PASSED : perf.StressCornerSize_a
Running test : perf.ThrowMany
 PASSED : perf.ThrowMany
Running test : perf.ThrowManyExceptions
 PASSED : perf.ThrowManyExceptions
Running test : perf.ThrowManyExceptions_depth
 PASSED : perf.ThrowManyExceptions_depth
Running test : perf.ThrowMany_depth
 PASSED : perf.ThrowMany_depth
Running test : reflect.GetMethod
 PASSED : reflect.GetMethod
Running test : shutdown.TestDaemonOnWait
 PASSED : shutdown.TestDaemonOnWait
Running test : shutdown.TestFatalError
 PASSED : shutdown.TestFatalError
Running test : shutdown.TestInterrupt
 PASSED : shutdown.TestInterrupt
Running test : shutdown.TestLock
 PASSED : shutdown.TestLock
Running test : stress.BigStringBuffer
 PASSED : stress.BigStringBuffer
Running test : stress.Finalizer
 PASSED : stress.Finalizer
Running test : stress.Intern
 PASSED : stress.Intern
Running test : stress.Mix
 PASSED : stress.Mix
Running test : stress.Sync
 PASSED : stress.Sync
Running test : stress.Vector
 PASSED : stress.Vector
Running test : stress.WeakHashmapTest
 PASSED : stress.WeakHashmapTest
Running test : thread.ExitShutdownHook
 PASSED : thread.ExitShutdownHook
Running test : thread.InfiniteFinalizer
 PASSED : thread.InfiniteFinalizer
Running test : thread.InterruptWait
 PASSED : thread.InterruptWait
Running test : thread.Sleep
 PASSED : thread.Sleep
Running test : thread.SmallStackThreadTest
 PASSED : thread.SmallStackThreadTest
Running test : thread.ThreadInterrupt
 PASSED : thread.ThreadInterrupt
Running test : thread.ThreadOOM
 PASSED : thread.ThreadOOM
Running test : util.Date
 PASSED : util.Date
Running test : util.DoPriveleged
 PASSED : util.DoPriveleged
Running test : util.Prop
 PASSED : util.Prop
Running test : util.StringIntern
 PASSED : util.StringIntern
Please find test classes and results at /export/cruise/trunk/cc/projects/drlvm/trunk/build/lnx_ia32_gcc_debug/semis/vm/_smoke.tests/

        ==================================
        Smoke tests on jitrino.JET
        ==================================
        

Using exclude file = /export/cruise/trunk/cc/projects/drlvm/trunk/build/make/excludes/exclude.drlvm_smoke.linux.x86.jet   
        
Check.java
PerfCheck.java

# breaks on ubuntu 6 w/ OOME
stress/Threads.java

# HARMONY-3495 hangs intermittently
gc/NPE.java

# HARMONY-3010 HARMONY-4292
stress/Stack.java

# HARMONY-3917
gc/PhantomReferenceTest.java
gc/WeakReferenceTest.java

# HARMONY-3639
thread/ManyThreadsTest.java

                  
Running test : Hi
 PASSED : Hi
Running test : StackTest
 PASSED : StackTest
Running test : classloader.ClassTestGetDeclaringClass
 PASSED : classloader.ClassTestGetDeclaringClass
Running test : classloader.ExceptionInInitializerTest
 PASSED : classloader.ExceptionInInitializerTest
Running test : classloader.LogLoader
 PASSED : classloader.LogLoader
Running test : classloader.NotFound
 PASSED : classloader.NotFound
Running test : classloader.StressLoader
 PASSED : classloader.StressLoader
Running test : exception.ExceptionStackTest
 PASSED : exception.ExceptionStackTest
Running test : exception.FinalizeStackTest
 PASSED : exception.FinalizeStackTest
Running test : exception.NPE
 PASSED : exception.NPE
Running test : gc.FinAlloc
 PASSED : gc.FinAlloc
Running test : gc.Finalizer
 PASSED : gc.Finalizer
Running test : gc.Force
 PASSED : gc.Force
Running test : gc.Fragment
 PASSED : gc.Fragment
Running test : gc.Free
 PASSED : gc.Free
Running test : gc.LOS
 PASSED : gc.LOS
Running test : gc.List
 PASSED : gc.List
Running test : gc.Mark
 PASSED : gc.Mark
Running test : gc.MultiThreads
 PASSED : gc.MultiThreads
Running test : gc.PhantomReferenceQueueTest
 PASSED : gc.PhantomReferenceQueueTest
Running test : gc.RefRemove
 PASSED : gc.RefRemove
Running test : gc.RunFinalizersOnExitTest
 PASSED : gc.RunFinalizersOnExitTest
Running test : gc.StressRef
 PASSED : gc.StressRef
Running test : gc.SynchronizedFinalizersTest
 PASSED : gc.SynchronizedFinalizersTest
Running test : gc.ThreadSuspension
 PASSED : gc.ThreadSuspension
Running test : init.ErrorInInitializer
 PASSED : init.ErrorInInitializer
Running test : init.Other
 PASSED : init.Other
Running test : io.ArrayList
 PASSED : io.ArrayList
Running test : io.Integers
 PASSED : io.Integers
Running test : jni.LoadLibrary
 PASSED : jni.LoadLibrary
Running test : outofmemory.Double
 PASSED : outofmemory.Double
Running test : outofmemory.Int
 PASSED : outofmemory.Int
Running test : outofmemory.Plain
 PASSED : outofmemory.Plain
Running test : outofmemory.Ref
 PASSED : outofmemory.Ref
Running test : outofmemory.Throw
 PASSED : outofmemory.Throw
Running test : outofmemory.Vector
 PASSED : outofmemory.Vector
Running test : outofmemory.VectorDouble
 PASSED : outofmemory.VectorDouble
Running test : outofmemory.VectorInt
 PASSED : outofmemory.VectorInt
Running test : outofmemory.VectorRef
 PASSED : outofmemory.VectorRef
Running test : perf.CreateManyExceptions
 PASSED : perf.CreateManyExceptions
Running test : perf.CreateManyExceptions_depth
 PASSED : perf.CreateManyExceptions_depth
Running test : perf.MultiThreadsSimple
 PASSED : perf.MultiThreadsSimple
Running test : perf.SeveralThreads
 PASSED : perf.SeveralThreads
Running test : perf.StressCornerSize
 PASSED : perf.StressCornerSize
Running test : perf.StressCornerSize_a
 PASSED : perf.StressCornerSize_a
Running test : perf.ThrowMany
 PASSED : perf.ThrowMany
Running test : perf.ThrowManyExceptions
 PASSED : perf.ThrowManyExceptions
Running test : perf.ThrowManyExceptions_depth
 PASSED : perf.ThrowManyExceptions_depth
Running test : perf.ThrowMany_depth
 PASSED : perf.ThrowMany_depth
Running test : reflect.GetMethod
 PASSED : reflect.GetMethod
Running test : shutdown.TestDaemonOnWait
 PASSED : shutdown.TestDaemonOnWait
Running test : shutdown.TestFatalError
 PASSED : shutdown.TestFatalError
Running test : shutdown.TestInterrupt
 PASSED : shutdown.TestInterrupt
Running test : shutdown.TestLock
 PASSED : shutdown.TestLock
Running test : stress.BigStringBuffer
 PASSED : stress.BigStringBuffer
Running test : stress.Finalizer
 PASSED : stress.Finalizer
Running test : stress.Intern
 PASSED : stress.Intern
Running test : stress.Mix
 PASSED : stress.Mix
Running test : stress.Sync
 PASSED : stress.Sync
Running test : stress.Vector
 PASSED : stress.Vector
Running test : stress.WeakHashmapTest
 PASSED : stress.WeakHashmapTest
Running test : thread.ExitShutdownHook
 PASSED : thread.ExitShutdownHook
Running test : thread.InfiniteFinalizer
 PASSED : thread.InfiniteFinalizer
Running test : thread.InterruptWait
 PASSED : thread.InterruptWait
Running test : thread.Sleep
 PASSED : thread.Sleep
Running test : thread.SmallStackThreadTest
 PASSED : thread.SmallStackThreadTest
Running test : thread.ThreadInterrupt
 PASSED : thread.ThreadInterrupt
Running test : thread.ThreadOOM
 PASSED : thread.ThreadOOM
Running test : util.Date
 PASSED : util.Date
Running test : util.DoPriveleged
 PASSED : util.DoPriveleged
Running test : util.Prop
 PASSED : util.Prop
Running test : util.StringIntern
 PASSED : util.StringIntern
Please find test classes and results at /export/cruise/trunk/cc/projects/drlvm/trunk/build/lnx_ia32_gcc_debug/semis/vm/_smoke.tests/

        ==================================
        Smoke tests on jitrino.OPT
        ==================================
        

Using exclude file = /export/cruise/trunk/cc/projects/drlvm/trunk/build/make/excludes/exclude.drlvm_smoke.linux.x86.opt   
        
Check.java
PerfCheck.java

# breaks on ubuntu 6 w/ OOME
stress/Threads.java

# HARMONY-3495 hangs intermittently
gc/NPE.java

# HARMONY-3010 HARMONY-4292
stress/Stack.java

# HARMONY-3917
gc/PhantomReferenceTest.java
gc/WeakReferenceTest.java

# HARMONY-3639
thread/ManyThreadsTest.java

                  
Running test : Hi
 PASSED : Hi
Running test : StackTest
 PASSED : StackTest
Running test : classloader.ClassTestGetDeclaringClass
 PASSED : classloader.ClassTestGetDeclaringClass
Running test : classloader.ExceptionInInitializerTest
 PASSED : classloader.ExceptionInInitializerTest
Running test : classloader.LogLoader
 PASSED : classloader.LogLoader
Running test : classloader.NotFound
 PASSED : classloader.NotFound
Running test : classloader.StressLoader
 PASSED : classloader.StressLoader
Running test : exception.ExceptionStackTest
 PASSED : exception.ExceptionStackTest
Running test : exception.FinalizeStackTest
 PASSED : exception.FinalizeStackTest
Running test : exception.NPE
 PASSED : exception.NPE
Running test : gc.FinAlloc
 PASSED : gc.FinAlloc
Running test : gc.Finalizer
 PASSED : gc.Finalizer
Running test : gc.Force
 PASSED : gc.Force
Running test : gc.Fragment
 PASSED : gc.Fragment
Running test : gc.Free
 PASSED : gc.Free
Running test : gc.LOS
 PASSED : gc.LOS
Running test : gc.List
 PASSED : gc.List
Running test : gc.Mark
 PASSED : gc.Mark
Running test : gc.MultiThreads
 PASSED : gc.MultiThreads
Running test : gc.PhantomReferenceQueueTest
 PASSED : gc.PhantomReferenceQueueTest
Running test : gc.RefRemove
 PASSED : gc.RefRemove
Running test : gc.RunFinalizersOnExitTest
 PASSED : gc.RunFinalizersOnExitTest
Running test : gc.StressRef
 PASSED : gc.StressRef
Running test : gc.SynchronizedFinalizersTest
 PASSED : gc.SynchronizedFinalizersTest
Running test : gc.ThreadSuspension
 PASSED : gc.ThreadSuspension
Running test : init.ErrorInInitializer
 PASSED : init.ErrorInInitializer
Running test : init.Other
 PASSED : init.Other
Running test : io.ArrayList
 PASSED : io.ArrayList
Running test : io.Integers
 PASSED : io.Integers
Running test : jni.LoadLibrary
 PASSED : jni.LoadLibrary
Running test : outofmemory.Double
 PASSED : outofmemory.Double
Running test : outofmemory.Int
 PASSED : outofmemory.Int
Running test : outofmemory.Plain
 PASSED : outofmemory.Plain
Running test : outofmemory.Ref
 PASSED : outofmemory.Ref
Running test : outofmemory.Throw
 PASSED : outofmemory.Throw
Running test : outofmemory.Vector
 PASSED : outofmemory.Vector
Running test : outofmemory.VectorDouble
 PASSED : outofmemory.VectorDouble
Running test : outofmemory.VectorInt
 PASSED : outofmemory.VectorInt
Running test : outofmemory.VectorRef
 PASSED : outofmemory.VectorRef
Running test : perf.CreateManyExceptions
 PASSED : perf.CreateManyExceptions
Running test : perf.CreateManyExceptions_depth
 PASSED : perf.CreateManyExceptions_depth
Running test : perf.MultiThreadsSimple
 PASSED : perf.MultiThreadsSimple
Running test : perf.SeveralThreads
 PASSED : perf.SeveralThreads
Running test : perf.StressCornerSize
 PASSED : perf.StressCornerSize
Running test : perf.StressCornerSize_a
 PASSED : perf.StressCornerSize_a
Running test : perf.ThrowMany
 PASSED : perf.ThrowMany
Running test : perf.ThrowManyExceptions
 PASSED : perf.ThrowManyExceptions
Running test : perf.ThrowManyExceptions_depth
 PASSED : perf.ThrowManyExceptions_depth
Running test : perf.ThrowMany_depth
 PASSED : perf.ThrowMany_depth
Running test : reflect.GetMethod
 PASSED : reflect.GetMethod
Running test : shutdown.TestDaemonOnWait
 PASSED : shutdown.TestDaemonOnWait
Running test : shutdown.TestFatalError
 PASSED : shutdown.TestFatalError
Running test : shutdown.TestInterrupt
 PASSED : shutdown.TestInterrupt
Running test : shutdown.TestLock
 PASSED : shutdown.TestLock
Running test : stress.BigStringBuffer
 PASSED : stress.BigStringBuffer
Running test : stress.Finalizer
 PASSED : stress.Finalizer
Running test : stress.Intern
 PASSED : stress.Intern
Running test : stress.Mix
 PASSED : stress.Mix
Running test : stress.Sync
 PASSED : stress.Sync
Running test : stress.Vector
 PASSED : stress.Vector
Running test : stress.WeakHashmapTest
 PASSED : stress.WeakHashmapTest
Running test : thread.ExitShutdownHook
 PASSED : thread.ExitShutdownHook
Running test : thread.InfiniteFinalizer
 PASSED : thread.InfiniteFinalizer
Running test : thread.InterruptWait
 PASSED : thread.InterruptWait
Running test : thread.Sleep
 PASSED : thread.Sleep
Running test : thread.SmallStackThreadTest
 PASSED : thread.SmallStackThreadTest
Running test : thread.ThreadInterrupt
 PASSED : thread.ThreadInterrupt
Running test : thread.ThreadOOM
 PASSED : thread.ThreadOOM
Running test : util.Date
 PASSED : util.Date
Running test : util.DoPriveleged
 PASSED : util.DoPriveleged
Running test : util.Prop
 PASSED : util.Prop
Running test : util.StringIntern
 PASSED : util.StringIntern
Please find test classes and results at /export/cruise/trunk/cc/projects/drlvm/trunk/build/lnx_ia32_gcc_debug/semis/vm/_smoke.tests/

        ==================================
        Smoke tests on Server mode JIT
        ==================================
        

Using exclude file = /export/cruise/trunk/cc/projects/drlvm/trunk/build/make/excludes/exclude.drlvm_smoke.linux.x86.srv   
        
Check.java
PerfCheck.java

# breaks on ubuntu 6 w/ OOME
stress/Threads.java

# HARMONY-3495 hangs intermittently
gc/NPE.java

# HARMONY-3010 HARMONY-4292
stress/Stack.java

# HARMONY-3917
gc/PhantomReferenceTest.java
gc/WeakReferenceTest.java

# HARMONY-3639
thread/ManyThreadsTest.java

                  
Running test : Hi
 PASSED : Hi
Running test : StackTest
 PASSED : StackTest
Running test : classloader.ClassTestGetDeclaringClass
 PASSED : classloader.ClassTestGetDeclaringClass
Running test : classloader.ExceptionInInitializerTest
 PASSED : classloader.ExceptionInInitializerTest
Running test : classloader.LogLoader
 PASSED : classloader.LogLoader
Running test : classloader.NotFound
 PASSED : classloader.NotFound
Running test : classloader.StressLoader
 PASSED : classloader.StressLoader
Running test : exception.ExceptionStackTest
 PASSED : exception.ExceptionStackTest
Running test : exception.FinalizeStackTest
 PASSED : exception.FinalizeStackTest
Running test : exception.NPE
 PASSED : exception.NPE
Running test : gc.FinAlloc
 PASSED : gc.FinAlloc
Running test : gc.Finalizer
 PASSED : gc.Finalizer
Running test : gc.Force
 PASSED : gc.Force
Running test : gc.Fragment
 PASSED : gc.Fragment
Running test : gc.Free
 PASSED : gc.Free
Running test : gc.LOS
 PASSED : gc.LOS
Running test : gc.List
 PASSED : gc.List
Running test : gc.Mark
 PASSED : gc.Mark
Running test : gc.MultiThreads
 PASSED : gc.MultiThreads
Running test : gc.PhantomReferenceQueueTest
 PASSED : gc.PhantomReferenceQueueTest
Running test : gc.RefRemove
 PASSED : gc.RefRemove
Running test : gc.RunFinalizersOnExitTest
 PASSED : gc.RunFinalizersOnExitTest
Running test : gc.StressRef
 PASSED : gc.StressRef
Running test : gc.SynchronizedFinalizersTest
 PASSED : gc.SynchronizedFinalizersTest
Running test : gc.ThreadSuspension
 PASSED : gc.ThreadSuspension
Running test : init.ErrorInInitializer
 PASSED : init.ErrorInInitializer
Running test : init.Other
 PASSED : init.Other
Running test : io.ArrayList
 PASSED : io.ArrayList
Running test : io.Integers
 PASSED : io.Integers
Running test : jni.LoadLibrary
 PASSED : jni.LoadLibrary
Running test : outofmemory.Double
 PASSED : outofmemory.Double
Running test : outofmemory.Int
 PASSED : outofmemory.Int
Running test : outofmemory.Plain
 PASSED : outofmemory.Plain
Running test : outofmemory.Ref
 PASSED : outofmemory.Ref
Running test : outofmemory.Throw
 PASSED : outofmemory.Throw
Running test : outofmemory.Vector
 PASSED : outofmemory.Vector
Running test : outofmemory.VectorDouble
 PASSED : outofmemory.VectorDouble
Running test : outofmemory.VectorInt
 PASSED : outofmemory.VectorInt
Running test : outofmemory.VectorRef
 PASSED : outofmemory.VectorRef
Running test : perf.CreateManyExceptions
 PASSED : perf.CreateManyExceptions
Running test : perf.CreateManyExceptions_depth
 PASSED : perf.CreateManyExceptions_depth
Running test : perf.MultiThreadsSimple
 PASSED : perf.MultiThreadsSimple
Running test : perf.SeveralThreads
 PASSED : perf.SeveralThreads
Running test : perf.StressCornerSize
 PASSED : perf.StressCornerSize
Running test : perf.StressCornerSize_a
 PASSED : perf.StressCornerSize_a
Running test : perf.ThrowMany
 PASSED : perf.ThrowMany
Running test : perf.ThrowManyExceptions
 PASSED : perf.ThrowManyExceptions
Running test : perf.ThrowManyExceptions_depth
 PASSED : perf.ThrowManyExceptions_depth
Running test : perf.ThrowMany_depth
 PASSED : perf.ThrowMany_depth
Running test : reflect.GetMethod
 PASSED : reflect.GetMethod
Running test : shutdown.TestDaemonOnWait
 PASSED : shutdown.TestDaemonOnWait
Running test : shutdown.TestFatalError
 PASSED : shutdown.TestFatalError
Running test : shutdown.TestInterrupt
 PASSED : shutdown.TestInterrupt
Running test : shutdown.TestLock
 PASSED : shutdown.TestLock
Running test : stress.BigStringBuffer
 PASSED : stress.BigStringBuffer
Running test : stress.Finalizer
 PASSED : stress.Finalizer
Running test : stress.Intern
 PASSED : stress.Intern
Running test : stress.Mix
 PASSED : stress.Mix
Running test : stress.Sync
 PASSED : stress.Sync
Running test : stress.Vector
 PASSED : stress.Vector
Running test : stress.WeakHashmapTest
 PASSED : stress.WeakHashmapTest
Running test : thread.ExitShutdownHook
 PASSED : thread.ExitShutdownHook
Running test : thread.InfiniteFinalizer
 PASSED : thread.InfiniteFinalizer
Running test : thread.InterruptWait
 PASSED : thread.InterruptWait
Running test : thread.Sleep
 PASSED : thread.Sleep
Running test : thread.SmallStackThreadTest
 PASSED : thread.SmallStackThreadTest
Running test : thread.ThreadInterrupt
 PASSED : thread.ThreadInterrupt
Running test : thread.ThreadOOM
 PASSED : thread.ThreadOOM
Running test : util.Date
 PASSED : util.Date
Running test : util.DoPriveleged
 PASSED : util.DoPriveleged
Running test : util.Prop
 PASSED : util.Prop
Running test : util.StringIntern
 PASSED : util.StringIntern
Please find test classes and results at /export/cruise/trunk/cc/projects/drlvm/trunk/build/lnx_ia32_gcc_debug/semis/vm/_smoke.tests/
The test report is in /export/cruise/trunk/cc/projects/drlvm/trunk/build/lnx_ia32_gcc_debug/semis/vm/_smoke.tests/reports/html/index.html
Note: Some input files use or override a deprecated API.
Note: Recompile with -Xlint:deprecation for details.
Note: /export/cruise/trunk/cc/projects/drlvm/trunk/vm/tests/kernel/java/lang/ClassAnnotationsTest.java uses unchecked or unsafe operations.
Note: Recompile with -Xlint:unchecked for details.

        ==================================
        Run kernel tests using interpreter
        ==================================
        

Using exclude file = /export/cruise/trunk/cc/projects/drlvm/trunk/build/make/excludes/exclude.drlvm_kernel.linux.x86.int   
        
## These tests are too slow
java/lang/RuntimeAdditionalTest*.java

## Tese tests are unstable and hang often
java/lang/RuntimeAdditionalTest11.java
java/lang/RuntimeAdditionalTest34.java
java/lang/RuntimeAdditionalTest39.java
java/lang/RuntimeAdditionalTest40.java
java/lang/RuntimeAdditionalTest41.java
java/lang/RuntimeAdditionalTest42.java

                  
The GC did not provide gc_add_weak_root_set_entry()

        ==================================
        Run kernel tests using Client mode JIT (default)
        ==================================
        

Using exclude file = /export/cruise/trunk/cc/projects/drlvm/trunk/build/make/excludes/exclude.drlvm_kernel.linux.x86.jit   
        
## These tests are too slow
java/lang/RuntimeAdditionalTest*.java

## Tese tests are unstable and hang often
java/lang/RuntimeAdditionalTest11.java
java/lang/RuntimeAdditionalTest34.java
java/lang/RuntimeAdditionalTest39.java
java/lang/RuntimeAdditionalTest40.java
java/lang/RuntimeAdditionalTest41.java
java/lang/RuntimeAdditionalTest42.java


                  
The GC did not provide gc_add_weak_root_set_entry()

        ==================================
        Run kernel tests using jitrino.JET
        ==================================
        

Using exclude file = /export/cruise/trunk/cc/projects/drlvm/trunk/build/make/excludes/exclude.drlvm_kernel.linux.x86.jet   
        
## These tests are too slow
java/lang/RuntimeAdditionalTest*.java

## Tese tests are unstable and hang often
java/lang/RuntimeAdditionalTest11.java
java/lang/RuntimeAdditionalTest34.java
java/lang/RuntimeAdditionalTest39.java
java/lang/RuntimeAdditionalTest40.java
java/lang/RuntimeAdditionalTest41.java
java/lang/RuntimeAdditionalTest42.java


                  
The GC did not provide gc_add_weak_root_set_entry()

        ==================================
        Run kernel tests using jitrino.OPT
        ==================================
        

Using exclude file = /export/cruise/trunk/cc/projects/drlvm/trunk/build/make/excludes/exclude.drlvm_kernel.linux.x86.opt   
        
## These tests are too slow
java/lang/RuntimeAdditionalTest*.java

## Tese tests are unstable and hang often
java/lang/RuntimeAdditionalTest11.java
java/lang/RuntimeAdditionalTest34.java
java/lang/RuntimeAdditionalTest39.java
java/lang/RuntimeAdditionalTest40.java
java/lang/RuntimeAdditionalTest41.java
java/lang/RuntimeAdditionalTest42.java


                  
The GC did not provide gc_add_weak_root_set_entry()

        ==================================
        Run kernel tests using Server mode JIT
        ==================================
        

Using exclude file = /export/cruise/trunk/cc/projects/drlvm/trunk/build/make/excludes/exclude.drlvm_kernel.linux.x86.srv   
        
## These tests are too slow
java/lang/RuntimeAdditionalTest*.java

## Tese tests are unstable and hang often
java/lang/RuntimeAdditionalTest11.java
java/lang/RuntimeAdditionalTest34.java
java/lang/RuntimeAdditionalTest39.java
java/lang/RuntimeAdditionalTest40.java
java/lang/RuntimeAdditionalTest41.java
java/lang/RuntimeAdditionalTest42.java


                  
The GC did not provide gc_add_weak_root_set_entry()
java: /export/cruise/trunk/cc/projects/drlvm/trunk/vm/gc_gen/src/utils/sync_pool.h:44: void pool_put_entry(Pool*, void*): Assertion `value' failed.
SIGABRT in VM code.
Stack trace:
  0: ?? (??:-1)
  1: abort (??:-1)
  2: __assert_fail (??:-1)
  3: pool_put_entry(Sync_Stack*, void*) (/export/cruise/trunk/cc/projects/drlvm/trunk/vm/gc_gen/src/utils/sync_pool.h:45)
  4: gc_set_obj_with_fin(GC*) (/export/cruise/trunk/cc/projects/drlvm/trunk/vm/gc_gen/src/finalizer_weakref/finalizer_weakref_metadata.cpp:186)
  5: gc_reclaim_heap(GC*, unsigned int) (/export/cruise/trunk/cc/projects/drlvm/trunk/vm/gc_gen/src/common/gc_common.cpp:311)
  6: fspace_alloc(unsigned int, Allocator*) (/export/cruise/trunk/cc/projects/drlvm/trunk/vm/gc_gen/src/trace_forward/fspace_alloc.cpp:67)
  7: nos_alloc(unsigned int, Allocator*) (/export/cruise/trunk/cc/projects/drlvm/trunk/vm/gc_gen/src/gen/gen.cpp:278)
  8: gc_alloc (/export/cruise/trunk/cc/projects/drlvm/trunk/vm/gc_gen/src/thread/mutator_alloc.cpp:80)
  9: vm_alloc_and_report_ti(unsigned int, unsigned int, void*, Class*) (/export/cruise/trunk/cc/projects/drlvm/trunk/vm/vmcore/src/jvmti/jvmti_event.cpp:1359)
 10: Class::allocate_instance() (/export/cruise/trunk/cc/projects/drlvm/trunk/vm/vmcore/src/class_support/Class.cpp:476)
 11: ClassLoader::AllocateAndReportInstance(Global_Env const*, Class*) (/export/cruise/trunk/cc/projects/drlvm/trunk/vm/vmcore/src/class_support/classloader.cpp:859)
 12: ClassLoader::NewClass(Global_Env const*, String const*) (/export/cruise/trunk/cc/projects/drlvm/trunk/vm/vmcore/src/class_support/classloader.cpp:218)
 13: ClassLoader::DefineClass(Global_Env*, char const*, unsigned char*, unsigned int, unsigned int, String const**) (/export/cruise/trunk/cc/projects/drlvm/trunk/vm/vmcore/src/class_support/classloader.cpp:273)
 14: BootstrapClassLoader::LoadFromJarFile(JarFile*, char const*, String const*, bool*) (/export/cruise/trunk/cc/projects/drlvm/trunk/vm/vmcore/src/class_support/classloader.cpp:1806)
 15: BootstrapClassLoader::LoadFromFile(String const*) (/export/cruise/trunk/cc/projects/drlvm/trunk/vm/vmcore/src/class_support/classloader.cpp:1701)
 16: BootstrapClassLoader::DoLoadClass(Global_Env*, String const*) (/export/cruise/trunk/cc/projects/drlvm/trunk/vm/vmcore/src/class_support/classloader.cpp:1445)
 17: ClassLoader::LoadClass(Global_Env*, String const*) (/export/cruise/trunk/cc/projects/drlvm/trunk/vm/vmcore/src/class_support/classloader.cpp:1400)
 18: ClassLoader::LoadVerifyAndPrepareClass(Global_Env*, String const*) (/export/cruise/trunk/cc/projects/drlvm/trunk/vm/vmcore/src/class_support/classloader.cpp:367)
 19: Objects_To_Finalize::is_class_ignored(Class*) (/export/cruise/trunk/cc/projects/drlvm/trunk/vm/vmcore/src/init/finalize.cpp:297)
 20: Objects_To_Finalize::do_finalization(int) (/export/cruise/trunk/cc/projects/drlvm/trunk/vm/vmcore/src/init/finalize.cpp:502)
 21: vm_do_finalization(int) (/export/cruise/trunk/cc/projects/drlvm/trunk/vm/vmcore/src/init/finalize.cpp:630)
 22: finalizer_thread_func (/export/cruise/trunk/cc/projects/drlvm/trunk/vm/vmcore/src/init/finalizer_thread.cpp:227)
 23: thread_start_proc (/export/cruise/trunk/cc/projects/drlvm/trunk/vm/thread/src/thread_native_basic.c:710)
 24: start_thread (??:-1)
 25: clone (??:-1)
<end of stack trace>
  ***************************
  *** Kernel tests status ***
  ***************************
      interpreter PASSED
      Client mode JIT (default) PASSED
      jitrino.JET PASSED
      jitrino.OPT PASSED
      Server mode JIT FAILED
Please find detailed results under /export/cruise/trunk/cc/projects/drlvm/trunk/build/lnx_ia32_gcc_debug/semis/kernel.tests/reports directory.

***********************************************************
Unit Tests: (4340)
        

***********************************************************
Modifications since last successful build:	(27)
            
modified varlax  /harmony/enhanced/drlvm/trunk/vm/jitrino/src/optimizer/abcd/classic_abcd_solver.cpp 08/13/2007 16:13:48 GCC compilation fixed
modified leoli  /harmony/enhanced/classlib/trunk/modules/luni/src/main/native/luni/unix/helpers.c 08/13/2007 15:00:45 Fix bug for getPlatformIsReadOnly/getPlatformIsWriteOnly on unix platforms.[root shall have all permissions to read/write.]
modified leoli  /harmony/enhanced/classlib/trunk/modules/luni/src/test/api/common/tests/api/java/util/HashMapTest.java 08/13/2007 14:56:25 Apply patch for HARMONY-4603 ( [classlib][util] LinkedHashMap.clone() has problem when override the removeEldestEntry method).
modified leoli  /harmony/enhanced/classlib/trunk/modules/luni/src/main/java/java/util/LinkedHashMap.java 08/13/2007 14:56:25 Apply patch for HARMONY-4603 ( [classlib][util] LinkedHashMap.clone() has problem when override the removeEldestEntry method).
modified leoli  /harmony/enhanced/classlib/trunk/modules/luni/src/test/api/common/tests/api/java/util/LinkedHashMapTest.java 08/13/2007 14:56:25 Apply patch for HARMONY-4603 ( [classlib][util] LinkedHashMap.clone() has problem when override the removeEldestEntry method).
modified leoli  /harmony/enhanced/classlib/trunk/modules/luni/src/main/java/java/util/HashMap.java 08/13/2007 14:56:25 Apply patch for HARMONY-4603 ( [classlib][util] LinkedHashMap.clone() has problem when override the removeEldestEntry method).
modified mloenko  /harmony/enhanced/drlvm/trunk/vm/vmcore/src/verifier-3363/vf_resolve.cpp 08/13/2007 12:53:33 resolve classes in 'forced' case in similar way as 'unforced'
modified xli  /harmony/enhanced/drlvm/trunk/build/make/excludes/exclude.drlvm_smoke.linux.ia64.jit 08/12/2007 18:46:27 HARMONY-4601: [drlvm][gc_gen] Thread termination in thread.SmallStackThreadTest is terribly slow
modified xli  /harmony/enhanced/drlvm/trunk/build/make/excludes/exclude.drlvm_smoke.linux.x86.jit 08/12/2007 18:46:27 HARMONY-4601: [drlvm][gc_gen] Thread termination in thread.SmallStackThreadTest is terribly slow
modified xli  /harmony/enhanced/drlvm/trunk/build/make/excludes/exclude.drlvm_smoke.linux.ia64.int 08/12/2007 18:46:27 HARMONY-4601: [drlvm][gc_gen] Thread termination in thread.SmallStackThreadTest is terribly slow
modified xli  /harmony/enhanced/drlvm/trunk/build/make/excludes/exclude.drlvm_smoke.linux.x86.int 08/12/2007 18:46:27 HARMONY-4601: [drlvm][gc_gen] Thread termination in thread.SmallStackThreadTest is terribly slow
modified xli  /harmony/enhanced/drlvm/trunk/build/make/excludes/exclude.drlvm_smoke.linux.x86.srv 08/12/2007 18:46:27 HARMONY-4601: [drlvm][gc_gen] Thread termination in thread.SmallStackThreadTest is terribly slow
modified xli  /harmony/enhanced/drlvm/trunk/build/make/excludes/exclude.drlvm_smoke.linux.x86_64.opt 08/12/2007 18:46:27 HARMONY-4601: [drlvm][gc_gen] Thread termination in thread.SmallStackThreadTest is terribly slow
modified xli  /harmony/enhanced/drlvm/trunk/build/make/excludes/exclude.drlvm_smoke.linux.x86_64.jit 08/12/2007 18:46:27 HARMONY-4601: [drlvm][gc_gen] Thread termination in thread.SmallStackThreadTest is terribly slow
modified xli  /harmony/enhanced/drlvm/trunk/build/make/excludes/exclude.drlvm_smoke.linux.x86.jet 08/12/2007 18:46:27 HARMONY-4601: [drlvm][gc_gen] Thread termination in thread.SmallStackThreadTest is terribly slow
modified xli  /harmony/enhanced/drlvm/trunk/build/make/excludes/exclude.drlvm_smoke.linux.x86.opt 08/12/2007 18:46:27 HARMONY-4601: [drlvm][gc_gen] Thread termination in thread.SmallStackThreadTest is terribly slow
modified xli  /harmony/enhanced/drlvm/trunk/build/make/excludes/exclude.drlvm_smoke.linux.x86_64.int 08/12/2007 18:46:27 HARMONY-4601: [drlvm][gc_gen] Thread termination in thread.SmallStackThreadTest is terribly slow
modified xli  /harmony/enhanced/drlvm/trunk/build/make/excludes/exclude.drlvm_smoke.linux.x86_64.srv 08/12/2007 18:46:27 HARMONY-4601: [drlvm][gc_gen] Thread termination in thread.SmallStackThreadTest is terribly slow
modified xli  /harmony/enhanced/drlvm/trunk/vm/gc_gen/src/common/gc_platform.h 08/12/2007 18:46:27 HARMONY-4601: [drlvm][gc_gen] Thread termination in thread.SmallStackThreadTest is terribly slow
modified egor  /harmony/enhanced/drlvm/trunk/vm/jitrino/src/optimizer/abcd/classic_abcd_solver.cpp 08/12/2007 14:52:37 Applying patches from HARMONY-4476 ([drlvm][jit][opt][abcd] Two-state Inequality Graph for both Lower and Upper problems, to ensure correctness and simplify the code, ability to dump stats)
modified egor  /harmony/enhanced/drlvm/trunk/vm/jitrino/src/optimizer/abcd/classic_abcd_solver.h 08/12/2007 14:52:37 Applying patches from HARMONY-4476 ([drlvm][jit][opt][abcd] Two-state Inequality Graph for both Lower and Upper problems, to ensure correctness and simplify the code, ability to dump stats)
modified egor  /harmony/enhanced/drlvm/trunk/vm/jitrino/src/optimizer/optimizer.cpp 08/12/2007 14:52:37 Applying patches from HARMONY-4476 ([drlvm][jit][opt][abcd] Two-state Inequality Graph for both Lower and Upper problems, to ensure correctness and simplify the code, ability to dump stats)
modified egor  /harmony/enhanced/drlvm/trunk/vm/jitrino/src/optimizer/abcd/classic_abcd.cpp 08/12/2007 14:52:37 Applying patches from HARMONY-4476 ([drlvm][jit][opt][abcd] Two-state Inequality Graph for both Lower and Upper problems, to ensure correctness and simplify the code, ability to dump stats)
modified egor  /harmony/enhanced/drlvm/trunk/vm/jitrino/src/optimizer/abcd/insertpi.cpp 08/12/2007 14:52:37 Applying patches from HARMONY-4476 ([drlvm][jit][opt][abcd] Two-state Inequality Graph for both Lower and Upper problems, to ensure correctness and simplify the code, ability to dump stats)
modified egor  /harmony/enhanced/drlvm/trunk/vm/jitrino/src/optimizer/optimizer.h 08/12/2007 14:52:37 Applying patches from HARMONY-4476 ([drlvm][jit][opt][abcd] Two-state Inequality Graph for both Lower and Upper problems, to ensure correctness and simplify the code, ability to dump stats)
modified egor  /harmony/enhanced/drlvm/trunk/vm/jitrino/src/optimizer/abcd/classic_abcd.h 08/12/2007 14:52:37 Applying patches from HARMONY-4476 ([drlvm][jit][opt][abcd] Two-state Inequality Graph for both Lower and Upper problems, to ensure correctness and simplify the code, ability to dump stats)
modified egor  /harmony/enhanced/drlvm/trunk/vm/jitrino/src/optimizer/abcd/insertpi.h 08/12/2007 14:52:37 Applying patches from HARMONY-4476 ([drlvm][jit][opt][abcd] Two-state Inequality Graph for both Lower and Upper problems, to ensure correctness and simplify the code, ability to dump stats)

Mime
View raw message