harmony-alerts mailing list archives

Site index · List index
Message view « Date » · « Thread »
Top « Date » · « Thread »
From nom...@intel.com
Subject [build-test alert] FAILED Windows 2003 x86_64: dacapo
Date Fri, 10 Aug 2007 14:25:26 GMT
svn.revision=564155
BUILD FAILED:
	Ant Error Message:
C:\cc\cc-spec\scripts\cc-exec-adaptor.xml:101: The following error occurred while executing
this line: C:\cc\cc-spec\adaptors\dacapo\adaptor.xml:124: Not all workloads completed successfully

Date of build:	08/10/2007 21:23:51
Time to build:	1 minute 29 seconds
Last changed:	08/10/2007 19:01:01
Last log entry:	snapshot

***********************************************************
Errors/Warnings:	(47)
            
java version "1.5.0"
pre-alpha : not complete or compatible
svn = r564155, (Aug 10 2007), Windows/em64t/msvc 1400, release build
http://harmony.apache.org
===== DaCapo antlr starting =====
ANTLR Parser Generator   Version 2.7.2   1989-2003 jGuru.com
The GC did not provide gc_add_weak_root_set_entry()
===== DaCapo antlr PASSED in 782 msec =====
===== DaCapo bloat starting =====
===== DaCapo bloat PASSED in 3016 msec =====
===== DaCapo eclipse starting =====
Windows reported exception: 0xc0000005
Registers:
RAX: 0x0000000002ac51e0, RBX: 0x0000000002aca070
RCX: 0x000000000485aef0, RDX: 0x0000011800650002
RSI: 0x000000000862e770, RDI: 0x000000000263af00
RSP: 0x000000000a01d628, RBP: 0x0000000002a24da0
R8 : 0x00000000090238c0, R9 : 0x0000000009023320
R10: 0x0000000100000001, R11: 0x000000000a01d6d0
R12: 0x0000000000000000, R13: 0x0000000000000050
R14: 0x0000000000000000, R15: 0x0000000000000000
RIP: 0x0000000000804175
Stack trace:
0: vm_enumerate_root_set_single_thread_not_on_stack (??:-1)
1: ?? (??:-1)
2: org/eclipse/jdt/internal/core/util/SimpleWordSet.<init>(I)V (SimpleWordSet.java:28)
3: org/eclipse/jdt/internal/core/util/SimpleWordSet.rehash()V (SimpleWordSet.java:58)
4: org/eclipse/jdt/internal/core/util/SimpleWordSet.add([C)[C (SimpleWordSet.java:42)
5: org/eclipse/jdt/internal/core/index/MemoryIndex.addIndexEntry([C[CLjava/lang/String;)V
(MemoryIndex.java:53)
6: org/eclipse/jdt/internal/core/index/Index.addIndexEntry([C[CLjava/lang/String;)V (Index.java:79)
7: org/eclipse/jdt/internal/core/search/indexing/InternalSearchDocument.addIndexEntry([C[C)V
(InternalSearchDocument.java:26)
8: org/eclipse/jdt/core/search/SearchDocument.addIndexEntry([C[C)V (SearchDocument.java:50)
9: org/eclipse/jdt/internal/core/search/indexing/AbstractIndexer.addIndexEntry([C[C)V (AbstractIndexer.java:-1)
10: org/eclipse/jdt/internal/core/search/indexing/AbstractIndexer.addConstructorReference([CI)V
(AbstractIndexer.java:82)
11: org/eclipse/jdt/internal/core/search/indexing/BinaryIndexer.extractReferenceFromConstantPool([BLorg/eclipse/jdt/internal/compiler/classfmt/ClassFileReader;)V
(BinaryIndexer.java:412)
12: org/eclipse/jdt/internal/core/search/indexing/BinaryIndexer.indexDocument()V (BinaryIndexer.java:536)
13: org/eclipse/jdt/internal/core/search/JavaSearchParticipant.indexDocument(Lorg/eclipse/jdt/core/search/SearchDocument;Lorg/eclipse/core/runtime/IPath;)V
(JavaSearchParticipant.java:74)
14: org/eclipse/jdt/internal/core/search/indexing/IndexManager.indexDocument(Lorg/eclipse/jdt/core/search/SearchDocument;Lorg/eclipse/jdt/core/search/SearchParticipant;Lorg/eclipse/jdt/internal/core/index/Index;Lorg/eclipse/core/runtime/IPath;)V
(IndexManager.java:290)
15: org/eclipse/jdt/internal/core/search/indexing/AddJarFileToIndex.execute(Lorg/eclipse/core/runtime/IProgressMonitor;)Z
(AddJarFileToIndex.java:179)
16: org/eclipse/jdt/internal/core/search/processing/JobManager.run()V (JobManager.java:372)
17: java/lang/Thread.run()V (Thread.java:662)
18: java/lang/Thread.runImpl()V (Thread.java:673)
<end of stack trace>
Number of tests: (...........)
N of runned tests(..)
The execution FAILED with the following exception:
The following error occurred while executing this line:
C:\cc\cc-spec\adaptors\dacapo\adaptor.xml:124: Not all workloads completed successfully

***********************************************************
Unit Tests: (0)
        
No Tests Run: This project doesn't have any tests

***********************************************************
Modifications since last successful build:	(1)
            
add cc-snapshot log20070810190101Lbuild.9 08/10/2007 19:01:01snapshot

begin 644 stdout.log
M4G5N;FEN9R!A;G1L<B!O;B!G<F%M;6%R(&%N=&QR+VIA=F$N9PT*3W!T:6UI
M>F5D('=I=&@Z($5$52YP=7)D=64N8W,N8FQO870N;W!T:6UI>F4N36%I;B M
M;VYL>2!%1%4N<'5R9'5E+F-S+F)L;V%T+G1R86YS("UP<F4@+61C92 M9&EV
M82 M<')O<" M<W1A8VLM86QL;V,@+7!E96PM;&]O<',@86QL("UF($5$52YP
M=7)D=64N8W,N8FQO870N=')A;G,N5F%L=65.=6UB97)I;F<@+EQS8W)A=&-H
M7&]P=&EM:7IE9&-O9&4-"CQS971T:6YG('5P('=O<FMS<&%C92XN+CX-"CQC
M<F5A=&EN9R!P<F]J96-T<RXN+BXN+BXN+BXN+BXN+BXN+BXN+BXN+BXN+BXN
M+BXN+BXN+BXN+BXN+BXN+BXN+BXN+BXN+BXN+BXN+BXN/@T*/')U;FYI;F<@
M=&5S=',@870@;&5V96P@,"XN+CX-"CQP97)F;W)M:6YG($%35"!T97-T<RXN
M+CX-"@E!4U0@8W)E871I;VXZ(&]R9RYE8VQI<'-E+FID="YI;G1E<FYA;"YC
0;VUP:6QE<BYP87)S97(-"@$! 
end
begin 644 execution_log.zip
M4$L#! H    ( "NK"C=4U@LB.@8  +L2   2    97AE8W5T:6]N7VQO9RYH
M=&ULI5AM;]LV$/Z\ /T/1(%A#A#KS>^NZ\)UFLY%T@5QU@Y+"H.ASI92211(
M*HGWZW>D[,2RY#AMA2"6R./SW)WNCCP- A5'P\$-]Y?#02I@.*!$JF4$;_^8
M\T359?@?]$G7^?W-'\-7!R)+^J\.B+ZNX '8-S)**0N _$E%S),E.:59@L^"
M]$F-'9(Q3Y<B7 2*N+V>>T0\QVF32Y1?+9ORN;JG L@)SQ*?JI GA L2*DFB
MD$$BN9!'A$I"TQ0'Z$T$5I'_EMY1<@="ZJ6O7:ME.:])402MJM,H#2@JE7!%
M&(_3"!1H)GV/M(A;7"/O$O*6B%:[Z;9:1Z0VRA;$=;3^G<,C\C5,?'XO;8C;
M367'\HX1M^DX1T1 !%0"N<G"R"\B!DJE?=L.<D=9U#C XF)1%'NK+W),QS3E
MA"8J$O@ZJ%!ALLCGBN(769+HJ5P27; 0-(ZIR =L[1UKBV'T^?+T@IQ3(?$U
M?80$!%7H"4*^K+SH61W+PV>WU^W5T>(&N?V8B<Q"7Q61](O\."9^Z!N_IH+?
MA3Z0!9M1WY_= _T^$YRKF00U@T2)9>UPK['GH^GTPS$)$]+I>B26P*K,+BR\
MB3A5SWKIKU2%,0:R3^Y#%?3)A^._K303?@86DY99;_&5C'5&D;S.DVA9*:<$
M322I8U"1NL_TOQ C$)]Y2NJH!/N.P19QAD, 43WB/,7PC2)2G^_&L[[0*(//
M67P#0MM@74N&KX4%UVNU?,9]V.N$)^\U'+?],O<!B\(48_8Y!P[P%9JY+"7W
M7'R7&+U@6=9P2XP)H$8.W7$+3$GKEZYM>+&*=@42*P3:&\$=1,2I$$U!S+F(
MM?1H>IFO*(O]IN=RI7G2QX*PL%;NL&Y]986) I'02(=^&D8@K-2D31%D50TP
M^5,N% 89/#!(<T3G@3GF:FWE+2Q"B>!RJYSJZV+TCU[HK"^/LI8+6%TNWI<F
MJ--Q*A#&1<%FMT5AKA&.GR9<MXO5N*5Q*A"FDP)"M^U!IV,0BA->NT'G3I4.
MT_."('5<O^UUM17G6U9X39]6(71)0;#G>(TNTSKTRA,-KPK!=38$W?4O(KAN
M63F_$L$K"*XNC= H3[0J$9J[$%I5$Q4(DZ+#G*[3=#M; 375E8=@,6%0"BET
MPEV,%3B+=:V'IZ(L,3TBF*D ,\"?80V?\61F:ABIO7O7K[N'VU#HMG?O=DUZ
M)H/L50;9F$'V.H-LQ@78F0HC>QKJ[?<K%_X4E#4(DU -:Y/#+Z16G-%[5]_K
MEE@:/\$B(* RJ.T@:95)FC]!@IM>[6I\>#6N)&EZ)9+6/A(L+/!@GT',Q7*B
M[S6'N?E@MM.K\=7X5*/;$4T6]E3IS>.-MG)S36YCHT3??AG]CQ%O4'9Z)<K.
M/DH)5+ @9T9(),]GIV;\F#.,X415:)-S5PKG@=0N*=,M*[.IPXLHJZA:3HFJ
M]Z-VCVZDSF5E*''?J6;?EC+TY<345?"7Z<<\P;&,X5GQ N8@(&& BDQVZM$M
M!;PNNC^FQ_LPH:LP1EAX,"R/]">"QT8M/#J><Q[5KMZ?/H.?;^$VBZB4\UC9
M8WUS@F,76/U F/ M$N:)ZY8-V5OIGC?$#*^#IK:#M]4HA:R[M_:M>#\A0!Z:
MY_I0Q\(47;1%6W+5[N!_4Y U<G@4PX,IV)-SJ@+CNFK.O!(T2Y;L+;#E2H W
M9S2ABY(#?]J2:MD-]<OB.RODBWQ4,"*O2[U2M7#W[@NE=/7]3U3H4+[D>0'6
M4)F"VG-*";X0(.49QQV88_C_BXE< C)*NN52[N[=/59*8B? D$6K^8G?K&U'
M+4S<;PP9ID:GG&RX:3QM-9?FK/*X?O5HUK;;Y;7=ZK43W)[+ZSO;>^0 $I_P
M.9%/AZOA]CE>9I'JD[J['F<\77XS'SYT[^&2.3J3*$[&_6O&\*\N4V#7Y@/!
MM3"KY;6/!_F4/R*S@'\C>3.HV4WOTB>UC<;H<$M6B^GF")L/(UTS(@>Z0<\C
M0??U)Z/)*3:'N@4F"F?F'/O4>ZWE4\-BEFQ,",%1!\8R(73W'&AC5HBZ#PM"
M_:$FT4?.HGW4IRD&U=JT];/U$$=]U\/D_\R5Z8IU-XFMJR\?/\OX1&9,A\P\
MBZ+EP:N#@4V' ]M\F[+S[U2V^6CU/U!+ 0(4 PH    ( "NK"C=4U@LB.@8 
M +L2   2              "D@0    !E>&5C=71I;VY?;&]G+FAT;6Q02P4&
2      $  0!     :@8      
end

Mime
View raw message