harmony-alerts mailing list archives

Site index · List index
Message view « Date » · « Thread »
Top « Date » · « Thread »
From nom...@intel.com
Subject [build-test alert] BUILD FAILED Linux x86: reliability
Date Fri, 10 Aug 2007 12:33:53 GMT
BUILD FAILED:
	Ant Error Message:
/export/users/cc/cc-reliability/scripts/cc-exec-adaptor.xml:101: The following error occurred
while executing this line: /export/users/cc/cc-reliability/adaptors/reliability/adaptor.xml:97:
Some reliability tests failed on /export/users/cc/cc-reliability/build/checkouts/snapshot/hdk/jdk/jre/bin/java

Date of build:	08/10/2007 19:08:15
Time to build:	25 minutes 34 seconds
Last changed:	08/10/2007 19:07:45
Last log entry:	snapshot

***********************************************************
Errors/Warnings:	(279)
            
[java] Java Result: 104
[java] Java Result: 104
[java] Java Result: 104
[java] Java Result: 104
[java] Java Result: 104
[java] Java Result: 104
[java] Java Result: 104
[java] Java Result: 104
[java] Java Result: 104
[java] Java Result: 104
[java] Java Result: 104
[java] Java Result: 104
[java] Java Result: 104
[java] Java Result: 1
[java] Java Result: 104
[java] Java Result: 104
[java] Java Result: 104
[java] Java Result: 104
[java] Java Result: 104
[java] Java Result: 104
[java] Java Result: 104
[java] Java Result: 1
[java] Java Result: 104
[java] Java Result: 104
[java] Timeout: killed the sub-process
[java] 	at org.apache.tools.ant.taskdefs.Java.fork(Java.java:754)
[java] 	at org.apache.tools.ant.taskdefs.Java.executeJava(Java.java:171)
[java] 	at org.apache.tools.ant.taskdefs.Java.execute(Java.java:84)
[java] 	at org.apache.tools.ant.UnknownElement.execute(UnknownElement.java:275)
[java] 	at org.apache.tools.ant.Task.perform(Task.java:364)
[java] 	at org.apache.tools.ant.taskdefs.Sequential.execute(Sequential.java:64)
[java] 	at net.sf.antcontrib.logic.IfTask.execute(IfTask.java:197)
[java] 	at sun.reflect.GeneratedMethodAccessor5.invoke(Unknown Source)
[java] 	at sun.reflect.DelegatingMethodAccessorImpl.invoke(DelegatingMethodAccessorImpl.java:25)
[java] 	at java.lang.reflect.Method.invoke(Method.java:585)
[java] 	at org.apache.tools.ant.TaskAdapter.execute(TaskAdapter.java:123)
[java] 	at org.apache.tools.ant.UnknownElement.execute(UnknownElement.java:275)
[java] 	at org.apache.tools.ant.Task.perform(Task.java:364)
[java] 	at org.apache.tools.ant.taskdefs.Sequential.execute(Sequential.java:64)
[java] 	at org.apache.tools.ant.UnknownElement.execute(UnknownElement.java:275)
[java] 	at org.apache.tools.ant.Task.perform(Task.java:364)
[java] 	at org.apache.tools.ant.taskdefs.MacroInstance.execute(MacroInstance.java:378)
[java] 	at org.apache.tools.ant.UnknownElement.execute(UnknownElement.java:275)
[java] 	at org.apache.tools.ant.Task.perform(Task.java:364)
[java] 	at org.apache.tools.ant.Target.execute(Target.java:341)
[java] 	at org.apache.tools.ant.Target.performTasks(Target.java:369)
[java] 	at org.apache.tools.ant.Project.executeSortedTargets(Project.java:1216)
[java] 	at org.apache.tools.ant.Project.executeTarget(Project.java:1185)
[java] 	at org.apache.tools.ant.helper.DefaultExecutor.executeTargets(DefaultExecutor.java:40)
[java] 	at org.apache.tools.ant.Project.executeTargets(Project.java:1068)
[java] 	at org.apache.tools.ant.Main.runBuild(Main.java:668)
[java] 	at org.apache.tools.ant.Main.startAnt(Main.java:187)
[java] 	at org.apache.tools.ant.launch.Launcher.run(Launcher.java:246)
[java] 	at org.apache.tools.ant.launch.Launcher.main(Launcher.java:67)
[java] Timeout: killed the sub-process
[java] 	at org.apache.tools.ant.taskdefs.Java.fork(Java.java:754)
[java] 	at org.apache.tools.ant.taskdefs.Java.executeJava(Java.java:171)
[java] 	at org.apache.tools.ant.taskdefs.Java.execute(Java.java:84)
[java] 	at org.apache.tools.ant.UnknownElement.execute(UnknownElement.java:275)
[java] 	at org.apache.tools.ant.Task.perform(Task.java:364)
[java] 	at org.apache.tools.ant.taskdefs.Sequential.execute(Sequential.java:64)
[java] 	at net.sf.antcontrib.logic.IfTask.execute(IfTask.java:197)
[java] 	at sun.reflect.GeneratedMethodAccessor5.invoke(Unknown Source)
[java] 	at sun.reflect.DelegatingMethodAccessorImpl.invoke(DelegatingMethodAccessorImpl.java:25)
[java] 	at java.lang.reflect.Method.invoke(Method.java:585)
[java] 	at org.apache.tools.ant.TaskAdapter.execute(TaskAdapter.java:123)
[java] 	at org.apache.tools.ant.UnknownElement.execute(UnknownElement.java:275)
[java] 	at org.apache.tools.ant.Task.perform(Task.java:364)
[java] 	at org.apache.tools.ant.taskdefs.Sequential.execute(Sequential.java:64)
[java] 	at org.apache.tools.ant.UnknownElement.execute(UnknownElement.java:275)
[java] 	at org.apache.tools.ant.Task.perform(Task.java:364)
[java] 	at org.apache.tools.ant.taskdefs.MacroInstance.execute(MacroInstance.java:378)
[java] 	at org.apache.tools.ant.UnknownElement.execute(UnknownElement.java:275)
[java] 	at org.apache.tools.ant.Task.perform(Task.java:364)
[java] 	at org.apache.tools.ant.Target.execute(Target.java:341)
[java] 	at org.apache.tools.ant.Target.performTasks(Target.java:369)
[java] 	at org.apache.tools.ant.Project.executeSortedTargets(Project.java:1216)
[java] 	at org.apache.tools.ant.Project.executeTarget(Project.java:1185)
[java] 	at org.apache.tools.ant.helper.DefaultExecutor.executeTargets(DefaultExecutor.java:40)
[java] 	at org.apache.tools.ant.Project.executeTargets(Project.java:1068)
[java] 	at org.apache.tools.ant.Main.runBuild(Main.java:668)
[java] 	at org.apache.tools.ant.Main.startAnt(Main.java:187)
[java] 	at org.apache.tools.ant.launch.Launcher.run(Launcher.java:246)
[java] 	at org.apache.tools.ant.launch.Launcher.main(Launcher.java:67)
[java] Java Result: 104
[java] Java Result: 104
[java] Java Result: 1
[java] Java Result: 104
[java] Java Result: 104
[java] Java Result: 104
[java] Java Result: 104
[java] Java Result: 104
[java] Java Result: 104
[java] Java Result: 104
[java] Java Result: 104
[java] Timeout: killed the sub-process
[java] 	at org.apache.tools.ant.taskdefs.Java.fork(Java.java:754)
[java] 	at org.apache.tools.ant.taskdefs.Java.executeJava(Java.java:171)
[java] 	at org.apache.tools.ant.taskdefs.Java.execute(Java.java:84)
[java] 	at org.apache.tools.ant.UnknownElement.execute(UnknownElement.java:275)
[java] 	at org.apache.tools.ant.Task.perform(Task.java:364)
[java] 	at org.apache.tools.ant.taskdefs.Sequential.execute(Sequential.java:64)
[java] 	at net.sf.antcontrib.logic.IfTask.execute(IfTask.java:197)
[java] 	at sun.reflect.GeneratedMethodAccessor5.invoke(Unknown Source)
[java] 	at sun.reflect.DelegatingMethodAccessorImpl.invoke(DelegatingMethodAccessorImpl.java:25)
[java] 	at java.lang.reflect.Method.invoke(Method.java:585)
[java] 	at org.apache.tools.ant.TaskAdapter.execute(TaskAdapter.java:123)
[java] 	at org.apache.tools.ant.UnknownElement.execute(UnknownElement.java:275)
[java] 	at org.apache.tools.ant.Task.perform(Task.java:364)
[java] 	at org.apache.tools.ant.taskdefs.Sequential.execute(Sequential.java:64)
[java] 	at org.apache.tools.ant.UnknownElement.execute(UnknownElement.java:275)
[java] 	at org.apache.tools.ant.Task.perform(Task.java:364)
[java] 	at org.apache.tools.ant.taskdefs.MacroInstance.execute(MacroInstance.java:378)
[java] 	at org.apache.tools.ant.UnknownElement.execute(UnknownElement.java:275)
[java] 	at org.apache.tools.ant.Task.perform(Task.java:364)
[java] 	at org.apache.tools.ant.Target.execute(Target.java:341)
[java] 	at org.apache.tools.ant.Target.performTasks(Target.java:369)
[java] 	at org.apache.tools.ant.Project.executeSortedTargets(Project.java:1216)
[java] 	at org.apache.tools.ant.Project.executeTarget(Project.java:1185)
[java] 	at org.apache.tools.ant.helper.DefaultExecutor.executeTargets(DefaultExecutor.java:40)
[java] 	at org.apache.tools.ant.Project.executeTargets(Project.java:1068)
[java] 	at org.apache.tools.ant.Main.runBuild(Main.java:668)
[java] 	at org.apache.tools.ant.Main.startAnt(Main.java:187)
[java] 	at org.apache.tools.ant.launch.Launcher.run(Launcher.java:246)
[java] 	at org.apache.tools.ant.launch.Launcher.main(Launcher.java:67)
[java] Java Result: 104
[java] Timeout: killed the sub-process
[java] 	at org.apache.tools.ant.taskdefs.Java.fork(Java.java:754)
[java] 	at org.apache.tools.ant.taskdefs.Java.executeJava(Java.java:171)
[java] 	at org.apache.tools.ant.taskdefs.Java.execute(Java.java:84)
[java] 	at org.apache.tools.ant.UnknownElement.execute(UnknownElement.java:275)
[java] 	at org.apache.tools.ant.Task.perform(Task.java:364)
[java] 	at org.apache.tools.ant.taskdefs.Sequential.execute(Sequential.java:64)
[java] 	at net.sf.antcontrib.logic.IfTask.execute(IfTask.java:197)
[java] 	at sun.reflect.GeneratedMethodAccessor5.invoke(Unknown Source)
[java] 	at sun.reflect.DelegatingMethodAccessorImpl.invoke(DelegatingMethodAccessorImpl.java:25)
[java] 	at java.lang.reflect.Method.invoke(Method.java:585)
[java] 	at org.apache.tools.ant.TaskAdapter.execute(TaskAdapter.java:123)
[java] 	at org.apache.tools.ant.UnknownElement.execute(UnknownElement.java:275)
[java] 	at org.apache.tools.ant.Task.perform(Task.java:364)
[java] 	at org.apache.tools.ant.taskdefs.Sequential.execute(Sequential.java:64)
[java] 	at org.apache.tools.ant.UnknownElement.execute(UnknownElement.java:275)
[java] 	at org.apache.tools.ant.Task.perform(Task.java:364)
[java] 	at org.apache.tools.ant.taskdefs.MacroInstance.execute(MacroInstance.java:378)
[java] 	at org.apache.tools.ant.UnknownElement.execute(UnknownElement.java:275)
[java] 	at org.apache.tools.ant.Task.perform(Task.java:364)
[java] 	at org.apache.tools.ant.Target.execute(Target.java:341)
[java] 	at org.apache.tools.ant.Target.performTasks(Target.java:369)
[java] 	at org.apache.tools.ant.Project.executeSortedTargets(Project.java:1216)
[java] 	at org.apache.tools.ant.Project.executeTarget(Project.java:1185)
[java] 	at org.apache.tools.ant.helper.DefaultExecutor.executeTargets(DefaultExecutor.java:40)
[java] 	at org.apache.tools.ant.Project.executeTargets(Project.java:1068)
[java] 	at org.apache.tools.ant.Main.runBuild(Main.java:668)
[java] 	at org.apache.tools.ant.Main.startAnt(Main.java:187)
[java] 	at org.apache.tools.ant.launch.Launcher.run(Launcher.java:246)
[java] 	at org.apache.tools.ant.launch.Launcher.main(Launcher.java:67)
[java] Java Result: 104
[java] Java Result: 104
[java] Java Result: 104
[java] Java Result: 104
[java] Java Result: 104
[java] Java Result: 104
[java] Java Result: 104
[java] Java Result: 104
[java] Java Result: 104
[java] Java Result: 104
[java] Java Result: 104
[java] Java Result: 104
[java] Java Result: 104
[java] Java Result: 104
[java] Java Result: 104
[java] Java Result: 104
[java] Java Result: 104
[java] Java Result: 104
[java] Java Result: 104
[java] Timeout: killed the sub-process
[java] 	at org.apache.tools.ant.taskdefs.Java.fork(Java.java:754)
[java] 	at org.apache.tools.ant.taskdefs.Java.executeJava(Java.java:171)
[java] 	at org.apache.tools.ant.taskdefs.Java.execute(Java.java:84)
[java] 	at org.apache.tools.ant.UnknownElement.execute(UnknownElement.java:275)
[java] 	at org.apache.tools.ant.Task.perform(Task.java:364)
[java] 	at org.apache.tools.ant.taskdefs.Sequential.execute(Sequential.java:64)
[java] 	at net.sf.antcontrib.logic.IfTask.execute(IfTask.java:197)
[java] 	at sun.reflect.GeneratedMethodAccessor5.invoke(Unknown Source)
[java] 	at sun.reflect.DelegatingMethodAccessorImpl.invoke(DelegatingMethodAccessorImpl.java:25)
[java] 	at java.lang.reflect.Method.invoke(Method.java:585)
[java] 	at org.apache.tools.ant.TaskAdapter.execute(TaskAdapter.java:123)
[java] 	at org.apache.tools.ant.UnknownElement.execute(UnknownElement.java:275)
[java] 	at org.apache.tools.ant.Task.perform(Task.java:364)
[java] 	at org.apache.tools.ant.taskdefs.Sequential.execute(Sequential.java:64)
[java] 	at org.apache.tools.ant.UnknownElement.execute(UnknownElement.java:275)
[java] 	at org.apache.tools.ant.Task.perform(Task.java:364)
[java] 	at org.apache.tools.ant.taskdefs.MacroInstance.execute(MacroInstance.java:378)
[java] 	at org.apache.tools.ant.UnknownElement.execute(UnknownElement.java:275)
[java] 	at org.apache.tools.ant.Task.perform(Task.java:364)
[java] 	at org.apache.tools.ant.Target.execute(Target.java:341)
[java] 	at org.apache.tools.ant.Target.performTasks(Target.java:369)
[java] 	at org.apache.tools.ant.Project.executeSortedTargets(Project.java:1216)
[java] 	at org.apache.tools.ant.Project.executeTarget(Project.java:1185)
[java] 	at org.apache.tools.ant.helper.DefaultExecutor.executeTargets(DefaultExecutor.java:40)
[java] 	at org.apache.tools.ant.Project.executeTargets(Project.java:1068)
[java] 	at org.apache.tools.ant.Main.runBuild(Main.java:668)
[java] 	at org.apache.tools.ant.Main.startAnt(Main.java:187)
[java] 	at org.apache.tools.ant.launch.Launcher.run(Launcher.java:246)
[java] 	at org.apache.tools.ant.launch.Launcher.main(Launcher.java:67)
[java] Java Result: 104
[java] Java Result: 139
[java] Java Result: 105
[java] Java Result: 104
[java] Java Result: 104
[java] Java Result: 104
[java] Timeout: killed the sub-process
[java] 	at org.apache.tools.ant.taskdefs.Java.fork(Java.java:754)
[java] 	at org.apache.tools.ant.taskdefs.Java.executeJava(Java.java:171)
[java] 	at org.apache.tools.ant.taskdefs.Java.execute(Java.java:84)
[java] 	at org.apache.tools.ant.UnknownElement.execute(UnknownElement.java:275)
[java] 	at org.apache.tools.ant.Task.perform(Task.java:364)
[java] 	at org.apache.tools.ant.taskdefs.Sequential.execute(Sequential.java:64)
[java] 	at net.sf.antcontrib.logic.IfTask.execute(IfTask.java:197)
[java] 	at sun.reflect.GeneratedMethodAccessor5.invoke(Unknown Source)
[java] 	at sun.reflect.DelegatingMethodAccessorImpl.invoke(DelegatingMethodAccessorImpl.java:25)
[java] 	at java.lang.reflect.Method.invoke(Method.java:585)
[java] 	at org.apache.tools.ant.TaskAdapter.execute(TaskAdapter.java:123)
[java] 	at org.apache.tools.ant.UnknownElement.execute(UnknownElement.java:275)
[java] 	at org.apache.tools.ant.Task.perform(Task.java:364)
[java] 	at org.apache.tools.ant.taskdefs.Sequential.execute(Sequential.java:64)
[java] 	at org.apache.tools.ant.UnknownElement.execute(UnknownElement.java:275)
[java] 	at org.apache.tools.ant.Task.perform(Task.java:364)
[java] 	at org.apache.tools.ant.taskdefs.MacroInstance.execute(MacroInstance.java:378)
[java] 	at org.apache.tools.ant.UnknownElement.execute(UnknownElement.java:275)
[java] 	at org.apache.tools.ant.Task.perform(Task.java:364)
[java] 	at org.apache.tools.ant.Target.execute(Target.java:341)
[java] 	at org.apache.tools.ant.Target.performTasks(Target.java:369)
[java] 	at org.apache.tools.ant.Project.executeSortedTargets(Project.java:1216)
[java] 	at org.apache.tools.ant.Project.executeTarget(Project.java:1185)
[java] 	at org.apache.tools.ant.helper.DefaultExecutor.executeTargets(DefaultExecutor.java:40)
[java] 	at org.apache.tools.ant.Project.executeTargets(Project.java:1068)
[java] 	at org.apache.tools.ant.Main.runBuild(Main.java:668)
[java] 	at org.apache.tools.ant.Main.startAnt(Main.java:187)
[java] 	at org.apache.tools.ant.launch.Launcher.run(Launcher.java:246)
[java] 	at org.apache.tools.ant.launch.Launcher.main(Launcher.java:67)
[java] Java Result: 104
[java] Java Result: 104
[java] Java Result: 104
[java] Java Result: 104
[java] Java Result: 104
[java] Timeout: killed the sub-process
[java] 	at org.apache.tools.ant.taskdefs.Java.fork(Java.java:754)
[java] 	at org.apache.tools.ant.taskdefs.Java.executeJava(Java.java:171)
[java] 	at org.apache.tools.ant.taskdefs.Java.execute(Java.java:84)
[java] 	at org.apache.tools.ant.UnknownElement.execute(UnknownElement.java:275)
[java] 	at org.apache.tools.ant.Task.perform(Task.java:364)
[java] 	at org.apache.tools.ant.taskdefs.Sequential.execute(Sequential.java:64)
[java] 	at net.sf.antcontrib.logic.IfTask.execute(IfTask.java:197)
[java] 	at sun.reflect.GeneratedMethodAccessor5.invoke(Unknown Source)
[java] 	at sun.reflect.DelegatingMethodAccessorImpl.invoke(DelegatingMethodAccessorImpl.java:25)
[java] 	at java.lang.reflect.Method.invoke(Method.java:585)
[java] 	at org.apache.tools.ant.TaskAdapter.execute(TaskAdapter.java:123)
[java] 	at org.apache.tools.ant.UnknownElement.execute(UnknownElement.java:275)
[java] 	at org.apache.tools.ant.Task.perform(Task.java:364)
[java] 	at org.apache.tools.ant.taskdefs.Sequential.execute(Sequential.java:64)
[java] 	at org.apache.tools.ant.UnknownElement.execute(UnknownElement.java:275)
[java] 	at org.apache.tools.ant.Task.perform(Task.java:364)
[java] 	at org.apache.tools.ant.taskdefs.MacroInstance.execute(MacroInstance.java:378)
[java] 	at org.apache.tools.ant.UnknownElement.execute(UnknownElement.java:275)
[java] 	at org.apache.tools.ant.Task.perform(Task.java:364)
[java] 	at org.apache.tools.ant.Target.execute(Target.java:341)
[java] 	at org.apache.tools.ant.Target.performTasks(Target.java:369)
[java] 	at org.apache.tools.ant.Project.executeSortedTargets(Project.java:1216)
[java] 	at org.apache.tools.ant.Project.executeTarget(Project.java:1185)
[java] 	at org.apache.tools.ant.helper.DefaultExecutor.executeTargets(DefaultExecutor.java:40)
[java] 	at org.apache.tools.ant.Project.executeTargets(Project.java:1068)
[java] 	at org.apache.tools.ant.Main.runBuild(Main.java:668)
[java] 	at org.apache.tools.ant.Main.startAnt(Main.java:187)
[java] 	at org.apache.tools.ant.launch.Launcher.run(Launcher.java:246)
[java] 	at org.apache.tools.ant.launch.Launcher.main(Launcher.java:67)
[java] Java Result: 104
[java] Java Result: 104
The execution FAILED with the following exception:
The following error occurred while executing this line:
/export/users/cc/cc-reliability/adaptors/reliability/adaptor.xml:97: Some reliability tests
failed on /export/users/cc/cc-reliability/build/checkouts/snapshot/hdk/jdk/jre/bin/java

***********************************************************
Unit Tests: (75)
        
error: test api.kernel.hooks.AddRmPropertiesHooksTest
error: test api.kernel.string.InternThreadingTest
error: test api.kernel.thread.RecursiveThreadTest.RecursiveTest
error: test api.kernel.thread.ThreadArrayTest.ThreadArrayTest
error: test api.kernel.thread.ThreadSuspendResume.ThreadSuspendResume
error: test api.net.HttpConnectionTest
error: test api.net.MultiConnectTest
error: test api.net.SingleConnectTest
error: test api.nio.charset.DecodingModesTest
error: test api.nio.charset.EncodingModesTest
error: test api.util.ConcurrentTest
error: test vm.classloading.ClassCastTest
Unit Test Error Details:	(12)
                
Test: testClass: api.kernel.hooks.AddRmPropertiesHooksTestOK
The GC did not provide gc_add_weak_root_set_entry()
OK
OK
OK
OK
OK
OK
OK
OK
OK
OK
OK
OK
OK
OK
OK
OK
OK
OK
OK
OK
OK
OK
OK
OK
OK
OK
Uncaught exception in main:
java.lang.OutOfMemoryError: Failed to create new thread
	at java.lang.Thread.start(Thread.java:744)
	at org.apache.harmony.test.reliability.api.kernel.hooks.AddRmPropertiesHooksTest.createExecutedHooks(Unknown
Source)
	at org.apache.harmony.test.reliability.api.kernel.hooks.AddRmPropertiesHooksTest.playWithShutdownHooks(Unknown
Source)
	at org.apache.harmony.test.reliability.api.kernel.hooks.AddRmPropertiesHooksTest.test(Unknown
Source)
	at org.apache.harmony.test.reliability.share.LongRunningTestStarter.test(Unknown Source)
	at org.apache.harmony.test.reliability.share.ReliabilityTestStarter.test(Unknown Source)
	at org.apache.harmony.test.reliability.share.ReliabilityTestStarter.main(Unknown Source)
Test: testClass: api.kernel.string.InternThreadingTestThe GC did not provide gc_add_weak_root_set_entry()
OK
OK
OK
OK
OK
OK
OK
OK
OK
OK
OK
OK
OK
OK
OK
OK
OK
OK
OK
OK
OK
OK
OK
OK
OK
OK
OK
OK
OK
OK
OK
OK
OK
OK
OK
OK
OK
OK
OK
OK
OK
OK
OK
OK
OK
OK
OK
OK
OK
OK
OK
OK
OK
OK
OK
OK
OK
OK
OK
OK
OK
OK
OK
OK
OK
OK
OK
OK
OK
OK
OK
OK
OK
OK
OK
OK
OK
OK
OK
OK
OK
OK
OK
OK
OK
OK
OK
OK
OK
OK
OK
OK
OK
OK
OK
OK
OK
OK
OK
OK
OK
OK
OK
OK
OK
OK
OK
OK
OK
Uncaught exception in main:
java.lang.OutOfMemoryError: Failed to create new thread
	at java.lang.Thread.start(Thread.java:744)
	at org.apache.harmony.test.reliability.api.kernel.string.InternThreadingTest.test(Unknown
Source)
	at org.apache.harmony.test.reliability.share.LongRunningTestStarter.test(Unknown Source)
	at org.apache.harmony.test.reliability.share.ReliabilityTestStarter.test(Unknown Source)
	at org.apache.harmony.test.reliability.share.ReliabilityTestStarter.main(Unknown Source)
Test: testClass: api.kernel.thread.RecursiveThreadTest.RecursiveTestOK
The GC did not provide gc_add_weak_root_set_entry()
OK
OK
OK
OK
OK
OK
OK
OK
OK
OK
OK
OK
OK
OK
OK
OK
OK
OK
OK
OK
OK
OK
OK
OK
OK
OK
OK
OK
OK
OK
OK
OK
OK
OK
OK
OK
OK
OK
OK
OK
OK
OK
OK
OK
OK
OK
OK
OK
OK
OK
OK
OK
OK
Uncaught exception in Thread-5526:
java.lang.OutOfMemoryError: Failed to create new thread
	at java.lang.Thread.start(Thread.java:744)
	at org.apache.harmony.test.reliability.api.kernel.thread.RecursiveThreadTest.recurThread.run(Unknown
Source)
Test: testClass: api.kernel.thread.ThreadArrayTest.ThreadArrayTestThe GC did not provide gc_add_weak_root_set_entry()
OK
Uncaught exception in main:
java.lang.OutOfMemoryError: Failed to create new thread
	at java.lang.Thread.start(Thread.java:744)
	at org.apache.harmony.test.reliability.api.kernel.thread.ThreadArrayTest.ThreadArrayTest.test(Unknown
Source)
	at org.apache.harmony.test.reliability.share.LongRunningTestStarter.test(Unknown Source)
	at org.apache.harmony.test.reliability.share.ReliabilityTestStarter.test(Unknown Source)
	at org.apache.harmony.test.reliability.share.ReliabilityTestStarter.main(Unknown Source)
Test: testClass: api.kernel.thread.ThreadSuspendResume.ThreadSuspendResumeThe GC did not provide
gc_add_weak_root_set_entry()
Test: testClass: api.net.HttpConnectionTest
Test: testClass: api.net.MultiConnectTestThe GC did not provide gc_add_weak_root_set_entry()
SIGSEGV in VM code.
Stack trace:
Warning: Cannot get modules info, no symbolic information will be provided
  0: ?? (??:-1)
  1: org/apache/harmony/luni/platform/OSNetworkSystem.createServerStreamSocketImpl(Ljava/io/FileDescriptor;Z)V
(OSNetworkSystem.java:-2)
  2: org/apache/harmony/luni/platform/OSNetworkSystem.createServerStreamSocket(Ljava/io/FileDescriptor;Z)V
(OSNetworkSystem.java:223)
  3: org/apache/harmony/luni/net/PlainServerSocketImpl.create(Z)V (PlainServerSocketImpl.java:49)
  4: java/net/ServerSocket.LTinitGT(IILjava/net/InetAddress;)V (ServerSocket.java:117)
  5: java/net/ServerSocket.LTinitGT(I)V (ServerSocket.java:76)
  6: org/apache/harmony/test/reliability/api/net/ServerRunner.run()V (??:-1)
  7: java/lang/Thread.runImpl()V (Thread.java:673)
LTend of stack traceGT
Test: testClass: api.net.SingleConnectTestServer thread 46 could not accept request: The address
is not available
The GC did not provide gc_add_weak_root_set_entry()
FAILED
*** iteration: 0
test result is 105
Test FAILED
Test: testClass: api.nio.charset.DecodingModesTestSIGABRT in VM code.
Stack trace:
Test: testClass: api.nio.charset.EncodingModesTestThe GC did not provide gc_add_weak_root_set_entry()
Test: testClass: api.util.ConcurrentTest
Test: testClass: vm.classloading.ClassCastTestThe GC did not provide gc_add_weak_root_set_entry()

***********************************************************
Modifications since last successful build:	(9)
            
add cc-snapshot log20070810190745Lbuild.9 08/10/2007 19:07:45snapshot
add cc-snapshot log20070806194122Lbuild.8 08/06/2007 19:41:22snapshot
add cc-snapshot log20070801154520Lbuild.7 08/01/2007 15:45:20snapshot
add cc-snapshot log20070730190526Lbuild.6 07/30/2007 19:05:26snapshot
add cc-snapshot log20070724161634Lbuild.5 07/24/2007 16:16:34snapshot
add cc-snapshot log20070720170220Lbuild.4 07/20/2007 17:02:20snapshot
add cc-snapshot log20070719185009Lbuild.3 07/19/2007 18:50:09snapshot
add cc-snapshot log20070712182841Lbuild.2 07/12/2007 18:28:41snapshot
add cc-snapshot log20070711124837Lbuild.1 07/11/2007 12:48:37snapshot

begin 644 execution_log.zip
M4$L#! H    ( #F<"C?8 "L=6P@   IQ   2    97AE8W5T:6]N7VQO9RYH
M=&UL[5W?4]LX$'X^_@J_W!SW@!-^TQS'3 B!I@-'AX1VYCI,1[$WL1I9\DDR
MD/[UMY(3FJ008B?.0U&G;2S;VF^U6DG?2K)]'.F8G1QW13@\.4XDG!P33^DA
M@[__Z FNMQ3]#C7OJ/K[7W^<;,B4US8\\^?+-W)/[KS3E+*P1QG>@M?\QYA-
M7;:'\2"D\LYK2" :0@\3-:\"CXF0NI(JD*H2!/AW2P*CI$L9U<-*U\BM2% I
MTZHR>66G6CW<JAYM;5>_5@^K1U-P4PFC#TFH_YTFM9^4\KY $(D[[R;EG/*^
MIT'IFC>ZW?^7)DVNY;"E0:+.G0A5#_&V#M[UC*CL^ /^[]U8C6O>=G4O)V8]
M9" ;-XW=G3)1+K!H+7Z=ZK;&,L5E0K5XCYU!CUV 1B&@R\1:7ZG^9;1K2H5N
M(=> @W8[HX&F@A,Y+!O/R$<+8M'ZPTNXAY_;\HK!/A&)[9K!)?"^CHJA/=OF
M!R Y,)_(OLK3]B>R^?4D^735N/Q(9'D.-8G7?(2@R>_7 67+)44"4E-0Q1'G
MF1ZP. 5,;[+Y>-588_5*14(,BCB$S8<]='@3_[#;>W,RA_&6@FU'.GS@>2&+
M>$@&.H'7$'A>-HB"<CQ%=+]!H O42I;1O[8_#2;X$@KF!SRGG##D1NO$Q*$T
M8$2I]T1%@0A+JI D&/1K"]^MM$3%"U1?EA%I@@*NJ*;W99OR"1"';KY6K +\
ML3!DV_XL6\AY-:YM<0K4>):Q+T6:^$V>QAFY+K<B,DP_JX)VJA+@H1$8PW/G
M7E2D0V,0*8H>4,8PB-$1>"KM;B52!*#4B_E^(]H3LH_F(T$$OA:"*9]P[6NB
M!B'R.]\4T>\).=BT1R9;[7!_[\]E19J1--5@CB<D;Q]NKTKRA-2C(NK>\@$7
M#[S)( 9,CJ7.G+;R=P[W"P!T4&L?!VLT;KQI$U;8[L%2QFW#?RDJ1@E[4GGB
ME$5X#8"#]E7/B TPPI:TZS/1IX'?ZEDMQV)'R:S>WAW.EZFPC4J,2\Q@<0'<
M-JWP"G0DPGI@7%3(?9_R>S%X,K'7%JD,8'&Y9\"@3S2VLVG!K3AA8]ES[\DJ
M\Y6Z-$<^(]B5C7$S26.$4<K*VC\JZACUD"3813X9>_)<9O&=7>?4.9SZ5S+'
M%0FD0&*B"0_@2>OILQG.X=$O;Y4.QHR@)QJ*368"]XJ,)B,)(_V,>FI:ZL&[
M E(Q,+-,>:1G6TCL #.Q:G-\<=2RMP^6!\A$STC>+M0?1<#0&-B]]@@2G::5
M+^0TD-J<O6P1]ZJK*LFLD:H'15S[BE <+U)NYX4W;2KK/8I+P_8F=9WK"6G;
M1Z^,AL]*8R3E0>1?VA^T-ZJY^93(6MM>$<>8E1NCGC."#Y[5=S'J>H.5))4)
MCVS:\.6)<_/8LR.MCK0ZTNI(JW/JMV .1UH=:76DU9'68G)73%K;0Q0D!:??
MB5F\'J?7,]D[!WQG75/-=2F)7;"?39<V_S^"_R08EIK!>&W=ZG &@T%Y^Q46
M4. C($=1HNQEEY$*GX$,;J '$G#0(SR<B)Q>OE3*0HEX,"8HME:2Y?7;F@2#
MCB0!-!^#1)>T7A\33OIV#"^@[(_,V-:4AA@UL#3]6E(\"279-Q!Q@HXF"V@\
MSNI_H+HQ.BY%R0464C4\YC*ZN=\_1;<=9/O3A/Q:9^Q2!(3!RT']$HW+ N)H
M6[\GE-G].AG6UX9@!?<(/6L(3H4?1$0JR&6/B6S8T07"K+1>B?"5G2UN<L1-
MCKC)$3<YXISZ+9C#38ZXR1$W.>(F1XK)77IR9)*B-GF ++6L0'@&R9'AHI(=
M&79DV)%AY]2_H#D<&79DV)%A1X:+R5TI&?XL!>\WLL0_)%[U$TTC*,Z!Y7KN
M;S*?;QYO'R7\1O9[WKINE\S@G\$6R? <TZ4] ?@BLD$=E?R*)&N'1\P$PM.A
MAM.TUP-Y+I#7E> I72L]MZ.,LOD_%"2,B0 9ZAF5V..4::^7L=>+:M;0R+J+
M^C'5V<$Z8$TGE:&U&5W&_8I ?I8DN2CO%0HO@ZX#\4RD709K+^@Y$T2O';7%
MUX]YB6/LVD';$5+4%:&^U&,OL+@^>]/\ J#^K>M5ZYES-1M9T0<B;R5K"!S]
M[+L_2JLOQ'JO=;(@DILE=+.$;I;0S1(ZIWX+YG"SA&Z6T,T2NEG"8G*7GR4T
MNSF))OT2W[]F,*XP'QT1X!PXN^]RXK3Q%(/\0-7]G$#_@&XPL^UZ13',?6R\
M+Q@L&L2,[\\VKM_R!\I7N?\;Q=MW8&'T'N9X\=1,MB<:)[C9'<'*\+!9R(9)
M-(B:7_LNR')!E@NR7)#EG/HMF,,%62[(<D&6"[**R5T@R'J./_>R5]=:]IN#
M/T]F\\>OOUW=DY[YL3OF&5D4ASZZRNT " >/ 20&:^'- %.9_.;3X6KUZB_\
M3FU[\_AIYU)VC&0(%XV5EG"!%;U44Y9G0<W<[V/<':12HHNZX,L%7R[XFB?7
M!5_.J=^$.5SPY8(O%WRYX*N8W"+!E^&CRKR[E>IA'@X[SH,]>'9@UQ)NP'R&
M:M4OUU$@:>[P\*>,J.DHU65@M5WEEX;FA FGMZW+,Z]]VV@TV^WSV\NIBQVA
M"?,TLOR:M[/OQ91CPU#>[HZ'%A8\M S_2XCD1L.=9TB.H3C>]G[5,QO2E=>3
M(E[BXW5HA[$% I$,[SRSIW\:08MEY6]T,&K)&CU6A'=>;UTVS[P'JB,;S_0$
M8^+!@#X%K#6;9>*"E$)Z(K A4^@]1*C96**I\H@JCU$.M8W75"6&:PDYK>7H
MI/E:8.W=80T):@S>Q W6I]#6A)H8#(NPF$&P'08#C-Y417&2J$CH2A0.*M_,
M/PF5+N45XP4;QQ5R<ERQGSJL9)\]K-AO(/X/4$L! A0#"@    @ .9P*-]@ 
M*QU;"   "G$  !(              *2!     &5X96-U=&EO;E]L;V<N:'1M
7;%!+!08      0 ! $    "+"      ! 
end

Mime
View raw message