harmony-alerts mailing list archives

Site index · List index
Message view « Date » · « Thread »
Top « Date » · « Thread »
From nom...@intel.com
Subject [build-test alert] FAILED Windows 2003 x86: eut33
Date Wed, 08 Aug 2007 09:13:37 GMT

================================================
Eclipse Unit Tests on windows x86. Tested JRE:
================================================
Apache Harmony Launcher : (c) Copyright 1991, 2006 The Apache Software Foundation or its licensors, as applicable.
java version "1.5.0" 
pre-alpha : not complete or compatible
svn = r563025, (Aug  6 2007), Windows/ia32/msvc 1310, release build
http://harmony.apache.org


JRE options: -showversion -Xmx1024m -XX:vm.assert_dialog=false
===============================

Unexpected failures (20):

Testcase: org.eclipse.jdt.core.tests.builder.IncrementalTests.testRenameMainType:
junit.framework.ComparisonFailure: Invalid problem(s)!!!.
----------- Expected ------------
Problem : The public type _A must be defined in its own file [ resource : </Project/src/p/A.java> range : <25,27> category : <40> severity : <2>]
Problem : A cannot be resolved to a type [ resource : </Project/src/p/B.java> range : <35,36> category : <40> severity : <2>]
Problem : The hierarchy of the type C is inconsistent [ resource : </Project/src/p/C.java> range : <25,26> category : <40> severity : <2>]
------------ but was ------------
Problem : The hierarchy of the type C is inconsistent [ resource : </Project/src/p/C.java> range : <25,26> category : <40> severity : <2>]
Problem : A cannot be resolved to a type [ resource : </Project/src/p/B.java> range : <35,36> category : <40> severity : <2>]
Problem : The public type _A must be defined in its own file [ resource : </Project/src/p/A.java> range : <25,27> category : <40> severity : <2>]
--------- Difference is ----------
 expected:<Problem : The [public type _A must be defined in its own file [ resource : </Project/src/p/A.java> range : <25,27> category : <40> severity : <2>]
Problem : A cannot be resolved to a type [ resource : </Project/src/p/B.java> range : <35,36> category : <40> severity : <2>]
Problem : The hierarchy of the type C is inconsistent [ resource : </Project/src/p/C.java> range : <25,26]> category : <40> se...> but was:<Problem : The [hierarchy of the type C is inconsistent [ resource : </Project/src/p/C.java> range : <25,26> category : <40> severity : <2>]
Problem : A cannot be resolved to a type [ resource : </Project/src/p/B.java> range : <35,36> category : <40> severity : <2>]
Problem : The public type _A must be defined in its own file [ resource : </Project/src/p/A.java> range : <25,27]> category : <40> se...>
	at org.eclipse.jdt.core.tests.junit.extension.TestCase.assertStringEquals(TestCase.java:234)
	at org.eclipse.jdt.core.tests.junit.extension.TestCase.assumeEquals(TestCase.java:254)
	at org.eclipse.jdt.core.tests.builder.BuilderTests.expectingProblemsFor(BuilderTests.java:307)
	at org.eclipse.jdt.core.tests.builder.IncrementalTests.testRenameMainType(IncrementalTests.java:189)
	at java.lang.reflect.VMReflection.invokeMethod(VMReflection.java)
	at org.eclipse.test.EclipseTestRunner.run(EclipseTestRunner.java:354)
	at org.eclipse.test.EclipseTestRunner.run(EclipseTestRunner.java:206)
	at org.eclipse.test.CoreTestApplication.runTests(CoreTestApplication.java:35)
	at org.eclipse.test.CoreTestApplication.run(CoreTestApplication.java:31)
	at java.lang.reflect.VMReflection.invokeMethod(VMReflection.java)
	at org.eclipse.equinox.internal.app.EclipseAppContainer.callMethod(EclipseAppContainer.java:533)
	at org.eclipse.equinox.internal.app.EclipseAppHandle.run(EclipseAppHandle.java:155)
	at org.eclipse.core.runtime.internal.adaptor.EclipseAppLauncher.runApplication(EclipseAppLauncher.java:106)
	at org.eclipse.core.runtime.internal.adaptor.EclipseAppLauncher.start(EclipseAppLauncher.java:76)
	at org.eclipse.core.runtime.adaptor.EclipseStarter.run(EclipseStarter.java:363)
	at org.eclipse.core.runtime.adaptor.EclipseStarter.run(EclipseStarter.java:176)
	at java.lang.reflect.VMReflection.invokeMethod(VMReflection.java)
	at org.eclipse.equinox.launcher.Main.invokeFramework(Main.java:504)
	at org.eclipse.equinox.launcher.Main.basicRun(Main.java:443)
	at org.eclipse.equinox.launcher.Main.run(Main.java:1169)
	at org.eclipse.equinox.launcher.Main.main(Main.java:1144)
	at org.eclipse.core.launcher.Main.main(Main.java:30)

Testcase: org.eclipse.jdt.core.tests.compiler.parser.ParserTest.test027 - 1.3:
junit.framework.ComparisonFailure: Invalid problem log .
----------- Expected ------------
----------\n
1. ERROR in X.java (at line 19)\n
	catch (\n
	      ^\n
Syntax error on token "(", FormalParameter expected after this token\n
----------\n
------------ but was ------------
----------\n
1. ERROR in X.java (at line 4)\n
	import org.xml.sax.SAXException;\n
	       ^^^^^^^\n
The import org.xml cannot be resolved\n
----------\n
2. ERROR in X.java (at line 6)\n
	public void doSomething() throws FileNotFoundException, EOFException, SAXException{\n
	                                                                      ^^^^^^^^^^^^\n
SAXException cannot be resolved to a type\n
----------\n
3. ERROR in X.java (at line 19)\n
	catch (\n
	      ^\n
Syntax error on token "(", FormalParameter expected after this token\n
----------\n
--------- Difference is ----------
 expected:<... in X.java (at line []19)\n
	catch (\n
	  ...> but was:<... in X.java (at line [4)\n
	import org.xml.sax.SAXException;\n
	       ^^^^^^^\n
The import org.xml cannot be resolved\n
----------\n
2. ERROR in X.java (at line 6)\n
	public void doSomething() throws FileNotFoundException, EOFException, SAXException{\n
	                                                                      ^^^^^^^^^^^^\n
SAXException cannot be resolved to a type\n
----------\n
3. ERROR in X.java (at line ]19)\n
	catch (\n
	  ...>
	at org.eclipse.jdt.core.tests.junit.extension.TestCase.assertStringEquals(TestCase.java:226)
	at org.eclipse.jdt.core.tests.junit.extension.TestCase.assertEquals(TestCase.java:201)
	at org.eclipse.jdt.core.tests.compiler.regression.AbstractRegressionTest.runNegativeTest(AbstractRegressionTest.java:1123)
	at org.eclipse.jdt.core.tests.compiler.regression.AbstractRegressionTest.runNegativeTest(AbstractRegressionTest.java:999)
	at org.eclipse.jdt.core.tests.compiler.regression.AbstractRegressionTest.runNegativeTest(AbstractRegressionTest.java:978)
	at org.eclipse.jdt.core.tests.compiler.parser.ParserTest.test027(ParserTest.java:715)
	at java.lang.reflect.VMReflection.invokeMethod(VMReflection.java)
	at junit.extensions.TestDecorator.basicRun(TestDecorator.java:24)
	at junit.extensions.TestDecorator.run(TestDecorator.java:30)
	at org.eclipse.jdt.core.tests.util.CompilerTestSetup.run(CompilerTestSetup.java:48)
	at org.eclipse.test.EclipseTestRunner.run(EclipseTestRunner.java:354)
	at org.eclipse.test.EclipseTestRunner.run(EclipseTestRunner.java:206)
	at org.eclipse.test.CoreTestApplication.runTests(CoreTestApplication.java:35)
	at org.eclipse.test.CoreTestApplication.run(CoreTestApplication.java:31)
	at java.lang.reflect.VMReflection.invokeMethod(VMReflection.java)
	at org.eclipse.equinox.internal.app.EclipseAppContainer.callMethod(EclipseAppContainer.java:533)
	at org.eclipse.equinox.internal.app.EclipseAppHandle.run(EclipseAppHandle.java:155)
	at org.eclipse.core.runtime.internal.adaptor.EclipseAppLauncher.runApplication(EclipseAppLauncher.java:106)
	at org.eclipse.core.runtime.internal.adaptor.EclipseAppLauncher.start(EclipseAppLauncher.java:76)
	at org.eclipse.core.runtime.adaptor.EclipseStarter.run(EclipseStarter.java:363)
	at org.eclipse.core.runtime.adaptor.EclipseStarter.run(EclipseStarter.java:176)
	at java.lang.reflect.VMReflection.invokeMethod(VMReflection.java)
	at org.eclipse.equinox.launcher.Main.invokeFramework(Main.java:504)
	at org.eclipse.equinox.launcher.Main.basicRun(Main.java:443)
	at org.eclipse.equinox.launcher.Main.run(Main.java:1169)
	at org.eclipse.equinox.launcher.Main.main(Main.java:1144)
	at org.eclipse.core.launcher.Main.main(Main.java:30)

Testcase: org.eclipse.jdt.core.tests.compiler.parser.ParserTest.test027 - 1.4:
junit.framework.ComparisonFailure: Invalid problem log .
----------- Expected ------------
----------\n
1. ERROR in X.java (at line 19)\n
	catch (\n
	      ^\n
Syntax error on token "(", FormalParameter expected after this token\n
----------\n
------------ but was ------------
----------\n
1. ERROR in X.java (at line 4)\n
	import org.xml.sax.SAXException;\n
	       ^^^^^^^\n
The import org.xml cannot be resolved\n
----------\n
2. ERROR in X.java (at line 6)\n
	public void doSomething() throws FileNotFoundException, EOFException, SAXException{\n
	                                                                      ^^^^^^^^^^^^\n
SAXException cannot be resolved to a type\n
----------\n
3. ERROR in X.java (at line 19)\n
	catch (\n
	      ^\n
Syntax error on token "(", FormalParameter expected after this token\n
----------\n
--------- Difference is ----------
 expected:<... in X.java (at line []19)\n
	catch (\n
	  ...> but was:<... in X.java (at line [4)\n
	import org.xml.sax.SAXException;\n
	       ^^^^^^^\n
The import org.xml cannot be resolved\n
----------\n
2. ERROR in X.java (at line 6)\n
	public void doSomething() throws FileNotFoundException, EOFException, SAXException{\n
	                                                                      ^^^^^^^^^^^^\n
SAXException cannot be resolved to a type\n
----------\n
3. ERROR in X.java (at line ]19)\n
	catch (\n
	  ...>
	at org.eclipse.jdt.core.tests.junit.extension.TestCase.assertStringEquals(TestCase.java:226)
	at org.eclipse.jdt.core.tests.junit.extension.TestCase.assertEquals(TestCase.java:201)
	at org.eclipse.jdt.core.tests.compiler.regression.AbstractRegressionTest.runNegativeTest(AbstractRegressionTest.java:1123)
	at org.eclipse.jdt.core.tests.compiler.regression.AbstractRegressionTest.runNegativeTest(AbstractRegressionTest.java:999)
	at org.eclipse.jdt.core.tests.compiler.regression.AbstractRegressionTest.runNegativeTest(AbstractRegressionTest.java:978)
	at org.eclipse.jdt.core.tests.compiler.parser.ParserTest.test027(ParserTest.java:715)
	at java.lang.reflect.VMReflection.invokeMethod(VMReflection.java)
	at junit.extensions.TestDecorator.basicRun(TestDecorator.java:24)
	at junit.extensions.TestDecorator.run(TestDecorator.java:30)
	at org.eclipse.jdt.core.tests.util.CompilerTestSetup.run(CompilerTestSetup.java:48)
	at org.eclipse.test.EclipseTestRunner.run(EclipseTestRunner.java:354)
	at org.eclipse.test.EclipseTestRunner.run(EclipseTestRunner.java:206)
	at org.eclipse.test.CoreTestApplication.runTests(CoreTestApplication.java:35)
	at org.eclipse.test.CoreTestApplication.run(CoreTestApplication.java:31)
	at java.lang.reflect.VMReflection.invokeMethod(VMReflection.java)
	at org.eclipse.equinox.internal.app.EclipseAppContainer.callMethod(EclipseAppContainer.java:533)
	at org.eclipse.equinox.internal.app.EclipseAppHandle.run(EclipseAppHandle.java:155)
	at org.eclipse.core.runtime.internal.adaptor.EclipseAppLauncher.runApplication(EclipseAppLauncher.java:106)
	at org.eclipse.core.runtime.internal.adaptor.EclipseAppLauncher.start(EclipseAppLauncher.java:76)
	at org.eclipse.core.runtime.adaptor.EclipseStarter.run(EclipseStarter.java:363)
	at org.eclipse.core.runtime.adaptor.EclipseStarter.run(EclipseStarter.java:176)
	at java.lang.reflect.VMReflection.invokeMethod(VMReflection.java)
	at org.eclipse.equinox.launcher.Main.invokeFramework(Main.java:504)
	at org.eclipse.equinox.launcher.Main.basicRun(Main.java:443)
	at org.eclipse.equinox.launcher.Main.run(Main.java:1169)
	at org.eclipse.equinox.launcher.Main.main(Main.java:1144)
	at org.eclipse.core.launcher.Main.main(Main.java:30)

Testcase: org.eclipse.jdt.core.tests.compiler.parser.ParserTest.test027 - 1.5:
junit.framework.ComparisonFailure: Invalid problem log .
----------- Expected ------------
----------\n
1. ERROR in X.java (at line 19)\n
	catch (\n
	      ^\n
Syntax error on token "(", FormalParameter expected after this token\n
----------\n
------------ but was ------------
----------\n
1. ERROR in X.java (at line 4)\n
	import org.xml.sax.SAXException;\n
	       ^^^^^^^\n
The import org.xml cannot be resolved\n
----------\n
2. ERROR in X.java (at line 6)\n
	public void doSomething() throws FileNotFoundException, EOFException, SAXException{\n
	                                                                      ^^^^^^^^^^^^\n
SAXException cannot be resolved to a type\n
----------\n
3. ERROR in X.java (at line 19)\n
	catch (\n
	      ^\n
Syntax error on token "(", FormalParameter expected after this token\n
----------\n
--------- Difference is ----------
 expected:<... in X.java (at line []19)\n
	catch (\n
	  ...> but was:<... in X.java (at line [4)\n
	import org.xml.sax.SAXException;\n
	       ^^^^^^^\n
The import org.xml cannot be resolved\n
----------\n
2. ERROR in X.java (at line 6)\n
	public void doSomething() throws FileNotFoundException, EOFException, SAXException{\n
	                                                                      ^^^^^^^^^^^^\n
SAXException cannot be resolved to a type\n
----------\n
3. ERROR in X.java (at line ]19)\n
	catch (\n
	  ...>
	at org.eclipse.jdt.core.tests.junit.extension.TestCase.assertStringEquals(TestCase.java:225)
	at org.eclipse.jdt.core.tests.junit.extension.TestCase.assertEquals(TestCase.java:201)
	at org.eclipse.jdt.core.tests.compiler.regression.AbstractRegressionTest.runNegativeTest(AbstractRegressionTest.java:1123)
	at org.eclipse.jdt.core.tests.compiler.regression.AbstractRegressionTest.runNegativeTest(AbstractRegressionTest.java:999)
	at org.eclipse.jdt.core.tests.compiler.regression.AbstractRegressionTest.runNegativeTest(AbstractRegressionTest.java:978)
	at org.eclipse.jdt.core.tests.compiler.parser.ParserTest.test027(ParserTest.java:715)
	at java.lang.reflect.VMReflection.invokeMethod(VMReflection.java)
	at junit.extensions.TestDecorator.basicRun(TestDecorator.java:24)
	at junit.extensions.TestDecorator.run(TestDecorator.java:30)
	at org.eclipse.jdt.core.tests.util.CompilerTestSetup.run(CompilerTestSetup.java:48)
	at org.eclipse.test.EclipseTestRunner.run(EclipseTestRunner.java:354)
	at org.eclipse.test.EclipseTestRunner.run(EclipseTestRunner.java:206)
	at org.eclipse.test.CoreTestApplication.runTests(CoreTestApplication.java:35)
	at org.eclipse.test.CoreTestApplication.run(CoreTestApplication.java:31)
	at java.lang.reflect.VMReflection.invokeMethod(VMReflection.java)
	at org.eclipse.equinox.internal.app.EclipseAppContainer.callMethod(EclipseAppContainer.java:533)
	at org.eclipse.equinox.internal.app.EclipseAppHandle.run(EclipseAppHandle.java:155)
	at org.eclipse.core.runtime.internal.adaptor.EclipseAppLauncher.runApplication(EclipseAppLauncher.java:106)
	at org.eclipse.core.runtime.internal.adaptor.EclipseAppLauncher.start(EclipseAppLauncher.java:76)
	at org.eclipse.core.runtime.adaptor.EclipseStarter.run(EclipseStarter.java:363)
	at org.eclipse.core.runtime.adaptor.EclipseStarter.run(EclipseStarter.java:176)
	at java.lang.reflect.VMReflection.invokeMethod(VMReflection.java)
	at org.eclipse.equinox.launcher.Main.invokeFramework(Main.java:504)
	at org.eclipse.equinox.launcher.Main.basicRun(Main.java:443)
	at org.eclipse.equinox.launcher.Main.run(Main.java:1169)
	at org.eclipse.equinox.launcher.Main.main(Main.java:1144)
	at org.eclipse.core.launcher.Main.main(Main.java:30)

Testcase: org.eclipse.jdt.core.tests.compiler.regression.LookupTest.test017 - 1.3:
junit.framework.AssertionFailedError: Unexpected target error running resulting class file for p1/A.java:
The GC did not provide gc_add_weak_root_set_entry()
	at org.eclipse.jdt.core.tests.compiler.regression.AbstractRegressionTest.runConformTest(AbstractRegressionTest.java:658)
	at org.eclipse.jdt.core.tests.compiler.regression.AbstractRegressionTest.runConformTest(AbstractRegressionTest.java:515)
	at org.eclipse.jdt.core.tests.compiler.regression.LookupTest.test017(LookupTest.java:571)
	at java.lang.reflect.VMReflection.invokeMethod(VMReflection.java)
	at junit.extensions.TestDecorator.basicRun(TestDecorator.java:24)
	at junit.extensions.TestDecorator.run(TestDecorator.java:30)
	at org.eclipse.jdt.core.tests.util.CompilerTestSetup.run(CompilerTestSetup.java:48)
	at org.eclipse.test.EclipseTestRunner.run(EclipseTestRunner.java:354)
	at org.eclipse.test.EclipseTestRunner.run(EclipseTestRunner.java:206)
	at org.eclipse.test.CoreTestApplication.runTests(CoreTestApplication.java:35)
	at org.eclipse.test.CoreTestApplication.run(CoreTestApplication.java:31)
	at java.lang.reflect.VMReflection.invokeMethod(VMReflection.java)
	at org.eclipse.equinox.internal.app.EclipseAppContainer.callMethod(EclipseAppContainer.java:533)
	at org.eclipse.equinox.internal.app.EclipseAppHandle.run(EclipseAppHandle.java:155)
	at org.eclipse.core.runtime.internal.adaptor.EclipseAppLauncher.runApplication(EclipseAppLauncher.java:106)
	at org.eclipse.core.runtime.internal.adaptor.EclipseAppLauncher.start(EclipseAppLauncher.java:76)
	at org.eclipse.core.runtime.adaptor.EclipseStarter.run(EclipseStarter.java:363)
	at org.eclipse.core.runtime.adaptor.EclipseStarter.run(EclipseStarter.java:176)
	at java.lang.reflect.VMReflection.invokeMethod(VMReflection.java)
	at org.eclipse.equinox.launcher.Main.invokeFramework(Main.java:504)
	at org.eclipse.equinox.launcher.Main.basicRun(Main.java:443)
	at org.eclipse.equinox.launcher.Main.run(Main.java:1169)
	at org.eclipse.equinox.launcher.Main.main(Main.java:1144)
	at org.eclipse.core.launcher.Main.main(Main.java:30)

Testcase: org.eclipse.jdt.core.tests.compiler.regression.XLargeTest.test001 - 1.3:
junit.framework.AssertionFailedError: Unexpected target error running resulting class file for X.java:
The GC did not provide gc_add_weak_root_set_entry()
	at org.eclipse.jdt.core.tests.compiler.regression.AbstractRegressionTest.runConformTest(AbstractRegressionTest.java:658)
	at org.eclipse.jdt.core.tests.compiler.regression.AbstractRegressionTest.runConformTest(AbstractRegressionTest.java:515)
	at org.eclipse.jdt.core.tests.compiler.regression.XLargeTest.test001(XLargeTest.java:30)
	at java.lang.reflect.VMReflection.invokeMethod(VMReflection.java)
	at junit.extensions.TestDecorator.basicRun(TestDecorator.java:24)
	at junit.extensions.TestDecorator.run(TestDecorator.java:30)
	at org.eclipse.jdt.core.tests.util.CompilerTestSetup.run(CompilerTestSetup.java:48)
	at org.eclipse.test.EclipseTestRunner.run(EclipseTestRunner.java:354)
	at org.eclipse.test.EclipseTestRunner.run(EclipseTestRunner.java:206)
	at org.eclipse.test.CoreTestApplication.runTests(CoreTestApplication.java:35)
	at org.eclipse.test.CoreTestApplication.run(CoreTestApplication.java:31)
	at java.lang.reflect.VMReflection.invokeMethod(VMReflection.java)
	at org.eclipse.equinox.internal.app.EclipseAppContainer.callMethod(EclipseAppContainer.java:533)
	at org.eclipse.equinox.internal.app.EclipseAppHandle.run(EclipseAppHandle.java:155)
	at org.eclipse.core.runtime.internal.adaptor.EclipseAppLauncher.runApplication(EclipseAppLauncher.java:106)
	at org.eclipse.core.runtime.internal.adaptor.EclipseAppLauncher.start(EclipseAppLauncher.java:76)
	at org.eclipse.core.runtime.adaptor.EclipseStarter.run(EclipseStarter.java:363)
	at org.eclipse.core.runtime.adaptor.EclipseStarter.run(EclipseStarter.java:176)
	at java.lang.reflect.VMReflection.invokeMethod(VMReflection.java)
	at org.eclipse.equinox.launcher.Main.invokeFramework(Main.java:504)
	at org.eclipse.equinox.launcher.Main.basicRun(Main.java:443)
	at org.eclipse.equinox.launcher.Main.run(Main.java:1169)
	at org.eclipse.equinox.launcher.Main.main(Main.java:1144)
	at org.eclipse.core.launcher.Main.main(Main.java:30)

Testcase: org.eclipse.jdt.core.tests.compiler.regression.RuntimeTests.test0600_reflection - 1.3:
junit.framework.AssertionFailedError: Unexpected output running resulting class file for X.java:
--[START]--
SUCCESS
SUCCESS
---[END]---
	at org.eclipse.jdt.core.tests.compiler.regression.AbstractRegressionTest.runConformTest(AbstractRegressionTest.java:658)
	at org.eclipse.jdt.core.tests.compiler.regression.AbstractRegressionTest.runConformTest(AbstractRegressionTest.java:515)
	at org.eclipse.jdt.core.tests.compiler.regression.RuntimeTests.test0600_reflection(RuntimeTests.java:130)
	at java.lang.reflect.VMReflection.invokeMethod(VMReflection.java)
	at junit.extensions.TestDecorator.basicRun(TestDecorator.java:24)
	at junit.extensions.TestDecorator.run(TestDecorator.java:30)
	at org.eclipse.jdt.core.tests.util.CompilerTestSetup.run(CompilerTestSetup.java:48)
	at org.eclipse.test.EclipseTestRunner.run(EclipseTestRunner.java:354)
	at org.eclipse.test.EclipseTestRunner.run(EclipseTestRunner.java:206)
	at org.eclipse.test.CoreTestApplication.runTests(CoreTestApplication.java:35)
	at org.eclipse.test.CoreTestApplication.run(CoreTestApplication.java:31)
	at java.lang.reflect.VMReflection.invokeMethod(VMReflection.java)
	at org.eclipse.equinox.internal.app.EclipseAppContainer.callMethod(EclipseAppContainer.java:533)
	at org.eclipse.equinox.internal.app.EclipseAppHandle.run(EclipseAppHandle.java:155)
	at org.eclipse.core.runtime.internal.adaptor.EclipseAppLauncher.runApplication(EclipseAppLauncher.java:106)
	at org.eclipse.core.runtime.internal.adaptor.EclipseAppLauncher.start(EclipseAppLauncher.java:76)
	at org.eclipse.core.runtime.adaptor.EclipseStarter.run(EclipseStarter.java:363)
	at org.eclipse.core.runtime.adaptor.EclipseStarter.run(EclipseStarter.java:176)
	at java.lang.reflect.VMReflection.invokeMethod(VMReflection.java)
	at org.eclipse.equinox.launcher.Main.invokeFramework(Main.java:504)
	at org.eclipse.equinox.launcher.Main.basicRun(Main.java:443)
	at org.eclipse.equinox.launcher.Main.run(Main.java:1169)
	at org.eclipse.equinox.launcher.Main.main(Main.java:1144)
	at org.eclipse.core.launcher.Main.main(Main.java:30)

Testcase: org.eclipse.jdt.core.tests.compiler.regression.RuntimeTests.test0601_reflection - 1.3:
junit.framework.AssertionFailedError: Unexpected output running resulting class file for X.java:
--[START]--
SUCCESS
SUCCESS
---[END]---
	at org.eclipse.jdt.core.tests.compiler.regression.AbstractRegressionTest.runConformTest(AbstractRegressionTest.java:658)
	at org.eclipse.jdt.core.tests.compiler.regression.AbstractRegressionTest.runConformTest(AbstractRegressionTest.java:515)
	at org.eclipse.jdt.core.tests.compiler.regression.RuntimeTests.test0601_reflection(RuntimeTests.java:172)
	at java.lang.reflect.VMReflection.invokeMethod(VMReflection.java)
	at junit.extensions.TestDecorator.basicRun(TestDecorator.java:24)
	at junit.extensions.TestDecorator.run(TestDecorator.java:30)
	at org.eclipse.jdt.core.tests.util.CompilerTestSetup.run(CompilerTestSetup.java:48)
	at org.eclipse.test.EclipseTestRunner.run(EclipseTestRunner.java:354)
	at org.eclipse.test.EclipseTestRunner.run(EclipseTestRunner.java:206)
	at org.eclipse.test.CoreTestApplication.runTests(CoreTestApplication.java:35)
	at org.eclipse.test.CoreTestApplication.run(CoreTestApplication.java:31)
	at java.lang.reflect.VMReflection.invokeMethod(VMReflection.java)
	at org.eclipse.equinox.internal.app.EclipseAppContainer.callMethod(EclipseAppContainer.java:533)
	at org.eclipse.equinox.internal.app.EclipseAppHandle.run(EclipseAppHandle.java:155)
	at org.eclipse.core.runtime.internal.adaptor.EclipseAppLauncher.runApplication(EclipseAppLauncher.java:106)
	at org.eclipse.core.runtime.internal.adaptor.EclipseAppLauncher.start(EclipseAppLauncher.java:76)
	at org.eclipse.core.runtime.adaptor.EclipseStarter.run(EclipseStarter.java:363)
	at org.eclipse.core.runtime.adaptor.EclipseStarter.run(EclipseStarter.java:176)
	at java.lang.reflect.VMReflection.invokeMethod(VMReflection.java)
	at org.eclipse.equinox.launcher.Main.invokeFramework(Main.java:504)
	at org.eclipse.equinox.launcher.Main.basicRun(Main.java:443)
	at org.eclipse.equinox.launcher.Main.run(Main.java:1169)
	at org.eclipse.equinox.launcher.Main.main(Main.java:1144)
	at org.eclipse.core.launcher.Main.main(Main.java:30)

Testcase: org.eclipse.jdt.core.tests.compiler.regression.LookupTest.test016 - 1.4:
junit.framework.AssertionFailedError: Unexpected target error running resulting class file for pack1/Outer.java:
The GC did not provide gc_add_weak_root_set_entry()
	at org.eclipse.jdt.core.tests.compiler.regression.AbstractRegressionTest.runConformTest(AbstractRegressionTest.java:658)
	at org.eclipse.jdt.core.tests.compiler.regression.AbstractRegressionTest.runConformTest(AbstractRegressionTest.java:503)
	at org.eclipse.jdt.core.tests.compiler.regression.LookupTest.test016(LookupTest.java:523)
	at java.lang.reflect.VMReflection.invokeMethod(VMReflection.java)
	at junit.extensions.TestDecorator.basicRun(TestDecorator.java:24)
	at junit.extensions.TestDecorator.run(TestDecorator.java:30)
	at org.eclipse.jdt.core.tests.util.CompilerTestSetup.run(CompilerTestSetup.java:48)
	at org.eclipse.test.EclipseTestRunner.run(EclipseTestRunner.java:354)
	at org.eclipse.test.EclipseTestRunner.run(EclipseTestRunner.java:206)
	at org.eclipse.test.CoreTestApplication.runTests(CoreTestApplication.java:35)
	at org.eclipse.test.CoreTestApplication.run(CoreTestApplication.java:31)
	at java.lang.reflect.VMReflection.invokeMethod(VMReflection.java)
	at org.eclipse.equinox.internal.app.EclipseAppContainer.callMethod(EclipseAppContainer.java:533)
	at org.eclipse.equinox.internal.app.EclipseAppHandle.run(EclipseAppHandle.java:155)
	at org.eclipse.core.runtime.internal.adaptor.EclipseAppLauncher.runApplication(EclipseAppLauncher.java:106)
	at org.eclipse.core.runtime.internal.adaptor.EclipseAppLauncher.start(EclipseAppLauncher.java:76)
	at org.eclipse.core.runtime.adaptor.EclipseStarter.run(EclipseStarter.java:363)
	at org.eclipse.core.runtime.adaptor.EclipseStarter.run(EclipseStarter.java:176)
	at java.lang.reflect.VMReflection.invokeMethod(VMReflection.java)
	at org.eclipse.equinox.launcher.Main.invokeFramework(Main.java:504)
	at org.eclipse.equinox.launcher.Main.basicRun(Main.java:443)
	at org.eclipse.equinox.launcher.Main.run(Main.java:1169)
	at org.eclipse.equinox.launcher.Main.main(Main.java:1144)
	at org.eclipse.core.launcher.Main.main(Main.java:30)

Testcase: org.eclipse.jdt.core.tests.compiler.regression.TryStatementTest.test052 - 1.4:
junit.framework.AssertionFailedError: Unexpected target error running resulting class file for X.java:
The GC did not provide gc_add_weak_root_set_entry()
	at org.eclipse.jdt.core.tests.compiler.regression.AbstractRegressionTest.runConformTest(AbstractRegressionTest.java:658)
	at org.eclipse.jdt.core.tests.compiler.regression.AbstractRegressionTest.runConformTest(AbstractRegressionTest.java:515)
	at org.eclipse.jdt.core.tests.compiler.regression.TryStatementTest.test052(TryStatementTest.java:4745)
	at java.lang.reflect.VMReflection.invokeMethod(VMReflection.java)
	at junit.extensions.TestDecorator.basicRun(TestDecorator.java:24)
	at junit.extensions.TestDecorator.run(TestDecorator.java:30)
	at org.eclipse.jdt.core.tests.util.CompilerTestSetup.run(CompilerTestSetup.java:48)
	at org.eclipse.test.EclipseTestRunner.run(EclipseTestRunner.java:354)
	at org.eclipse.test.EclipseTestRunner.run(EclipseTestRunner.java:206)
	at org.eclipse.test.CoreTestApplication.runTests(CoreTestApplication.java:35)
	at org.eclipse.test.CoreTestApplication.run(CoreTestApplication.java:31)
	at java.lang.reflect.VMReflection.invokeMethod(VMReflection.java)
	at org.eclipse.equinox.internal.app.EclipseAppContainer.callMethod(EclipseAppContainer.java:533)
	at org.eclipse.equinox.internal.app.EclipseAppHandle.run(EclipseAppHandle.java:155)
	at org.eclipse.core.runtime.internal.adaptor.EclipseAppLauncher.runApplication(EclipseAppLauncher.java:106)
	at org.eclipse.core.runtime.internal.adaptor.EclipseAppLauncher.start(EclipseAppLauncher.java:76)
	at org.eclipse.core.runtime.adaptor.EclipseStarter.run(EclipseStarter.java:363)
	at org.eclipse.core.runtime.adaptor.EclipseStarter.run(EclipseStarter.java:176)
	at java.lang.reflect.VMReflection.invokeMethod(VMReflection.java)
	at org.eclipse.equinox.launcher.Main.invokeFramework(Main.java:504)
	at org.eclipse.equinox.launcher.Main.basicRun(Main.java:443)
	at org.eclipse.equinox.launcher.Main.run(Main.java:1169)
	at org.eclipse.equinox.launcher.Main.main(Main.java:1144)
	at org.eclipse.core.launcher.Main.main(Main.java:30)

Testcase: org.eclipse.jdt.core.tests.compiler.regression.RuntimeTests.test0600_reflection - 1.4:
junit.framework.AssertionFailedError: Unexpected output running resulting class file for X.java:
--[START]--
SUCCESS
SUCCESS
---[END]---
	at org.eclipse.jdt.core.tests.compiler.regression.AbstractRegressionTest.runConformTest(AbstractRegressionTest.java:658)
	at org.eclipse.jdt.core.tests.compiler.regression.AbstractRegressionTest.runConformTest(AbstractRegressionTest.java:515)
	at org.eclipse.jdt.core.tests.compiler.regression.RuntimeTests.test0600_reflection(RuntimeTests.java:130)
	at java.lang.reflect.VMReflection.invokeMethod(VMReflection.java)
	at junit.extensions.TestDecorator.basicRun(TestDecorator.java:24)
	at junit.extensions.TestDecorator.run(TestDecorator.java:30)
	at org.eclipse.jdt.core.tests.util.CompilerTestSetup.run(CompilerTestSetup.java:48)
	at org.eclipse.test.EclipseTestRunner.run(EclipseTestRunner.java:354)
	at org.eclipse.test.EclipseTestRunner.run(EclipseTestRunner.java:206)
	at org.eclipse.test.CoreTestApplication.runTests(CoreTestApplication.java:35)
	at org.eclipse.test.CoreTestApplication.run(CoreTestApplication.java:31)
	at java.lang.reflect.VMReflection.invokeMethod(VMReflection.java)
	at org.eclipse.equinox.internal.app.EclipseAppContainer.callMethod(EclipseAppContainer.java:533)
	at org.eclipse.equinox.internal.app.EclipseAppHandle.run(EclipseAppHandle.java:155)
	at org.eclipse.core.runtime.internal.adaptor.EclipseAppLauncher.runApplication(EclipseAppLauncher.java:106)
	at org.eclipse.core.runtime.internal.adaptor.EclipseAppLauncher.start(EclipseAppLauncher.java:76)
	at org.eclipse.core.runtime.adaptor.EclipseStarter.run(EclipseStarter.java:363)
	at org.eclipse.core.runtime.adaptor.EclipseStarter.run(EclipseStarter.java:176)
	at java.lang.reflect.VMReflection.invokeMethod(VMReflection.java)
	at org.eclipse.equinox.launcher.Main.invokeFramework(Main.java:504)
	at org.eclipse.equinox.launcher.Main.basicRun(Main.java:443)
	at org.eclipse.equinox.launcher.Main.run(Main.java:1169)
	at org.eclipse.equinox.launcher.Main.main(Main.java:1144)
	at org.eclipse.core.launcher.Main.main(Main.java:30)

Testcase: org.eclipse.jdt.core.tests.compiler.regression.RuntimeTests.test0601_reflection - 1.4:
junit.framework.AssertionFailedError: Unexpected output running resulting class file for X.java:
--[START]--
SUCCESS
SUCCESS
---[END]---
	at org.eclipse.jdt.core.tests.compiler.regression.AbstractRegressionTest.runConformTest(AbstractRegressionTest.java:658)
	at org.eclipse.jdt.core.tests.compiler.regression.AbstractRegressionTest.runConformTest(AbstractRegressionTest.java:515)
	at org.eclipse.jdt.core.tests.compiler.regression.RuntimeTests.test0601_reflection(RuntimeTests.java:172)
	at java.lang.reflect.VMReflection.invokeMethod(VMReflection.java)
	at junit.extensions.TestDecorator.basicRun(TestDecorator.java:24)
	at junit.extensions.TestDecorator.run(TestDecorator.java:30)
	at org.eclipse.jdt.core.tests.util.CompilerTestSetup.run(CompilerTestSetup.java:48)
	at org.eclipse.test.EclipseTestRunner.run(EclipseTestRunner.java:354)
	at org.eclipse.test.EclipseTestRunner.run(EclipseTestRunner.java:206)
	at org.eclipse.test.CoreTestApplication.runTests(CoreTestApplication.java:35)
	at org.eclipse.test.CoreTestApplication.run(CoreTestApplication.java:31)
	at java.lang.reflect.VMReflection.invokeMethod(VMReflection.java)
	at org.eclipse.equinox.internal.app.EclipseAppContainer.callMethod(EclipseAppContainer.java:533)
	at org.eclipse.equinox.internal.app.EclipseAppHandle.run(EclipseAppHandle.java:155)
	at org.eclipse.core.runtime.internal.adaptor.EclipseAppLauncher.runApplication(EclipseAppLauncher.java:106)
	at org.eclipse.core.runtime.internal.adaptor.EclipseAppLauncher.start(EclipseAppLauncher.java:76)
	at org.eclipse.core.runtime.adaptor.EclipseStarter.run(EclipseStarter.java:363)
	at org.eclipse.core.runtime.adaptor.EclipseStarter.run(EclipseStarter.java:176)
	at java.lang.reflect.VMReflection.invokeMethod(VMReflection.java)
	at org.eclipse.equinox.launcher.Main.invokeFramework(Main.java:504)
	at org.eclipse.equinox.launcher.Main.basicRun(Main.java:443)
	at org.eclipse.equinox.launcher.Main.run(Main.java:1169)
	at org.eclipse.equinox.launcher.Main.main(Main.java:1144)
	at org.eclipse.core.launcher.Main.main(Main.java:30)

Testcase: org.eclipse.jdt.core.tests.compiler.regression.LookupTest.test005 - 1.5:
junit.framework.AssertionFailedError: Unexpected target error running resulting class file for p1/A.java:
The GC did not provide gc_add_weak_root_set_entry()
	at org.eclipse.jdt.core.tests.compiler.regression.AbstractRegressionTest.runConformTest(AbstractRegressionTest.java:658)
	at org.eclipse.jdt.core.tests.compiler.regression.AbstractRegressionTest.runConformTest(AbstractRegressionTest.java:515)
	at org.eclipse.jdt.core.tests.compiler.regression.LookupTest.test005(LookupTest.java:170)
	at java.lang.reflect.VMReflection.invokeMethod(VMReflection.java)
	at junit.extensions.TestDecorator.basicRun(TestDecorator.java:24)
	at junit.extensions.TestDecorator.run(TestDecorator.java:30)
	at org.eclipse.jdt.core.tests.util.CompilerTestSetup.run(CompilerTestSetup.java:48)
	at org.eclipse.test.EclipseTestRunner.run(EclipseTestRunner.java:354)
	at org.eclipse.test.EclipseTestRunner.run(EclipseTestRunner.java:206)
	at org.eclipse.test.CoreTestApplication.runTests(CoreTestApplication.java:35)
	at org.eclipse.test.CoreTestApplication.run(CoreTestApplication.java:31)
	at java.lang.reflect.VMReflection.invokeMethod(VMReflection.java)
	at org.eclipse.equinox.internal.app.EclipseAppContainer.callMethod(EclipseAppContainer.java:533)
	at org.eclipse.equinox.internal.app.EclipseAppHandle.run(EclipseAppHandle.java:155)
	at org.eclipse.core.runtime.internal.adaptor.EclipseAppLauncher.runApplication(EclipseAppLauncher.java:106)
	at org.eclipse.core.runtime.internal.adaptor.EclipseAppLauncher.start(EclipseAppLauncher.java:76)
	at org.eclipse.core.runtime.adaptor.EclipseStarter.run(EclipseStarter.java:363)
	at org.eclipse.core.runtime.adaptor.EclipseStarter.run(EclipseStarter.java:176)
	at java.lang.reflect.VMReflection.invokeMethod(VMReflection.java)
	at org.eclipse.equinox.launcher.Main.invokeFramework(Main.java:504)
	at org.eclipse.equinox.launcher.Main.basicRun(Main.java:443)
	at org.eclipse.equinox.launcher.Main.run(Main.java:1169)
	at org.eclipse.equinox.launcher.Main.main(Main.java:1144)
	at org.eclipse.core.launcher.Main.main(Main.java:30)

Testcase: org.eclipse.jdt.core.tests.compiler.regression.TryStatementTest.test042 - 1.5:
junit.framework.AssertionFailedError: Unexpected target error running resulting class file for X.java:
The GC did not provide gc_add_weak_root_set_entry()
	at org.eclipse.jdt.core.tests.compiler.regression.AbstractRegressionTest.runConformTest(AbstractRegressionTest.java:658)
	at org.eclipse.jdt.core.tests.compiler.regression.AbstractRegressionTest.runConformTest(AbstractRegressionTest.java:515)
	at org.eclipse.jdt.core.tests.compiler.regression.TryStatementTest.test042(TryStatementTest.java:2243)
	at java.lang.reflect.VMReflection.invokeMethod(VMReflection.java)
	at junit.extensions.TestDecorator.basicRun(TestDecorator.java:24)
	at junit.extensions.TestDecorator.run(TestDecorator.java:30)
	at org.eclipse.jdt.core.tests.util.CompilerTestSetup.run(CompilerTestSetup.java:48)
	at org.eclipse.test.EclipseTestRunner.run(EclipseTestRunner.java:354)
	at org.eclipse.test.EclipseTestRunner.run(EclipseTestRunner.java:206)
	at org.eclipse.test.CoreTestApplication.runTests(CoreTestApplication.java:35)
	at org.eclipse.test.CoreTestApplication.run(CoreTestApplication.java:31)
	at java.lang.reflect.VMReflection.invokeMethod(VMReflection.java)
	at org.eclipse.equinox.internal.app.EclipseAppContainer.callMethod(EclipseAppContainer.java:533)
	at org.eclipse.equinox.internal.app.EclipseAppHandle.run(EclipseAppHandle.java:155)
	at org.eclipse.core.runtime.internal.adaptor.EclipseAppLauncher.runApplication(EclipseAppLauncher.java:106)
	at org.eclipse.core.runtime.internal.adaptor.EclipseAppLauncher.start(EclipseAppLauncher.java:76)
	at org.eclipse.core.runtime.adaptor.EclipseStarter.run(EclipseStarter.java:363)
	at org.eclipse.core.runtime.adaptor.EclipseStarter.run(EclipseStarter.java:176)
	at java.lang.reflect.VMReflection.invokeMethod(VMReflection.java)
	at org.eclipse.equinox.launcher.Main.invokeFramework(Main.java:504)
	at org.eclipse.equinox.launcher.Main.basicRun(Main.java:443)
	at org.eclipse.equinox.launcher.Main.run(Main.java:1169)
	at org.eclipse.equinox.launcher.Main.main(Main.java:1144)
	at org.eclipse.core.launcher.Main.main(Main.java:30)

Testcase: org.eclipse.jdt.core.tests.compiler.regression.RuntimeTests.test0600_reflection - 1.5:
junit.framework.AssertionFailedError: Unexpected output running resulting class file for X.java:
--[START]--
SUCCESS
SUCCESS
---[END]---
	at org.eclipse.jdt.core.tests.compiler.regression.AbstractRegressionTest.runConformTest(AbstractRegressionTest.java:658)
	at org.eclipse.jdt.core.tests.compiler.regression.AbstractRegressionTest.runConformTest(AbstractRegressionTest.java:515)
	at org.eclipse.jdt.core.tests.compiler.regression.RuntimeTests.test0600_reflection(RuntimeTests.java:130)
	at java.lang.reflect.VMReflection.invokeMethod(VMReflection.java)
	at junit.extensions.TestDecorator.basicRun(TestDecorator.java:24)
	at junit.extensions.TestDecorator.run(TestDecorator.java:30)
	at org.eclipse.jdt.core.tests.util.CompilerTestSetup.run(CompilerTestSetup.java:48)
	at org.eclipse.test.EclipseTestRunner.run(EclipseTestRunner.java:354)
	at org.eclipse.test.EclipseTestRunner.run(EclipseTestRunner.java:206)
	at org.eclipse.test.CoreTestApplication.runTests(CoreTestApplication.java:35)
	at org.eclipse.test.CoreTestApplication.run(CoreTestApplication.java:31)
	at java.lang.reflect.VMReflection.invokeMethod(VMReflection.java)
	at org.eclipse.equinox.internal.app.EclipseAppContainer.callMethod(EclipseAppContainer.java:533)
	at org.eclipse.equinox.internal.app.EclipseAppHandle.run(EclipseAppHandle.java:155)
	at org.eclipse.core.runtime.internal.adaptor.EclipseAppLauncher.runApplication(EclipseAppLauncher.java:106)
	at org.eclipse.core.runtime.internal.adaptor.EclipseAppLauncher.start(EclipseAppLauncher.java:76)
	at org.eclipse.core.runtime.adaptor.EclipseStarter.run(EclipseStarter.java:363)
	at org.eclipse.core.runtime.adaptor.EclipseStarter.run(EclipseStarter.java:176)
	at java.lang.reflect.VMReflection.invokeMethod(VMReflection.java)
	at org.eclipse.equinox.launcher.Main.invokeFramework(Main.java:504)
	at org.eclipse.equinox.launcher.Main.basicRun(Main.java:443)
	at org.eclipse.equinox.launcher.Main.run(Main.java:1169)
	at org.eclipse.equinox.launcher.Main.main(Main.java:1144)
	at org.eclipse.core.launcher.Main.main(Main.java:30)

Testcase: org.eclipse.jdt.core.tests.compiler.regression.RuntimeTests.test0601_reflection - 1.5:
junit.framework.AssertionFailedError: Unexpected output running resulting class file for X.java:
--[START]--
SUCCESS
SUCCESS
---[END]---
	at org.eclipse.jdt.core.tests.compiler.regression.AbstractRegressionTest.runConformTest(AbstractRegressionTest.java:658)
	at org.eclipse.jdt.core.tests.compiler.regression.AbstractRegressionTest.runConformTest(AbstractRegressionTest.java:515)
	at org.eclipse.jdt.core.tests.compiler.regression.RuntimeTests.test0601_reflection(RuntimeTests.java:172)
	at java.lang.reflect.VMReflection.invokeMethod(VMReflection.java)
	at junit.extensions.TestDecorator.basicRun(TestDecorator.java:24)
	at junit.extensions.TestDecorator.run(TestDecorator.java:30)
	at org.eclipse.jdt.core.tests.util.CompilerTestSetup.run(CompilerTestSetup.java:48)
	at org.eclipse.test.EclipseTestRunner.run(EclipseTestRunner.java:354)
	at org.eclipse.test.EclipseTestRunner.run(EclipseTestRunner.java:206)
	at org.eclipse.test.CoreTestApplication.runTests(CoreTestApplication.java:35)
	at org.eclipse.test.CoreTestApplication.run(CoreTestApplication.java:31)
	at java.lang.reflect.VMReflection.invokeMethod(VMReflection.java)
	at org.eclipse.equinox.internal.app.EclipseAppContainer.callMethod(EclipseAppContainer.java:533)
	at org.eclipse.equinox.internal.app.EclipseAppHandle.run(EclipseAppHandle.java:155)
	at org.eclipse.core.runtime.internal.adaptor.EclipseAppLauncher.runApplication(EclipseAppLauncher.java:106)
	at org.eclipse.core.runtime.internal.adaptor.EclipseAppLauncher.start(EclipseAppLauncher.java:76)
	at org.eclipse.core.runtime.adaptor.EclipseStarter.run(EclipseStarter.java:363)
	at org.eclipse.core.runtime.adaptor.EclipseStarter.run(EclipseStarter.java:176)
	at java.lang.reflect.VMReflection.invokeMethod(VMReflection.java)
	at org.eclipse.equinox.launcher.Main.invokeFramework(Main.java:504)
	at org.eclipse.equinox.launcher.Main.basicRun(Main.java:443)
	at org.eclipse.equinox.launcher.Main.run(Main.java:1169)
	at org.eclipse.equinox.launcher.Main.main(Main.java:1144)
	at org.eclipse.core.launcher.Main.main(Main.java:30)

Testcase: org.eclipse.jdt.core.tests.compiler.regression.AutoBoxingTest.test005 - 1.5:
junit.framework.AssertionFailedError: Unexpected target error running resulting class file for X.java:
The GC did not provide gc_add_weak_root_set_entry()
	at org.eclipse.jdt.core.tests.compiler.regression.AbstractRegressionTest.runConformTest(AbstractRegressionTest.java:658)
	at org.eclipse.jdt.core.tests.compiler.regression.AbstractRegressionTest.runConformTest(AbstractRegressionTest.java:515)
	at org.eclipse.jdt.core.tests.compiler.regression.AutoBoxingTest.test005(AutoBoxingTest.java:429)
	at java.lang.reflect.VMReflection.invokeMethod(VMReflection.java)
	at junit.extensions.TestDecorator.basicRun(TestDecorator.java:24)
	at junit.extensions.TestDecorator.run(TestDecorator.java:30)
	at org.eclipse.jdt.core.tests.util.CompilerTestSetup.run(CompilerTestSetup.java:48)
	at org.eclipse.test.EclipseTestRunner.run(EclipseTestRunner.java:354)
	at org.eclipse.test.EclipseTestRunner.run(EclipseTestRunner.java:206)
	at org.eclipse.test.CoreTestApplication.runTests(CoreTestApplication.java:35)
	at org.eclipse.test.CoreTestApplication.run(CoreTestApplication.java:31)
	at java.lang.reflect.VMReflection.invokeMethod(VMReflection.java)
	at org.eclipse.equinox.internal.app.EclipseAppContainer.callMethod(EclipseAppContainer.java:533)
	at org.eclipse.equinox.internal.app.EclipseAppHandle.run(EclipseAppHandle.java:155)
	at org.eclipse.core.runtime.internal.adaptor.EclipseAppLauncher.runApplication(EclipseAppLauncher.java:106)
	at org.eclipse.core.runtime.internal.adaptor.EclipseAppLauncher.start(EclipseAppLauncher.java:76)
	at org.eclipse.core.runtime.adaptor.EclipseStarter.run(EclipseStarter.java:363)
	at org.eclipse.core.runtime.adaptor.EclipseStarter.run(EclipseStarter.java:176)
	at java.lang.reflect.VMReflection.invokeMethod(VMReflection.java)
	at org.eclipse.equinox.launcher.Main.invokeFramework(Main.java:504)
	at org.eclipse.equinox.launcher.Main.basicRun(Main.java:443)
	at org.eclipse.equinox.launcher.Main.run(Main.java:1169)
	at org.eclipse.equinox.launcher.Main.main(Main.java:1144)
	at org.eclipse.core.launcher.Main.main(Main.java:30)

Testcase: org.eclipse.jdt.core.tests.compiler.regression.GenericTypeTest.test1095 - 1.5:
junit.framework.ComparisonFailure: Invalid problem log .
----------- Expected ------------
----------\n
1. ERROR in X.java (at line 11)\n
	Annot annotation = constructor.getAnnotation(Annot.class);\n
	                   ^^^^^^^^^^^^^^^^^^^^^^^^^^^^^^^^^^^^^^\n
Type mismatch: cannot convert from Annotation to Annot\n
----------\n
------------ but was ------------
--------- Difference is ----------
 expected:<[----------\n
1. ERROR in X.java (at line 11)\n
	Annot annotation = constructor.getAnnotation(Annot.class);\n
	                   ^^^^^^^^^^^^^^^^^^^^^^^^^^^^^^^^^^^^^^\n
Type mismatch: cannot convert from Annotation to Annot\n
----------\n
]> but was:<[]>
	at org.eclipse.jdt.core.tests.junit.extension.TestCase.assertStringEquals(TestCase.java:226)
	at org.eclipse.jdt.core.tests.junit.extension.TestCase.assertEquals(TestCase.java:201)
	at org.eclipse.jdt.core.tests.compiler.regression.AbstractRegressionTest.runNegativeTest(AbstractRegressionTest.java:1123)
	at org.eclipse.jdt.core.tests.compiler.regression.GenericTypeTest.test1095(GenericTypeTest.java:36331)
	at java.lang.reflect.VMReflection.invokeMethod(VMReflection.java)
	at junit.extensions.TestDecorator.basicRun(TestDecorator.java:24)
	at junit.extensions.TestDecorator.run(TestDecorator.java:30)
	at org.eclipse.jdt.core.tests.util.CompilerTestSetup.run(CompilerTestSetup.java:48)
	at org.eclipse.test.EclipseTestRunner.run(EclipseTestRunner.java:354)
	at org.eclipse.test.EclipseTestRunner.run(EclipseTestRunner.java:206)
	at org.eclipse.test.CoreTestApplication.runTests(CoreTestApplication.java:35)
	at org.eclipse.test.CoreTestApplication.run(CoreTestApplication.java:31)
	at java.lang.reflect.VMReflection.invokeMethod(VMReflection.java)
	at org.eclipse.equinox.internal.app.EclipseAppContainer.callMethod(EclipseAppContainer.java:533)
	at org.eclipse.equinox.internal.app.EclipseAppHandle.run(EclipseAppHandle.java:155)
	at org.eclipse.core.runtime.internal.adaptor.EclipseAppLauncher.runApplication(EclipseAppLauncher.java:106)
	at org.eclipse.core.runtime.internal.adaptor.EclipseAppLauncher.start(EclipseAppLauncher.java:76)
	at org.eclipse.core.runtime.adaptor.EclipseStarter.run(EclipseStarter.java:363)
	at org.eclipse.core.runtime.adaptor.EclipseStarter.run(EclipseStarter.java:176)
	at java.lang.reflect.VMReflection.invokeMethod(VMReflection.java)
	at org.eclipse.equinox.launcher.Main.invokeFramework(Main.java:504)
	at org.eclipse.equinox.launcher.Main.basicRun(Main.java:443)
	at org.eclipse.equinox.launcher.Main.run(Main.java:1169)
	at org.eclipse.equinox.launcher.Main.main(Main.java:1144)
	at org.eclipse.core.launcher.Main.main(Main.java:30)

Testcase: org.eclipse.jdt.core.tests.compiler.regression.GenericTypeTest.test1117 - 1.5:
junit.framework.AssertionFailedError: Unexpected output running resulting class file for X.java:
--[START]--
---[END]---
	at org.eclipse.jdt.core.tests.compiler.regression.AbstractRegressionTest.runConformTest(AbstractRegressionTest.java:658)
	at org.eclipse.jdt.core.tests.compiler.regression.AbstractRegressionTest.runConformTest(AbstractRegressionTest.java:564)
	at org.eclipse.jdt.core.tests.compiler.regression.GenericTypeTest.test1117(GenericTypeTest.java:37010)
	at java.lang.reflect.VMReflection.invokeMethod(VMReflection.java)
	at junit.extensions.TestDecorator.basicRun(TestDecorator.java:24)
	at junit.extensions.TestDecorator.run(TestDecorator.java:30)
	at org.eclipse.jdt.core.tests.util.CompilerTestSetup.run(CompilerTestSetup.java:48)
	at org.eclipse.test.EclipseTestRunner.run(EclipseTestRunner.java:354)
	at org.eclipse.test.EclipseTestRunner.run(EclipseTestRunner.java:206)
	at org.eclipse.test.CoreTestApplication.runTests(CoreTestApplication.java:35)
	at org.eclipse.test.CoreTestApplication.run(CoreTestApplication.java:31)
	at java.lang.reflect.VMReflection.invokeMethod(VMReflection.java)
	at org.eclipse.equinox.internal.app.EclipseAppContainer.callMethod(EclipseAppContainer.java:533)
	at org.eclipse.equinox.internal.app.EclipseAppHandle.run(EclipseAppHandle.java:155)
	at org.eclipse.core.runtime.internal.adaptor.EclipseAppLauncher.runApplication(EclipseAppLauncher.java:106)
	at org.eclipse.core.runtime.internal.adaptor.EclipseAppLauncher.start(EclipseAppLauncher.java:76)
	at org.eclipse.core.runtime.adaptor.EclipseStarter.run(EclipseStarter.java:363)
	at org.eclipse.core.runtime.adaptor.EclipseStarter.run(EclipseStarter.java:176)
	at java.lang.reflect.VMReflection.invokeMethod(VMReflection.java)
	at org.eclipse.equinox.launcher.Main.invokeFramework(Main.java:504)
	at org.eclipse.equinox.launcher.Main.basicRun(Main.java:443)
	at org.eclipse.equinox.launcher.Main.run(Main.java:1169)
	at org.eclipse.equinox.launcher.Main.main(Main.java:1144)
	at org.eclipse.core.launcher.Main.main(Main.java:30)

Testcase: org.eclipse.jdt.core.tests.compiler.regression.AnnotationTest.test218 - 1.5:
junit.framework.ComparisonFailure: Invalid problem log .
----------- Expected ------------
----------\n
1. WARNING in X.java (at line 4)\n
	void bar(Constructor constructor, Class<Ann> ann) {\n
	         ^^^^^^^^^^^\n
Constructor is a raw type. References to generic type Constructor<T> should be parameterized\n
----------\n
2. WARNING in X.java (at line 5)\n
	constructor.getAnnotation(ann).message();\n
	^^^^^^^^^^^^^^^^^^^^^^^^^^^^^^\n
Type safety: The method getAnnotation(Class) belongs to the raw type Constructor. References to generic type Constructor<T> should be parameterized\n
----------\n
3. ERROR in X.java (at line 5)\n
	constructor.getAnnotation(ann).message();\n
	                               ^^^^^^^\n
The method message() is undefined for the type Annotation\n
----------\n
------------ but was ------------
----------\n
1. WARNING in X.java (at line 1)\n
	import java.lang.annotation.Annotation;\n
	       ^^^^^^^^^^^^^^^^^^^^^^^^^^^^^^^\n
The import java.lang.annotation.Annotation is never used\n
----------\n
2. WARNING in X.java (at line 4)\n
	void bar(Constructor constructor, Class<Ann> ann) {\n
	         ^^^^^^^^^^^\n
Constructor is a raw type. References to generic type Constructor<T> should be parameterized\n
----------\n
--------- Difference is ----------
 expected:<... in X.java (at line [4)\n
	void bar(Constructor constructor, Class<Ann> ann) {\n
	         ^^^^^^^^^^^\n
Constructor is a raw type. References to generic type Constructor<T> should be parameterized\n
----------\n
2. WARNING in X.java (at line 5)\n
	constructor.getAnnotation(ann).message();\n
	^^^^^^^^^^^^^^^^^^^^^^^^^^^^^^\n
Type safety: The method getAnnotation(Class) belongs to the raw type Constructor. References to generic type Constructor<T> should be parameterized\n
----------\n
3. ERROR in X.java (at line 5)\n
	constructor.getAnnotation(ann).message();\n
	                               ^^^^^^^\n
The method message() is undefined for the type Annotation]\n
----------\n
> but was:<... in X.java (at line [1)\n
	import java.lang.annotation.Annotation;\n
	       ^^^^^^^^^^^^^^^^^^^^^^^^^^^^^^^\n
The import java.lang.annotation.Annotation is never used\n
----------\n
2. WARNING in X.java (at line 4)\n
	void bar(Constructor constructor, Class<Ann> ann) {\n
	         ^^^^^^^^^^^\n
Constructor is a raw type. References to generic type Constructor<T> should be parameterized]\n
----------\n
>
	at org.eclipse.jdt.core.tests.junit.extension.TestCase.assertStringEquals(TestCase.java:226)
	at org.eclipse.jdt.core.tests.junit.extension.TestCase.assertEquals(TestCase.java:201)
	at org.eclipse.jdt.core.tests.compiler.regression.AbstractRegressionTest.runNegativeTest(AbstractRegressionTest.java:1123)
	at org.eclipse.jdt.core.tests.compiler.regression.AbstractRegressionTest.runNegativeTest(AbstractRegressionTest.java:999)
	at org.eclipse.jdt.core.tests.compiler.regression.AbstractRegressionTest.runNegativeTest(AbstractRegressionTest.java:978)
	at org.eclipse.jdt.core.tests.compiler.regression.AnnotationTest.test218(AnnotationTest.java:7212)
	at java.lang.reflect.VMReflection.invokeMethod(VMReflection.java)
	at junit.extensions.TestDecorator.basicRun(TestDecorator.java:24)
	at junit.extensions.TestDecorator.run(TestDecorator.java:30)
	at org.eclipse.jdt.core.tests.util.CompilerTestSetup.run(CompilerTestSetup.java:48)
	at org.eclipse.test.EclipseTestRunner.run(EclipseTestRunner.java:354)
	at org.eclipse.test.EclipseTestRunner.run(EclipseTestRunner.java:206)
	at org.eclipse.test.CoreTestApplication.runTests(CoreTestApplication.java:35)
	at org.eclipse.test.CoreTestApplication.run(CoreTestApplication.java:31)
	at java.lang.reflect.VMReflection.invokeMethod(VMReflection.java)
	at org.eclipse.equinox.internal.app.EclipseAppContainer.callMethod(EclipseAppContainer.java:533)
	at org.eclipse.equinox.internal.app.EclipseAppHandle.run(EclipseAppHandle.java:155)
	at org.eclipse.core.runtime.internal.adaptor.EclipseAppLauncher.runApplication(EclipseAppLauncher.java:106)
	at org.eclipse.core.runtime.internal.adaptor.EclipseAppLauncher.start(EclipseAppLauncher.java:76)
	at org.eclipse.core.runtime.adaptor.EclipseStarter.run(EclipseStarter.java:363)
	at org.eclipse.core.runtime.adaptor.EclipseStarter.run(EclipseStarter.java:176)
	at java.lang.reflect.VMReflection.invokeMethod(VMReflection.java)
	at org.eclipse.equinox.launcher.Main.invokeFramework(Main.java:504)
	at org.eclipse.equinox.launcher.Main.basicRun(Main.java:443)
	at org.eclipse.equinox.launcher.Main.run(Main.java:1169)
	at org.eclipse.equinox.launcher.Main.main(Main.java:1144)
	at org.eclipse.core.launcher.Main.main(Main.java:30)

Unexpected errors (0):

Unexpected crashes (37):
org.eclipse.jdt.text.tests.JdtTextTestSuite
org.eclipse.releng.tests.BuildTests
org.eclipse.pde.ui.tests.AllPDETests
org.eclipse.ant.tests.core.AutomatedSuite
org.eclipse.compare.tests.AllTests
org.eclipse.core.tests.runtime.AutomatedTests
org.eclipse.core.tests.resources.AutomatedTests
org.eclipse.osgi.tests.AutomatedTests
org.eclipse.core.internal.expressions.tests.AllTests
org.eclipse.update.tests.AllTests
org.eclipse.team.tests.core.AllTeamTests
org.eclipse.team.tests.core.AllTeamUITests
org.eclipse.jdt.core.tests.performance.OneTest
org.eclipse.ui.tests.UiTestSuite
org.eclipse.jface.tests.AllTests
org.eclipse.ui.parts.tests.PartsReferencesTestSuite
org.eclipse.ui.tests.session.SessionTests
org.eclipse.ui.editors.tests.EditorsTestSuite
org.eclipse.ui.tests.navigator.NavigatorTestSuite
org.eclipse.ui.workbench.texteditor.tests.WorkbenchTextEditorTestSuite
org.eclipse.ui.tests.rcp.RcpTestSuite
org.eclipse.ui.tests.views.properties.tabbed.AllTests
org.eclipse.jdt.debug.tests.AutomatedSuite
org.eclipse.jdt.ui.tests.AutomatedSuite
org.eclipse.jdt.ui.tests.refactoring.all.AllAllRefactoringTests
org.eclipse.ltk.ui.refactoring.tests.AllTests
org.eclipse.ltk.core.refactoring.tests.AllTests
org.eclipse.text.tests.EclipseTextTestSuite
org.eclipse.jface.text.tests.JFaceTextTestSuite
org.eclipse.jface.tests.databinding.BindingTestSuite
org.eclipse.core.filebuffers.tests.FileBuffersTestSuite
org.eclipse.ant.tests.ui.testplugin.AntUITests
org.eclipse.swt.tests.junit.AllTests
org.eclipse.team.tests.ccvs.core.AllCoreTests
org.eclipse.team.tests.ccvs.core.AllTests
org.eclipse.core.tests.net.AllNetTests
org.eclipse.ua.tests.AllTests

BUILD FAILED:
	Ant Error Message:
C:\cc\cc-suites\scripts\cc-exec-adaptor.xml:101: The following error occurred while executing this line: C:\cc\cc-suites\adaptors\eut33\adaptor.xml:59: The following error occurred while executing this line: C:\cc\cc-suites\tests\eut\build.xml:549: EUT failed: There are unexpected failures

Date of build:	08/08/2007 15:21:19
Time to build:	52 minutes 13 seconds

***********************************************************
Errors/Warnings:	(48)
            
File C:\cc\cc-suites\tests\eut\eut33.windows.efl does not exist.
[java] Java Result: 1
[java] Java Result: 1
[move] Warning: C:\cc\cc-suites\build\checkouts\eut33\eclipse-testing\results\chkpii not found.
[java] Java Result: 1
[java] Java Result: 1
[java] Java Result: 1
[java] Java Result: 1
[java] Java Result: 1
[java] Java Result: 1
[java] Java Result: 1
[java] Java Result: 1
[java] Java Result: 1
[java] Java Result: 1
[java] Java Result: 1
[java] Java Result: 1
[java] Java Result: 1
[java] Java Result: 1
[java] Java Result: 1
[java] Java Result: 1
[java] Java Result: 1
[java] Java Result: 1
[copy] Warning: Could not find file C:\cc\cc-suites\build\checkouts\eut33\eclipse-testing\test-eclipse\eclipse\org.eclipse.ui.tests.performance.xml to copy.
[java] Java Result: 1
[java] Java Result: 1
[java] Java Result: 1
[java] Java Result: 1
[java] Java Result: 1
[java] Java Result: 1
[java] Java Result: 1
[java] Java Result: 1
[java] Java Result: 1
[java] Java Result: 1
[java] Java Result: 1
[java] Java Result: 1
[java] Java Result: 1
[java] Java Result: 1
[java] Java Result: 1
[java] Java Result: 1
[java] Java Result: 1
[java] Java Result: 1
[java] Java Result: 1
[java] Java Result: 1
[java] Java Result: 1
Processing: failure using file C:\cc\cc-suites/build/checkouts/eut33/tmpfile.unexpected.failures.errors.testcases
Processing: error using file C:\cc\cc-suites/build/checkouts/eut33/tmpfile.unexpected.failures.errors.testcases
The execution FAILED with the following exception:
The following error occurred while executing this line:
C:\cc\cc-suites\adaptors\eut33\adaptor.xml:59: The following error occurred while executing this line:
C:\cc\cc-suites\tests\eut\build.xml:549: EUT failed: There are unexpected failures

***********************************************************
Unit Tests: (0)
        
No Tests Run: This project doesn't have any tests

***********************************************************
Modifications since last successful build:	(0)
            

begin 644 execution_log.zip
M4$L#! H    ( +&!"#?=^2\4)AL  /S@ @ 2    97AE8W5T:6]N7VQO9RYH
M=&UL[5UK;]NXMOU\"\Q_('I[,1Z@D6,[CXYOIT":IN>F:&:*)FD/,"D"1J)M
M361)1P\GF5]_-RG)3TFV$D>6/*LH8ENBN#?)_5@DEZ2W@V!HO7M[XQ@/[]ZZ
MGGCWEC,_>+#$;S_W'#O8\<V_19>]V?V?__WYW4\OO-#N_O3BIQ>&L$0@--=S
M7.$%IO"UGFD)=4IW[)[9#[V%LYKN#(>.O:10(/A0'_GYI:*SEN"V=B-Z#A5(
M%*-/+;F,!Z8S.1H(/Y#5,OGO3W$O]!_L?6A:AJJ0R=/:_=":+3#[BUM6-^^\
M+X)/W\YZGC.\](5W[@K=[)G"6.&:+^/VY1;^RPBH$UU2V L<)U^9OT+;#"JC
M+G?S=5FN+546B/NGUD+Z?PWMP!R*(T\?F".16]I<K$Y]'=X:IO>#'7N"!\)@
M]*/+CKM7ND[_=_S0)&.ZNI&V=:4/A'[KA(%_)<*@T[D2NF6ZOMB1YF;:_2M/
M^*%%9Q<L[YGD2&\O1="=:7?:6O3W_LW!DC$)W66C%KH[?YOSI=:LN_S<B0_F
MFX4?4"RXH.)?K+!//W.U'X>Q"XIM\J*B-C?7&;))3ZLB-%6;\WV)CWA:J?B[
M/G!^,'(EFSJ..5Y?B_M-(S_5I*-& 5?[9 07]$LV^UPJKK&ORD)8%'8?-5#-
MV,B:<T;6+*('>9R6UC+9[A_LTO:$[O1MRGX&^W;&'%<F$_;S:*AQGZ)E<&V8
MW'+ZO_6XY8N?LRLZ=D++8+83,%T9* L&@GVB4VQD>D'(+3;D%(ALD:.,*AYU
M6Y>U\DW-LH0>[,0=E.8N*KG_8-^Y)X>NJ_0)N'_+;#X4[*TZ_8Z9/C,$P0%=
M^I3&*$&PM_>^%;Q3QB^XD:)N4O6%QVV?LO)0FH9I!\YSAA+YC1R,]/S!?G>8
MN#?5Q8PN=D)/%S[CMNQ_9E.M-);2)%XSPY%E:%2HY_NY'2I!QI+H%&&/I8.2
M6Z8O[*^98R9;Z#Y(6W(?I-XMY3SLR1V;GG3J9R 922V61F"%S,"7LI[<75?9
M$>9ZSDQE@'GZ$,FF%1&:WQ6?'6[(?E __8$0P1HR97+RRHURX8RZLN#5I\O?
M3R^T?Y]_7A\R\X1U0L:Y83"X1ASS9S2E^L$^R$\Y2 1D*&HXWL/:T8SZ^D^#
M3:M$\N4CJ&:,%RE3R:+:T*3U^3 8>8>P^S'RF:A<&O;*D@_,59>4NDG,!3SU
MS\13TU&C)#25*[).6"KZ/G1&TY;VM,[2![>N::HPVG-">]X 9W^YA@A-P#' 
ML2U9Q2)[UD(S1C!'EO7EPTFY$"I3 6"HNJ11K%L!9U419TV'EI)P5J[(.N&L
MV5_<WOA^)##//PKS/.^Z$=ESC#BD'.TH#)RA')IR=^[RM0#^J4MZ _X!_JDB
M_IF-+R4AH"5"ZXN!),.+>_EI#3@(.&BZ[ZN]]A-;]&3MI=R5GPSQP#UU26O 
M/< ]5<0],X&E)-B3+[/.J,<37@18@'R ?%9>OEDA/,?6<%%UDI%:G(E 2NP)
MDZ6:LA'3,DT GNJ2&S<)GI;/2P"=_JG0:3["E(:?E@JN.8A*7!<P"C!JK3 J
M,:Q: :E$Z2I J2Q= *;JDBT!I@"FJ@VF$EO; )S*%%U?0.7X?9"P@:/6BJ/^
M./^767D()0T_V3#;#'#*U@!PJ2[Y$' )<*EZ<&D264H"23D"ZPN-9/X1]V1)
M-$3.DBP+E 245"@T;YBN1',:"F_"L[FE3=GXY@A,*RH$9%27U =*$[!1%;&1
M"C4+$:;,Q:3EPNN+F4+7X$LR'Z 2H-)TWU?]#K?(I#>%C-*E P;5)<L!!@$&
M51$&S<25$F]J6RZWON!'/8C>P8UM@#];!'^D4<_<6R^[*FIY>2@H5PF H;KD
MNDV"H8TNN&;8[^5I)=PH40..!$?"K&(K#&1#LXJY %/2G&*9U/K.*-3KD#SA
M"J^'204F%5LSJ9"OI)@BUDK[IMC';5UH?]CJ/M927_JS1!7@HKJD/> BX*(J
MXJ+L(%/B.X!65*"^:*F<MU-Z0C50>$!D0&3;BLAB$X_>Q".\<I>I5M$E'Y/]
MI5"3\"3)AKUL:?O:[DN679R2TPZWW %GW0A_.4-7^@/U4/2PPL"\L5+,.+G>
M']GL-^;M'W1VV_NO6>,H[#-VP-J[NX>_O&;?3=MP[ORFR3OMYM ?Z:S5:>V^
MEB\D$YR2H6I?=N6#('"[S>: >T/'?M"X2R!0:-1?V9=<4![^US%Y500G7<\9
MF89@??V:&\;UG>"WUY[C!-<4$:Z%'7@/C5\ *0$I 2GK"RGC(+D9.)DE'% R
MLW ,)9.7G0-+ DMN*Y9,;%QSN4?.I,D>.+*L3<')+'6 *($HMQY15C0R>*(?
MWQ)1F>B0HA(B!"+$UD<(,>)6R.46UK7RB!H!#:GZIN/'C X(&&4%C(L!^:\I
M39\<@F9KTO#%O2ZBO5C7D_<6&^SF(79^KT^3S6]GJ>8V&1S-=+33/TZ2:K(+
M_Q>GJ:MCB'/;=%U2][ M'[W9N+1O;>?.9N?*+W.TE]<K@1:W^Y1Y>C*D:=_.
MOD;?9 XR[9%S*\Y$,'",QLP9>6'ANJ.*XEH;\2]9K-MI'2ZI;9GU1]VK376(
M]%WAO8IZ9>%X+'?OH.CX>AZ9_F/'5G7'B:RBP+CN85S7/:Y;&P0Z;WZ%M6QC
M%.C\VL+ (@RL:"V'NP>PEFT, X>[;S"P%0L#6!O ?C3VHZNP'YVLHVYF0SI3
M.G:D,PO'.])#"MP6MJ.Q';WRZ-1L.UH9N+SU56XRG,D?&V4W9JF#M>.RUHZ/
M+>[[U 4#U?'_+8?EU":(:QKC,ZW&+VS('R0P$9Z\-6=ZZO&1D_<Q-7O0M)PQ
M^W.JX _6[73W.EUV8HDA:<B"!U>PEWHB4"G]D@U#/V W@O4(-#EWT<1&F'3:
M8SP(//,F)%W\*!?H:M/&?\U>OGLIQ_5E\]U++=_K (^W>'/=<(8:%2O]B65+
MU$!<>\ZX!@__!WDX%?DH[^(*@@W?H;&H"+P<7EY;+\<R5PT,I!K+7&KVMIDU
MKG31]5W@"O$>,JPZE;GJ])P/? N3-WM=JC>AG4MMRWMF=)IP/,2D+IGMGSS!
MZ7%]8X]:3Q4.MX';5-YM*."[W N2MR5]D=^_BI[PA!V_S;ST!+22/G N.%?%
MG]P[QE)^?#/8>?19;FK*UP)N!#?"JM96&,BFW@92[NMB,\75>?5JZIEZ6,C"
M0M8DH@9+;Z-=*62.H]@D#_=,2@@J@*[1#U)QQ_1C<>.8(+7*B8RU#KKSOBT,
MDRP>KX"&7V_1 G5LU+&'GT2_-K)8L$03S&_J$DDQO\'\IJ+SFYD84]X\)U]L
MG><[-A^9?4Z- RH"*MH>5!1AD+%Q:[\GWS:XCY^K#=!179(?T!'04471T5R<
M*7D=.$=PG1'2G>/=W@A;'TA?C8 @L!*PTO9@I;&!:Q,+CSWZ>W+J@LY$*SH;
M 5"/51&HJBY)$Z@*J*JBJ"H[^)0'L KH4&>LY>GY7@AL!6PUW?=5?VC)>&I$
MAJU]U=T-KCXM: !L5)?4!VP$;%11;#2.+66O-:6)K#/R&9GB#LPD8)\M6E>*
M'%49MN:.GUZH!?SFAB)FZ3<&KJX1D%%=$A^0$9!1I9%11JPI&RVMJD9]$=1?
M1F"(F[ /" 4(M2402CXI2-ET\C2#,'"&<F3*74%:H@; 4EUR(< 2P%(5P=)<
M@"GQ.6QY4FL-A? 4-N"@U4='M>*/\]PR%+]O:X"7QC.>SZ1O^;MM.2H )]4E
M#6X2)]7)Q38X'\G2 4X&)\-D9"L,9(.3D9*?HY,KLN;3$$_TN$3JTN@P(\&,
M9'M69B=,E(F):]1C<AN9_G^='"UWF_LQN@$VU24K C8!-E4=-DU'G0U J%SQ
M]8535G [ Z=46X&I@*FV!%.1?4L7GD8L\1)/V43!Y9H +]4E'0(O 2]5$2]E
MQ9B2\-+*XFN-E^2]?4!,0$Q;C)C4FP0K@IF6Z0+45)>D"-0$U%15U)0>94K$
M32LJ4%_D)!T6, DPJ428]+Q/X9 &G3R5/CHDGQ5V43H[<)D> $AUR7\ 2 !(
M501(DPA3$B#*$5A? *1>(0P$! 2T-0@H>2GV&']\^D@'-H."5M$%2*@NB0Y(
M"$BHBDAH/LJ4141:)K;FJ,C@ ;\Q;0-\;@"D(J-3%X D\<B4C6OOH\_-H:2E
M"@$JU243 BH!*E49*LV%FI(1TS+I]05.TLAOPEY/X-73P$Q;A)G41OB4<<=.
M_)&.O(^.E ^;BN@$Y%27Q CD!.141>24'FU* DXK"J\O;N(VGF,&Q%1D=*K-
MUR9[CN%(?*MJY![:D1U<GEZ42M=>016@H[HD/Z CH*,JHJ/I(%,2)LH565\D
MY-^!D T<M#TK1V3/L9LJRRW_=K5,!8!ZZI+4@'J >JJ(>L:AI23(DRVOOGB'
M+&6HC[!;!LRS+6L_TJ)CQ*&394>+MX0ZCAW9 65"G^6:  /5)<5M$@-5TIVJ
MX4IP([@1IA*82CS];LY)?(G#2VFW=2Z77-_IA6R.:IPML*Z*.<;VK*LJ !*Y
M+9FVA"*_BZ!<3)2C @!17?(= !$ 414!T6QP*9-GERVTOC"(H,2G;V<]SQF2
M+7GGKM#-GBF,9?"#KODR?I%\?AHS NX"80%A;<LJKGS-!%ET' UD<PG?E/IF
MGT7I^:CJ+X5[A.=++/6RI>UKNR]9=G%*+SO<<@><=2,$Y0Q=:?'4"^H[#\P;
M*\50D^O]D<U^8][^06>WO?^:-8["/F,'K+V[>_C+:_;=M WGSF^:O--N#OV1
MSEJ=UNYK0@Z4\RF=J:[*KGP0!&ZWV1QP;^C8#]05!..$1CV4?<D%9=)_'9/?
M1(#0]9R1:0C6UZ^Y85S?"7Y[[3E.<$T^?RWLP'MH_)+?EYK%[;YV:D\ZX]@B
M>'H\H,/BQ/,<<E#2J!F/69/&K$ECUI1)I$F)5W@VMYH&G>8>EP"W>6239NKK
MA\G14^KV;$7^BP<Y9LG'%?K:T)0JR>/:F?HZ)4,9T+ALG+,=3]4R.2XU$4/J
MFZC&QLK52%6[K=V#G Y]WG:XT;>"&A^V'J&P@@C)Z&I'7RX^F#Z9ASZ00823
MD6A&?.#"4;<BD;4;8\&-M N4,ON_/H\VA)_I\*D]UN7,,42V&IW6\ZBA_#U;
M[$'KS;.(Y;KL]U>M/,F[SR'Y54OV?+;8]L'>D\4*>Z2]E_UZ8H]>'5,FO^'Z
M[5?QGY",GFQ<MMT-XH<(-)*"2:N+#K,2;3A#[9C"H6DI?[JD!$T)T;$HZVA>
M]*61=3YRN?VBX[P>N7N'G<?*/3J_^,(]0LU:M,9 O_W&Y&#4K,[3O4:-)CGH
M.%;(P9H2N7!.27ZS!L>9MJ,9B3,FT]E_3'Q?E'1TXP<>UX.I\9(R;'&7R&MD
M%(G33-&17$N :A\^W5\SPG..T%:1+I\5-EZBT;X[WBW5KD?")K^B[CS\]? 9
M\\Z'4#XV^WU^W[;VUI!SW&EK(=\,3-UT)4<\Q@83%$#>FUDX[I.B/C560RFE
M3(E"0V+&IT/>%^_C@VGJI)6+04%1GRN@B:ZZ0.2([W36(_Z]'/.9ZB-O6SP>
MMWHM4N7"[HP\FD(UI@_&B?B9I"V*:AVV'^W.8D2XW(_"]!FWJ<N\5VWET-.'
MXN3>+A*KHF?<1\LNVCGO">F<,J]2W5,_Y<7KU%Z[X;ZI1Y%AL0FM@\='ON+"
M"H7 Y>/2RAB7]E[A1E5M7-I[1;SEJ<):A>TX7UB&G,Y^$4B1E68)F_TE]$EX
MB%J5'(U0Z*^/;]"BH)M% 8?[CT&YT1P\"607T3(5 2[3<VRY'*#U0BMN3LK)
MJ&6=1^'K=4@N%.PR),=A.MJ[G,B<.1R92J&X-+O(D;HXX6N^""[=])6+6.C^
MLE&-;FSI>7PH[@C>J8X\INF"C!7ON2<:XP-1O&LOPS=I%48KGQ3<",$$9'&-
MR<%5%X"RJY6:?HGJ%<9BS4O'.+_F%%67A;&\+EWHSF4K"&F51<^EH=KDC\;D
M2!3Y.D^J<J&Z]F,LJ%H:SN][35ZKX0=3F7'Q:!SBBT2)XO6W"RU^JOJCF^^/
M7-<R=>7QKSI*PL+Q!*04Z2%YI\B=:?0%Q9!DLO79T6^5A)D#<?<\LN[S!UL?
M4#PV_X[ZY\BG V<TOZ'LZC=FSL:^4B1/3$N24T>+/RP*24[$\;G0Y"%5@.#&
MD6TD4]6Y^MN%9F2A.4G@<N)](ZA#9!-.)#SY[#AN8W(X]JLW11J0*>#R=+'F
M0C GO>9X/75OH?)VZ\EJO]H;+U!,U;Q7?"8P_0Q5Y\87WDBM-7P5W!I*$=_-
M8/!!]#BE@T9T,&K#&GH^7CVS#?*Q\='%)A59[R!!7RP>2$;'Y6F&@*D"\8K*
M8YMB&H(@RR3VG'XXF0Y%?L"]H#%W\!';/^D14#GWY&=F*.P469_)%I55_T&1
M'8&,ZJ..RA#0+K3G(/X3FK9S/QDC&I\D.U'5_\=M(UY(7#@8=5?QZ4TR[9R(
M- C'.MZ4V,\\),N+H_[4F*64>(1]%-8BZN\LX8>/ECTG\ER*F84"R:$X_SRZ
MKPM*:BUMD_P6[6%[HB<Y<MJWLZ_1-VF)ICUR;L69" :.T9@YL\*2PF+=445Q
MK8WX5]0GK2++*XFU6\D GG$S4?9C B8;ZF T.=HM@NS2:U>K$!10IZK=VRLR
MD.G5>C,UMEJ%5AK3JQS2GYDZ]PJO*.16F(OJ)X,.4@1($2!%@!0!4@1($2!%
M@!2Q_O ,4@1($2!%@!0!4@1($54?%Y B0(H *:*(-) B5JD6I B0(D"* "D"
MI B0(D"* "D"I B0(D"* "D"I B0(D"* "EBS=J % %2!$@1($6 % %2!$@1
M($6 % %21/4WWT&*J.:X@!0!4@1($46D+25%R),?36$9QXY\<J\=Y!(DWBSE
M,]1F*32/=S#>AY_B'BR=,1?EACQJ7Q_<$'!#P T!-P3<$'!#P T!-P3<$'!#
MP T!-P3<$'!#P T!-P3<$'!#P T!-P3<D$=( C<$W!!P0\ - 3<$W!!P0VHV
M+N"&@!L";D@1:7A@QBK5@A0!4@1($2!%@!0!4@1($2!%@!0!4@1($2!%@!0!
M4@1($2!%K%D;D") B@ I J0(D") B@ I J0(D") BJC^YCM($=4<%Y B0(H 
M*:*(M)4>F'%I1[,8B8FF"OB[N62)UL&R?%*?=5$\/0-$D8K1,*JO(8@B((J 
M* *B"(@B((J * *B"(@B((IP$$5 % %1!$01$$5 % %1!$01$$5 % %1!$01
M$$5 % %1!$21<KH*1!$014 4*2(-3\]8I5J0(D"* "D"I B0(D"* "D"I B0
M(D"* "D"I B0(D"* "D"I(@U:P-2!$@1($6 % %2!$@1($6 % %2!$@1U=]\
M!RFBFN,"4@1($2!%%)'VI*=GM'+)$LO]HS[KHGAZ!H@B%:-A5%]#$$5 % %1
M!$01$$5 % %1!$01$$5 %.$@BH H J((B"(@BH H J((B"(@BH H J((B"(@
MBH H J((B"+E=!6((B"*@"A21!J>GK%*M2!%@!0!4@1($2!%@!0!4@1($2!%
M@!0!4@1($2!%@!0!4@1($6O6!J0(D") B@ I J0(D") B@ I J0(D"*JO_D.
M4D0UQP6D") B0(HH(FVEIV=\=N(EY=R'92S-QO59!L7#,L +J1CKHOH:@A<"
M7@AX(>"%@!<"7@AX(>"%@!>R/1,B\$+ "P$O!+P0\$+ "P$O!+P0\$+ "P$O
M!+P0\$+ "P$O!+R0BH\+>"'@A8 74D0:'I:Q2K4@18 4 5($2!$@18 4 5($
M2!$@18 4 5($2!$@16R8%#'[2W<L.=@[GII+^=U%T7_ZP8,E?K#OW+,I_W99
M,! LX/XMLVGLV%MU^ATS?68(UQ,4-(2AL4N?3MW[5D!G;#\@!*9E5WWA<=N7
MV8[JI^*!PXZ[5[I._W=\.:/PK]2T_HH:J=\Z8>!?B3#H=*[B7M@)HI6$J[@1
M5W>FW6EKT=_[-P<+@O_4'9OT_,%^=YBX-]7%;+P<PRC2,MMA-M4J#!:(^^ U
M,QQ9QG:" 7WF=J@EN!VZW;PR9$:YY^-!R2W3%_;7S#&3+70??K!C^BOU;K&>
M:=&H/;5C[X<IQ)8:&L@@R&M(O"<K93VYNZXR5X^NYZQ4H])/'R'9L@(R\SOB
ML\,EY&;JIS\0(GBD=O)S)SZ8G+QRK;!/0W\UC[VN/EW^?GJA_?O\<Y[]ASS7
M/=1:16X)7\CYODS41YX^,$<BM[2Y0G5+O%Z5V/G;G"\EOQG"$@'U^ ?Y*;O<
M,,E3"#P\K*''4P9X>$L"*#ZHN8<AI777+FB^ PG0699$SU^B@5\2 NV>V0\]
M<2'X4%[TQ-&137I:%:&IVIQO=91QTTK%W_6!\X/)M1HYPC/S-1ZO*!]%/>1K
M+ KN*FX_<FB:<4QHSCE],U\RA:&42)P $/FV<-WIRP4@@WT[8XXK 2;[>334
MN$\3\^#:,+GE]'_K<<L7/V=7=.R$EDRS 8LFP"IKR U6-C*](.06&W)R2UOD
M**.*1QW592W G/FH I@#F+,!F)/$E)(03J:X.H&;]Y>GGS^P\\OCXY/S\X^7
MN= GO^R%0WF625S39?LM1K84DF#6)OQ!\<#P?WKQTXLHY&JNXP<Q>TD+AJY$
M 5%=3\ 'BW5*@10*9J2IJS2ZS VE___T0H$C3?2L1(/ "?5!K,'J)KHH_4IM
M55'%JMYQ2)3DZ84ZE1G)FJ+:I"D9SITOKZ;(2)THTY6*I-H3:I.FF5HCC8LS
MI!8(S1.NXP5:7T2[F]I(>#ZEV6Y*F0&%%.&EG=$]3F8]B9M/BY5IXXIZI^L=
M.B,**V?.J![JKK_>!0ND-+B3%.IQTR(X+^\,,30AJ1%UM,R%)HZ;-6Y22B]$
M=82VN'<5'2+EJCB"JQG")#%W65R2A2I/]U+B3%-IWQQKWU3:-TEC63I'JLI'
M.O>%#\_(MN GC)TJ@)';U,@1@)[JP]0,J5!(CQ-@2KI8"QY<D5;6[&FV,XU8
MYLX'=+U&^N44H2ID 5_W3#>*'.EJ4;D8[&K4-DT,W> AK=RLXL.(/I%2, )8
M@=J:FIM+S0Y$6PV$GST2"0:/QJ&]NWNX^V;WS?5NI]TJ#!QSZDK.99C+P=X3
M])S43=TD)[&9*/CIBW(9AJJLS@]X$,J!>'%!\T@)W4.UDO+QZ/3SR0=V9P8#
M-</LT239N9/2Q;V\^TO"0'7)U D59QQ=#SV/^OQN(+TIKI%.TUS>9Y9I2].8
MUSO>HDP43G8L::+6W?^UR]8F9X*%54]% O9(PLGE!8L]04JC3,=EMAN[;9( 
M?>JXMTW^[FV30 7]O7&,!_J04[QW_P]02P$"% ,*    " "Q@0@WW?DO%"8;
M  #\X ( $@              I($     97AE8W5T:6]N7VQO9RYH=&UL4$L%
3!@     !  $ 0    %8;      $! 
end

Mime
View raw message