harmony-alerts mailing list archives

Site index · List index
Message view « Date » · « Thread »
Top « Date » · « Thread »
From nom...@intel.com
Subject [build-test alert] BUILD FAILED Linux x86_64: jdktools-test
Date Tue, 07 Aug 2007 03:01:58 GMT
BUILD FAILED:
	Ant Error Message:
/export/users/cc/cc-common/scripts/cc-exec-adaptor.xml:101: The following error occurred while
executing this line: /export/users/cc/cc-common/adaptors/jdktools-test/adaptor.xml:23: The
following error occurred while executing this line: /export/users/cc/cc-common/scripts/framework.xml:1069:
Java returned: 1

Date of build:	08/07/2007 09:04:09
Time to build:	57 minutes 1 second
Last changed:	08/06/2007 22:09:33
Last log entry:	hdk

***********************************************************
Errors/Warnings:	(7)
            
[junit] Tests FAILED
[exec] Result: 1
BUILD FAILED
/export/users/cc/cc-common/build/checkouts/hdk/working_jdktools/build.xml:242: The following
error occurred while executing this line:
/export/users/cc/cc-common/build/checkouts/hdk/working_jdktools/make/build-test.xml:97: There
were test errors.
Total time: 56 minutes 59 seconds
The execution FAILED with the following exception:
The following error occurred while executing this line:
/export/users/cc/cc-common/adaptors/jdktools-test/adaptor.xml:23: The following error occurred
while executing this line:
/export/users/cc/cc-common/scripts/framework.xml:1069: Java returned: 1

***********************************************************
Unit Tests: (162)
        
error: testGetValues001 org.apache.harmony.jpda.tests.jdwp.ReferenceType.GetValuesTest
Unit Test Error Details:	(1)
                
Test: testGetValues001Class: org.apache.harmony.jpda.tests.jdwp.ReferenceType.GetValuesTestorg.apache.harmony.jpda.tests.framework.TestErrorException:
Debuggee process did not finish during timeout
	at org.apache.harmony.jpda.tests.jdwp.share.JDWPUnitDebuggeeProcessWrapper.WaitForProcessExit(JDWPUnitDebuggeeProcessWrapper.java:284)
	at org.apache.harmony.jpda.tests.jdwp.share.JDWPUnitDebuggeeProcessWrapper.finishProcessAndRedirectors(JDWPUnitDebuggeeProcessWrapper.java:87)
	at org.apache.harmony.jpda.tests.jdwp.share.JDWPUnitDebuggeeWrapper.stop(JDWPUnitDebuggeeWrapper.java:109)
	at org.apache.harmony.jpda.tests.jdwp.share.JDWPTestCase.internalTearDown(JDWPTestCase.java:108)
	at org.apache.harmony.jpda.tests.jdwp.share.JDWPSyncTestCase.internalTearDown(JDWPSyncTestCase.java:83)
	at org.apache.harmony.jpda.tests.jdwp.share.JDWPRawTestCase.tearDown(JDWPRawTestCase.java:118)
Caused by: java.lang.IllegalThreadStateException: process has not exited
	at java.lang.Runtime$SubProcess.exitValue(Runtime.java:357)
	at org.apache.harmony.jpda.tests.jdwp.share.JDWPUnitDebuggeeProcessWrapper.WaitForProcessExit(JDWPUnitDebuggeeProcessWrapper.java:279)
	at org.apache.harmony.jpda.tests.jdwp.share.JDWPUnitDebuggeeProcessWrapper.finishProcessAndRedirectors(JDWPUnitDebuggeeProcessWrapper.java:87)
	... 14 more

***********************************************************
Modifications since last successful build:	(23)
            
add cc-hdk log20070806220933Lbuild.60 08/06/2007 22:09:33hdk
modified mfursov  /harmony/enhanced/drlvm/trunk/vm/jitrino/src/optimizer/hashvaluenumberer.cpp
08/06/2007 21:24:45 Fixes for "continue in finally block" problems for Jitrino.OPT: 1) HARMONY-3816
"[drlvm][jit] BBP fails to provide safe-points on back branches from exception handlers"2)
HARMONY-4596 "[drlvm][opt] OPT crashes with an assertion"Fix for HARMONY-3716: "[drlvm][jit][opt]
Jitrino.OPT misses checkcast insts sometimes."Fix for HARMONY-4600: "[drlvm][jet][lazy] IncompatibleClassChangeError
causes failure of 8 EUT3.2 tests from 'jdtuirefactoring' - regression"
modified mfursov  /harmony/enhanced/drlvm/trunk/vm/jitrino/src/optimizer/inliner.cpp 08/06/2007
21:24:45 Fixes for "continue in finally block" problems for Jitrino.OPT: 1) HARMONY-3816 "[drlvm][jit]
BBP fails to provide safe-points on back branches from exception handlers"2) HARMONY-4596
"[drlvm][opt] OPT crashes with an assertion"Fix for HARMONY-3716: "[drlvm][jit][opt] Jitrino.OPT
misses checkcast insts sometimes."Fix for HARMONY-4600: "[drlvm][jet][lazy] IncompatibleClassChangeError
causes failure of 8 EUT3.2 tests from 'jdtuirefactoring' - regression"
added mfursov  /harmony/enhanced/drlvm/trunk/src/test/regression/H3716/Test.java 08/06/2007
21:24:45 Fixes for "continue in finally block" problems for Jitrino.OPT: 1) HARMONY-3816 "[drlvm][jit]
BBP fails to provide safe-points on back branches from exception handlers"2) HARMONY-4596
"[drlvm][opt] OPT crashes with an assertion"Fix for HARMONY-3716: "[drlvm][jit][opt] Jitrino.OPT
misses checkcast insts sometimes."Fix for HARMONY-4600: "[drlvm][jet][lazy] IncompatibleClassChangeError
causes failure of 8 EUT3.2 tests from 'jdtuirefactoring' - regression"
added mfursov  /harmony/enhanced/drlvm/trunk/src/test/regression/H3716 08/06/2007 21:24:45
Fixes for "continue in finally block" problems for Jitrino.OPT: 1) HARMONY-3816 "[drlvm][jit]
BBP fails to provide safe-points on back branches from exception handlers"2) HARMONY-4596
"[drlvm][opt] OPT crashes with an assertion"Fix for HARMONY-3716: "[drlvm][jit][opt] Jitrino.OPT
misses checkcast insts sometimes."Fix for HARMONY-4600: "[drlvm][jet][lazy] IncompatibleClassChangeError
causes failure of 8 EUT3.2 tests from 'jdtuirefactoring' - regression"
added mfursov  /harmony/enhanced/drlvm/trunk/src/test/regression/H3816/Test.java 08/06/2007
21:24:45 Fixes for "continue in finally block" problems for Jitrino.OPT: 1) HARMONY-3816 "[drlvm][jit]
BBP fails to provide safe-points on back branches from exception handlers"2) HARMONY-4596
"[drlvm][opt] OPT crashes with an assertion"Fix for HARMONY-3716: "[drlvm][jit][opt] Jitrino.OPT
misses checkcast insts sometimes."Fix for HARMONY-4600: "[drlvm][jet][lazy] IncompatibleClassChangeError
causes failure of 8 EUT3.2 tests from 'jdtuirefactoring' - regression"
modified mfursov  /harmony/enhanced/drlvm/trunk/vm/jitrino/src/codegenerator/ia32/Ia32BBPolling.cpp
08/06/2007 21:24:45 Fixes for "continue in finally block" problems for Jitrino.OPT: 1) HARMONY-3816
"[drlvm][jit] BBP fails to provide safe-points on back branches from exception handlers"2)
HARMONY-4596 "[drlvm][opt] OPT crashes with an assertion"Fix for HARMONY-3716: "[drlvm][jit][opt]
Jitrino.OPT misses checkcast insts sometimes."Fix for HARMONY-4600: "[drlvm][jet][lazy] IncompatibleClassChangeError
causes failure of 8 EUT3.2 tests from 'jdtuirefactoring' - regression"
added mfursov  /harmony/enhanced/drlvm/trunk/src/test/regression/H3816 08/06/2007 21:24:45
Fixes for "continue in finally block" problems for Jitrino.OPT: 1) HARMONY-3816 "[drlvm][jit]
BBP fails to provide safe-points on back branches from exception handlers"2) HARMONY-4596
"[drlvm][opt] OPT crashes with an assertion"Fix for HARMONY-3716: "[drlvm][jit][opt] Jitrino.OPT
misses checkcast insts sometimes."Fix for HARMONY-4600: "[drlvm][jet][lazy] IncompatibleClassChangeError
causes failure of 8 EUT3.2 tests from 'jdtuirefactoring' - regression"
added mfursov  /harmony/enhanced/drlvm/trunk/src/test/regression/H3716/run.test.xml 08/06/2007
21:24:45 Fixes for "continue in finally block" problems for Jitrino.OPT: 1) HARMONY-3816 "[drlvm][jit]
BBP fails to provide safe-points on back branches from exception handlers"2) HARMONY-4596
"[drlvm][opt] OPT crashes with an assertion"Fix for HARMONY-3716: "[drlvm][jit][opt] Jitrino.OPT
misses checkcast insts sometimes."Fix for HARMONY-4600: "[drlvm][jet][lazy] IncompatibleClassChangeError
causes failure of 8 EUT3.2 tests from 'jdtuirefactoring' - regression"
added mfursov  /harmony/enhanced/drlvm/trunk/src/test/regression/H3816/run.test.xml 08/06/2007
21:24:45 Fixes for "continue in finally block" problems for Jitrino.OPT: 1) HARMONY-3816 "[drlvm][jit]
BBP fails to provide safe-points on back branches from exception handlers"2) HARMONY-4596
"[drlvm][opt] OPT crashes with an assertion"Fix for HARMONY-3716: "[drlvm][jit][opt] Jitrino.OPT
misses checkcast insts sometimes."Fix for HARMONY-4600: "[drlvm][jet][lazy] IncompatibleClassChangeError
causes failure of 8 EUT3.2 tests from 'jdtuirefactoring' - regression"
modified mfursov  /harmony/enhanced/drlvm/trunk/vm/vmcore/src/jit/jit_runtime_support.cpp
08/06/2007 21:24:45 Fixes for "continue in finally block" problems for Jitrino.OPT: 1) HARMONY-3816
"[drlvm][jit] BBP fails to provide safe-points on back branches from exception handlers"2)
HARMONY-4596 "[drlvm][opt] OPT crashes with an assertion"Fix for HARMONY-3716: "[drlvm][jit][opt]
Jitrino.OPT misses checkcast insts sometimes."Fix for HARMONY-4600: "[drlvm][jet][lazy] IncompatibleClassChangeError
causes failure of 8 EUT3.2 tests from 'jdtuirefactoring' - regression"
added mfursov  /harmony/enhanced/drlvm/trunk/src/test/regression/H4596/Test.java 08/06/2007
21:24:45 Fixes for "continue in finally block" problems for Jitrino.OPT: 1) HARMONY-3816 "[drlvm][jit]
BBP fails to provide safe-points on back branches from exception handlers"2) HARMONY-4596
"[drlvm][opt] OPT crashes with an assertion"Fix for HARMONY-3716: "[drlvm][jit][opt] Jitrino.OPT
misses checkcast insts sometimes."Fix for HARMONY-4600: "[drlvm][jet][lazy] IncompatibleClassChangeError
causes failure of 8 EUT3.2 tests from 'jdtuirefactoring' - regression"
added mfursov  /harmony/enhanced/drlvm/trunk/src/test/regression/H4596 08/06/2007 21:24:45
Fixes for "continue in finally block" problems for Jitrino.OPT: 1) HARMONY-3816 "[drlvm][jit]
BBP fails to provide safe-points on back branches from exception handlers"2) HARMONY-4596
"[drlvm][opt] OPT crashes with an assertion"Fix for HARMONY-3716: "[drlvm][jit][opt] Jitrino.OPT
misses checkcast insts sometimes."Fix for HARMONY-4600: "[drlvm][jet][lazy] IncompatibleClassChangeError
causes failure of 8 EUT3.2 tests from 'jdtuirefactoring' - regression"
added mfursov  /harmony/enhanced/drlvm/trunk/src/test/regression/H4596/run.test.xml 08/06/2007
21:24:45 Fixes for "continue in finally block" problems for Jitrino.OPT: 1) HARMONY-3816 "[drlvm][jit]
BBP fails to provide safe-points on back branches from exception handlers"2) HARMONY-4596
"[drlvm][opt] OPT crashes with an assertion"Fix for HARMONY-3716: "[drlvm][jit][opt] Jitrino.OPT
misses checkcast insts sometimes."Fix for HARMONY-4600: "[drlvm][jet][lazy] IncompatibleClassChangeError
causes failure of 8 EUT3.2 tests from 'jdtuirefactoring' - regression"
add cc-hdk log20070806210044Lbuild.59 08/06/2007 21:00:44hdk
modified odeakin  /harmony/enhanced/classlib/trunk/modules/swing/src/main/java/common/javax/swing/plaf/basic/BasicSliderUI.java
08/06/2007 16:59:30 Apply patch HARMONY-4482 ([classlib][swing] JSlider track size in Harmony
is smaller then in RI)
modified mloenko  /harmony/enhanced/drlvm/trunk/build/make/components/vm/vmcore.xml 08/06/2007
11:55:57 switching the verifiers back until newly found issues are resolved
add cc-hdk log20070806100530Lbuild.58 08/06/2007 10:05:30hdk
modified mloenko  /harmony/enhanced/drlvm/trunk/vm/vmcore/src/verifier-3363/tpool.cpp 08/06/2007
10:01:52 fixed HARMONY-4537 and HARMONY-4538 (access to super class members)
modified mloenko  /harmony/enhanced/drlvm/trunk/vm/vmcore/src/verifier-3363/tpool.h 08/06/2007
10:01:52 fixed HARMONY-4537 and HARMONY-4538 (access to super class members)
modified mloenko  /harmony/enhanced/drlvm/trunk/vm/vmcore/src/verifier-3363/Pass2.cpp 08/06/2007
10:01:52 fixed HARMONY-4537 and HARMONY-4538 (access to super class members)
modified mloenko  /harmony/enhanced/drlvm/trunk/vm/vmcore/src/verifier-3363/context.h 08/06/2007
10:01:52 fixed HARMONY-4537 and HARMONY-4538 (access to super class members)
modified mloenko  /harmony/enhanced/drlvm/trunk/vm/vmcore/src/verifier-3363/tpool.cpp 08/06/2007
10:00:04 fixed HARMONY-4539 and HARMONY-4540 (assignment of arrays to interfaces)

begin 644 execution_log.zip
M4$L#! H    ( #A0!S>JT))GE!,  *V7   2    97AE8W5T:6]N7VQO9RYH
M=&UL[5U]4^,XTO^;^12ZO7KJ0A5QWM^X#$^QP.PP.PQSA)F]IZ;FH82M) ;;
M\LDVD)W:[W[=DAT2B!T%(B8W>]E=UB]2J]7]4W?KQ5)_'/O>7O^2.Y.]?BC8
M7I^2*)YX[/7?ACR(RY'[.]LEW>K__/UO>Z]$$NR^(OC[<D5OZ%?R<^)ZSM#U
M(,DE7EIWOC>78.XF9E$\GU]=,WO,'R2=??%:\Y=+X!S*=8,1N7*N8\Z]B%RZ
M 14NBRS+6F^I<S>VQVA0QDI'99[$8?*@\O.)>3@I7PE61FE&10G'/G?T4J8D
M"Y(@<V6@ESRB)"_]:\<57\F!8#1F#H&;75)A=R$7<26)F(@JM@W_EFWN^SRH
M2 A4[#&SKZ&^467L7%=NN;@&V5]DLD\38<$7@B&EERXVRA>'3*0TEH_3 ^Z'
MKH=X>O?Q<)\\)OD2=:C8'HTBMJ!@O+1GN:QW:B3BB; 9D8@A,7]13@9N@$4#
M">)&9$B]B.T0=Q1P@=SYS.=B<D+O7#_Q!V!L2,1B;*VY],K37VZ2FD5^VS_[
M</SA%^(&SZYLVCXJ5Z%#99TK:>XD<.,*%Z,*#2G0J(RI@,>3^X1192BHSY!B
MY9!=)J,18V=LY$8Q$Q;RFEL#4J(Q ?4QTNINYZ;:$BDQYEC4<4I.6L;VWQ];
MTVF>_\_YY>8XGX2@%3ID\627G(\9Z"P><X=@B:>75\R.M\DE\W@PDMB*(86@
MMR3&;._=X)HY[X%)BYRQ(7 *8)#)1BQ@PK4?)NL?[9%HS!// 9HDI"@_J"  
MPWD.(C22U#<0-.BY3L/8Y4&DC9=JJP P;@#"#*CW4?"0B1A](/BE4@ %[I ;
MZB6 G=6A\QP48?$*13MD&9K>TFA\0L-"**5I^K_N?/Y>2&IL()*NG-NP\I':
MURP^=*.0QI!#VP;5:LT"3+$;%L3_2%C"I!&2MZJD)V+)D"5::H.,69_FCP:(
M>K-7Z)5";VI9V"TY!J,S8J*$SR>J2&O$XF.GM+V]DU_:DM\,M6?:K"?^C)NZ
MF%YZ;*FQDZF,F;O6#P?=;I$M0W9HX"CL'CL[)'WP)(3]*0#2_M$ TF@5!5#_
M!<BJ -%(TME4#'WV3UPAN'Z@U&T461=)/9)1DKQ<"31&HJ)](>AD:6@T364H
M/NK^,/KO5>L%^K^A0FD?+K1U_P/KO?>CZ+U>JQ?I?>@RSU&:CQ+H=Q_@D-D;
M]3#F4LJE[2_NU[7$L3\P7FK5'P<P#4W R,O_.@I]C&S.X*]$1CKN*TZ#0X:!
M8N4T *'?9H_?TR2PQ]G@L"Y\>H5]&+0NY.C.9G+D\ T766&$W<4,@M?[E^1;
M/AUY1U8S,6,<OQ<N]=S?,:@D!;PX'  4\)@X#%()1G#BD<8 I:$;4"^E\QG4
M!AD_'1\2V1(('RJH(4Q-0VESAH0EE(YP9"VJ2._Q*? X=5;%3:'1<7VL'L%;
M*XE=S[H?E2\P/^2),"DH#>>) G8#& %1/\]A;,Y0[)HTV.L4:/ 2N&0T /F=
M)O'I\$3.K9'7:M)MN0Z)OO8\;D,3A3#6E<U\OL"I^@2CSU/?Y@R<KDE]M4ZM
M0']A<NF!_9/T"9*75Z5!+*=*<9)F&[RRX+>12O.!QV]X$C@KF'.R8H@@6)R(
M0)E<Q=>0BT>\;9.AX+Z,&.Y3/I#001+%W'\/CP 9 6/@AM#U@<:80VP>W"A+
MCS$%W$$I/EY*2OW_W5M4@*+U+(!MSO#FV@!6-#(_!S!PLQL+L(>\_:<"3 >#
MFS.".H=![E\"H!QU6ZW6<2Y:&X75JH:;@II"G^. HS.)LY+ 7960&^:<R-[)
M(*8"TCCL.'#8'7G]FLR^/0*89.^*.DED%IPKQ2D//-UBGM?F\73PLCFCI45X
M::R"ET:[R&@)]P9D3::PP1)2]=^Y\1FSF7L#35P_SBE$PQ(\J%[(XMKF<38'
M#X4H;_(L#&S.B.G:,- J<EQN$).C?WX\.C@_.KPX^GSTX7QP<7#ZZ<,Y:/WA
M\_VSL_W_LSP6C.+Q$C \VQPLYNE%S<'F#*+F0V$5'+2+>CA_4AS4-V?@<SU*
MKO66K%+[4VIYPX8NGZWE1J.HM_MGU?*&CBH^6<N=6E%;3ON60^IZB6 G+(KH
MB(&&?_KK7\F;_>/WG\Z.B)/(-+*F>"'CJ.@OY"\_K3KPN(J>'["T/@5OZ*#C
MDQ7<[12YY*<K^#]4OSH0V-"!RT<0.*"1_M!2HZB=XWQ,.J'XL,LNLY^C3LYP
MS2:N_?S [N+/N-Q\/WH/&4M+^^[/->H+.5M?D]_0<<3GZ;M;U.R+]"U^4#7K
M(&$S1_.F [@K!>G=HF^/) #D,HCCPQR=OU%OM=6^DG5/2WY1Y6[8T-OY&"L]
M78]1D?)>R;4W6T4#M3/K%7$=OR0/[CZQXU(J_AU4R_;FKEOZ#&^Y*%RSHI)\
MQ^_.-FPL+X(7K/+N\+>/GR!'-KOR47 07O2;H&&XPF+[1J, 7E2,;M+ED-[W
M70[YO6%2W[!!O+5BH%6$@73Z+YWF^_)U6X(B6Q0)-Y'.M,[TMP:SDI6M, ,<
M;3!J2"@X.$,_(B6XN:4B "%&\^*>NPG!38-JR^S.]A*'Y7_E+K]M3U.!'J/X
MR9^ORR5@GGM9<2!"X),T;895"Z%GI07E\RV28-EW^6=)$"SY*C]+2LAT%=J[
MSR>O5ZP8!)<0YLC+*_P/6@I$V96%S>%1B<QTB5^NL)'?BP-:NZ5:NY6V=B5R
M*2$+6[OUV15Q0KT32 0-UDJ7W&$8D4L=7T:HE5U2VR%O5$\[VB75'7*$ZV#5
MY;GK,\(\&D;,V<65F<U:BT3,7B_9EM5L=]=/MFK5&QT39!O5AA%NNT:$T.VV
MC0BAL7ZR/:O17$(5S/<O!\1Q';GR%*SGC0OV;61?0)1P<<OH]87@/+Z(6'P!
M_28Q*2UR78\X;.AR"'Z^UJGK5KRN3;9AU5H&6A: JFE 2]V:=KO2EVS7ZNFW
MJZ8NV7;+JO6,--=:RPS9YOHUUFE;[=;ZR8(_Z'1[)H30J=5TR;:UD= %-Z.-
M6_VF6[6J+2-NIE[3-C2KD&U7S7!KICE4FT:<8JVJ+5MM4]/HF4)"K6?$A=?J
MVJUL);(=(YZLVC9@P0"W^C9A)2$8T=CZ#4+/:AD(Y-"$MPUXAJ;5-A#00 >D
M;<:/-==O$R%&KFN;1&TO5NM"K\:(PKH&;%</?*.9GIT1$9B0;,\0U69U_3X!
MU-4UXA(:#2,14MT(U9H)<&&4:,1\-UL&XJZ&U>V8Z(^V];L+*X'VV51KCSHA
M0'99+_=H<*XSZ#<=M,9Q<.L7IN9LY>2A7+9S=+ANY?5,#%$@)@Q K6FUN@9<
M!'#;-6 =FM#/,<)M3W^P:A6R1J*PAM4Q(5L@VS# +;AU$UU35)F!5M8&QZXM
M!.TQNQ8T!Q/=?I!MVT#7M&6U3+CVCM6N&O#!:!@-D372>'M-(XVW9V)J"(30
M--#*P(SK#ZFTM$=O&^#+##0'$((!?#6M3L<,LW4#W+:MAH&@I@Y",* Q27;]
M0I!DU]\WJ;<A3#" !."V96 &K@,=-"/-H6O"@+6L>ML(MR:: ]I%_<%;?97U
M+/UA!6VJC2K$B]KXT@Z5FB"#EA&[V#9A;IO0&LPT72,R,.-Q.F;&0%J]]0=*
M$">96#T",C 1VH)1;)D)/7I&VD*[84:V9GK1/1/SQB $$Q%S0S.B63*@]?2U
M<F^Y-_-US7H#H*I5,Q"N=;K0>3'0>CI@10W@L6MU3,RP8J?;P'AZ%V!N1@@-
M _X4'=\2RV1FO9PVB]VJ5351<]"3B2DE[+(8&2$R,3@"AJ!CH$_< 4-@HB>$
MRZ_6CX0.AFF/R<[=Q#RQQ^5A2D\>NU=TI)Y,S62!2].RZ?%[!:FTU^P/]D\&
M+[-H/Z)^M'C5/E[9/+ I*.0#!V9<=?:B.GJ.!FA(2,!P!R^H_EV\0QPN]Y[C
M\?CAJ6]S-T+_"P E!YDX-RV^M:X$.'KNL^>OQR_B"<^=G*[7)^5L&[HU?.>S
M_"Q%8...V5_)OHQJR%L5U1"UZS 39)>4[&URP,.)<$?CF-1Z/6@[]2J$[6C[
MTVP#/HQO<8M>N1D@E1L!<D%<:&Z>:[,@ JSO$ KZ#4-X( ^=R&5%2B$3PD\U
MJV55?UIX^*=,#> O4R\<4V 571"()_18S+!\O 9FH+3<[-%-@-^FMMJ-6KNU
M0TK[R8B0-E:PL[V#Q\XE=Q7FMYMQ963;T V"?P"1^*F&.@PRE_ XCL/=2O8!
M518U0@"IC03[.T'AR/9<,'[D'>I!'1,)0*CBN.N.E  8R7M '/]\ G<B1)%5
M)3(Z%MGW/")?@[EEP/ -<_(/4GU8[_'+5O?=A^.R/-"6C)G<&5)9(OF5%L7/
MM_)-SBR93[B'Q.ZB'D+Z&1/6S#JA4+<O7)W8]Y7TU?;7N*]FM*=7SC1S;@I"
MRI<0<TG2 /\QZ>/?/=E>1R[T18A\>NN"DO!K,Y /"QPTM[R YN(??N[FL"%-
MO#C=RAMI:XH,&'W$)/YR&,6/"K\7GYST$19[<T01Y4A8G=T[Y5,PQQ7,1@?F
M!D_D-0J9[0Y=(('%ZO/ID+XJG(O)E-F,SSE\9]S:Z0&T@,NY@E=F>UHNN1V[
M]OAQ 4/P!^IK?/Q(E(J)?K7< !KCPP*/Y</T=-D9.,MO4*% FL3<!_,O-U/4
M+PML[B4'\_=0U;CGK4@#"+1$T)W1K\-<0Y^E*Z,PN6<];AV9 *?D7PGUE.YG
M,JVLC@AC0BGXRPGNG \VJ<#GGK$(F@;$Q=I6VN'V"]MI>'*(A:I# 5QT\Z@$
MJ.&$+<RV@&]PIR-$S0MS+@:JV#'SPGPE*!>R=<_EM]36_T'>[9_)O@(!:-!\
M,,SD11R[P\D"&GJ(3?-OP8^DI !%2-M!2N01I;G,UVP2@2U@I)]=74C[OB5W
MZ5#QH<)\]CZ?EGPM/Y:^)X:W0$P^78U0B$UJEJLH M4Z0&S*<_:LL'I3.C,D
MMDBV%2T\GY(A)3!]CCL< L[4)M(+BG\\+'+/MA0Z:%;YH NT!U@6_C^KO+9B
M(*'$T6)2UN"-[()9A] _DGZB$!_23F[):JMQ'^HX+BJ7>JE3+&+$@\8[GQO$
MPVXS=PIW(8^BPNB];#,!,:8$J>-&H4<G!!^!^<3=ER-2@M8-K@&BB*P]8/4R
MW@N$'D>4],\'^Q>?SM[O(?DYW+H^ S11/T0G,^;"C1_OUCM+"GE2Y/#J0C;B
M6<3)!YDN(=EL)?()@]SN)J0_YF""0/(0:4=[WW;[:(OV_I!BA=<R^@;+ XE(
MFDC* %/M$&:-+)704@DM,(&[M7JCN:18U1[Q[Q1$LXUQKNS2V_/SC]@?&YP>
M_#HH$'H*!*'\GO*92/G>#R)]6TS"F(\$#2'.D&5 %S,#T>/-V!]1EW3Z&=?9
M4TF^H,5'BYE;B3>Y<[U/ SK"(&*YP;HO=)[G>TNEQSPT^G5QCVY0-2@T.33&
M$2^M@N=K,,VL6P5L$.NOPZRMT"M[MAJSV77KX3OKKX6?;F#HN*.\(:V'A<]K
M8Y[ \JH\"JP D!@4D3(&..:#J]P:_IKRD<A(*C=9QNZW<C\]G549L3]FGZBX
M"9_UU>7%#2Z W_O#LBQ2?M='LEDB3>X"?AMDY\$N'J9449Q$G&#_VMKZ18U"
ML#FHP9MDT63B3'Z4KBV\K:T#O)KWB8+=9+X,S]-*"L+)LCH5(P8ZZN+>],0<
MW B/QPJ-T,\JH.(P')$#+WK&?'[#B)P)4J'04B.X5590@MQ'\F).%,B%#%30
MO42QPPM"CJWRB 50'E :,.B5RLI@/A6LN2(;\P')%!!!B .)\S%T1"3<L];#
M57Q/0*XTTW(!'76^%5 Z5@==T;F*E>PQ=8-M)$K)P>!,;9]70 XJ87L\ "D?
M)G*,-<8#T[!J4MK%.648ZB!::#":CUX+,D*P&\2VA,='O$1M*!T\J(S4=&%<
MNE6.F#=4M*:8A_X&/$SCWSF"TNQ-IPZ W2+"6=0_7T'-4'_KOA_T.>L%S7(B
MU:37_-\B.#0MDS*DWQZ8I_PA6PCC=K<>Y%9HS^?M"3--TBPOFV510\:HF//3
MT_>#G'D6>6G/IFZ1B"?"9ND %8!I?5X$<JMQHEP^!FZ 1:-3A88M#PK9(8 \
M+C<F]N7!92?TSO43?^#^CJ<8QO'#^:A9>CHG,QC9TTW=1<)6&[MA68MV=%-2
M48GEV'0%IT?EGVI->^NVHF,FL[[PW*&-<E/0N[N[.GE-:JMLW#;]+=T'5!W 
MDE9$%K7^XU6R?=5(J9;MJK:.3=54@WF)"5KU=U,G:(L,QTM-T&JL_;H7)1Y0
M&:7+P" (':!S48>##2@ KWCMEYDU-/K?YG>L;F/]ZQH;[9;5,;"75=?J+-AP
M:=Z9?><%&2K^+H,S*3,_C"=%2=/YBJ4)==/A'$)9]9GF4RF9JS<@>4&#2!UQ
M!](%M59KG8Z?W]H0I%AYH@B@2371S:N,8]^KN+@KMX67^?6,QI!\847G;B (
M6IY(J4OJ5JB)D/RT/W\Z?G^X:+WH6F1AW?G>;KU95QN.#CE..\GS$!"=A-MV
M(@38W=NQ*X^:8W8B;7.,G1'TR+MK9<FGUZQR'_-)YGH=R1O$SK?X1V)"M9V"
MJ;!S'H/O5TAKM8GO!@GV1%MRA26'SO"K5UC?M$+0@5+R57%^/"^);*/RW5=/
M%5&!6*A#0[#=T=11RHIGCY5V&D]73D')D2W<</;<>%E8K=KN[:J5&&HC7&FP
M7_4K=*]?@; "_EYR9P+_P]:R]V]02P$"% ,*    "  X4 <WJM"29Y03  "M
MEP  $@              I($     97AE8W5T:6]N7VQO9RYH=&UL4$L%!@  
0   !  $ 0    ,03      $! 
end

Mime
View raw message