harmony-alerts mailing list archives

Site index · List index
Message view « Date » · « Thread »
Top « Date » · « Thread »
From nom...@intel.com
Subject [build-test alert] FAILED Linux x86: stress
Date Tue, 07 Aug 2007 01:29:38 GMT
svn.revision=563025
BUILD FAILED:
	Ant Error Message:
/export/users/cc/cc-suites/scripts/cc-exec-adaptor.xml:101: The following error occurred while executing this line: /export/users/cc/cc-suites/adaptors/stress/adaptor.xml:100: The following error occurred while executing this line: /export/users/cc/cc-suites/adaptors/stress/adaptor.xml:116: The following error occurred while executing this line: /export/users/cc/cc-suites/scripts/framework.xml:1069: Java returned: 1

Date of build:	08/07/2007 05:34:04
Time to build:	175 minutes 13 seconds
Last changed:	08/06/2007 19:33:36
Last log entry:	snapshot

***********************************************************
Errors/Warnings:	(4)
            
BUILD FAILED
/export/users/cc/cc-suites/tests/stress/qa/build.xml:169: Java returned: 255
Total time: 175 minutes 6 seconds
The execution FAILED with the following exception:
The following error occurred while executing this line:
/export/users/cc/cc-suites/adaptors/stress/adaptor.xml:100: The following error occurred while executing this line:
/export/users/cc/cc-suites/adaptors/stress/adaptor.xml:116: The following error occurred while executing this line:
/export/users/cc/cc-suites/scripts/framework.xml:1069: Java returned: 1

***********************************************************
Unit Tests: (193)
        
error: test stress.org.apache.harmony.test.stress.classloader.MixThreads.ConstantPool.testCPLmt1
error: test stress.org.apache.harmony.test.stress.classloader.MixThreads.ConstantPool.testCPLmt2
error: test stress.org.apache.harmony.test.stress.classloader.MixThreads.FieldsLmt.testFieldsLmt1
error: test stress.org.apache.harmony.test.stress.classloader.MixThreads.FieldsLmt.testFieldsLmt2
error: test stress.org.apache.harmony.test.stress.classloader.MixThreads.LargeClassName.testLargeClassName_R1
error: test stress.org.apache.harmony.test.stress.classloader.MixThreads.LargeClassName.testLargeClassName_W1
error: test stress.org.apache.harmony.test.stress.classloader.MixThreads.WrongClasses.testNECLoad1
error: test stress.org.apache.harmony.test.stress.classloader.MixThreads.WrongClasses.testNECLoad2
error: test stress.org.apache.harmony.test.stress.classloader.MixThreads.WrongClasses.testWCLoad1
error: test stress.org.apache.harmony.test.stress.classloader.MixThreads.WrongClasses.testWCLoad2
error: test stress.org.apache.harmony.test.stress.classloader.NotSynchThreads.ConstantPool.testCPLmt
error: test stress.org.apache.harmony.test.stress.classloader.NotSynchThreads.SupIntf.testManySupIntf1
error: test stress.org.apache.harmony.test.stress.classloader.NotSynchThreads.SupIntf.testManySupIntf2
error: test stress.org.apache.harmony.test.stress.classloader.NotSynchThreads.WrongClasses.testNECLoad
error: test stress.org.apache.harmony.test.stress.classloader.NotSynchThreads.WrongClasses.testWCLoad
error: test stress.org.apache.harmony.test.stress.classloader.OneThread.LargeClassName.testLargeClassName_W2
error: test stress.org.apache.harmony.test.stress.classloader.OneThread.MethodArgs.testMethodArgs
error: test stress.org.apache.harmony.test.stress.classloader.OneThread.MethodNameLmt.testMethodNameLmt
error: test stress.org.apache.harmony.test.stress.classloader.OneThread.SubClasses.testManySubClasses
error: test stress.org.apache.harmony.test.stress.classloader.OneThread.SupIntf.testManySupIntf1
error: test stress.org.apache.harmony.test.stress.classloader.OneThread.WrongClasses.testWCLoad
error: test stress.org.apache.harmony.test.stress.classloader.SynchThreads.ConstantPool.testCPLmt1
error: test stress.org.apache.harmony.test.stress.classloader.SynchThreads.ConstantPool.testCPLmt2
error: test stress.org.apache.harmony.test.stress.classloader.SynchThreads.FieldsLmt.testFieldsLmt1
error: test stress.org.apache.harmony.test.stress.classloader.SynchThreads.FieldsLmt.testFieldsLmt2
error: test stress.org.apache.harmony.test.stress.classloader.SynchThreads.LargeClassName.testLargeClassName_R1
error: test stress.org.apache.harmony.test.stress.classloader.SynchThreads.LargeClassName.testLargeClassName_W1
error: test stress.org.apache.harmony.test.stress.classloader.SynchThreads.LargeClassName.testLargeClassName_W2
error: test stress.org.apache.harmony.test.stress.classloader.SynchThreads.MethodArgs.testMethodArgs1
error: test stress.org.apache.harmony.test.stress.classloader.SynchThreads.SupIntf.testManySupIntf1
error: test stress.org.apache.harmony.test.stress.classloader.SynchThreads.SupIntf.testManySupIntf2
error: test stress.org.apache.harmony.test.stress.classloader.SynchThreads.SupIntf.testManySupIntf3
error: test stress.org.apache.harmony.test.stress.classloader.SynchThreads.SupIntf.testManySupIntf4
error: test stress.org.apache.harmony.test.stress.classloader.SynchThreads.WrongClasses.testNECLoad1
error: test stress.org.apache.harmony.test.stress.classloader.SynchThreads.WrongClasses.testNECLoad2
error: test stress.org.apache.harmony.test.stress.classloader.SynchThreads.WrongClasses.testWCLoad1
error: test stress.org.apache.harmony.test.stress.classloader.SynchThreads.WrongClasses.testWCLoad2
error: test stress.org.apache.harmony.test.stress.gc.frag.FragmentationGCFinalizeTest3.FragmentationGCFinalizeTest3
error: test stress.org.apache.harmony.test.stress.gc.frag.FragmentationSimpleTest2.FragmentationSimpleTest2
error: test stress.org.apache.harmony.test.stress.gc.frag.FragmentationSimpleTest6.FragmentationSimpleTest6
error: test stress.org.apache.harmony.test.stress.jni.stack.StackTest3
error: test stress.org.apache.harmony.test.stress.jni.strings.StringsTest1
error: test stress.org.apache.harmony.test.stress.jni.strings.StringsTest2
error: test stress.org.apache.harmony.test.stress.jni.strings.StringsTest3
error: test stress.org.apache.harmony.test.stress.jni.strings.StringsTest7
error: test stress.org.apache.harmony.test.stress.jpda.jdwp.scenario.FRAME002.FrameTest002
error: test stress.org.apache.harmony.test.stress.jpda.jdwp.scenario.MEMORY005.MemoryTest005
error: test stress.org.apache.harmony.test.stress.jpda.jdwp.scenario.MEMORY006.MemoryTest006
error: test stress.org.apache.harmony.test.stress.jpda.jdwp.scenario.MEMORY007.MemoryTest007
error: test stress.org.apache.harmony.test.stress.jpda.jdwp.scenario.OBJECT006.ObjectTest006
error: test stress.org.apache.harmony.test.stress.jpda.jdwp.scenario.OBJECT007.ObjectTest007
error: test stress.org.apache.harmony.test.stress.jpda.jdwp.scenario.THREAD002.ThreadTest002
error: test stress.org.apache.harmony.test.stress.jpda.jdwp.scenario.THREAD004.ThreadTest004
error: test stress.org.apache.harmony.test.stress.jpda.jdwp.scenario.THREAD007.ThreadTest007
error: test stress.org.apache.harmony.test.stress.jpda.jdwp.scenario.THREAD008.ThreadTest008
error: test stress.org.apache.harmony.test.stress.jpda.jdwp.scenario.THREAD010.ThreadTest010
error: test stress.org.apache.harmony.test.stress.misc.WaitNotifyTest
Unit Test Error Details:	(57)
                
Test: testClass: stress.org.apache.harmony.test.stress.classloader.MixThreads.ConstantPool.testCPLmt1java version "1.5.0" 
pre-alpha : not complete or compatible
svn = r563025, (Aug  6 2007), Linux/ia32/gcc 3.3.3, release build
http://harmony.apache.org
The GC did not provide gc_add_weak_root_set_entry()

Apache Harmony Launcher : (c) Copyright 1991, 2006 The Apache Software Foundation or its licensors, as applicable.
[debug] started null(org.apache.harmony.test.share.stress.ReliabilityRunner)
[debug] timeToWork = 30, timeToAbort = 30
[debug] started null(org.apache.harmony.test.share.stress.generator.Thread)
[debug] Thread.setContext  { org.apache.harmony.test.stress.classloader.MixThreads.ConstantPool.testCPLmt {} }
[debug] Starting 1 threads
[debug] completed null(org.apache.harmony.test.share.stress.generator.Thread)
[debug] ThreadToRun.run()
[debug] Generator.execute()
[debug] class = org.apache.harmony.test.stress.classloader.MixThreads.ConstantPool.testCPLmt
[debug] org.apache.harmony.test.stress.classloader.MixThreads.ConstantPool.testCPLmt { }
[debug] started test(or...
Test: testClass: stress.org.apache.harmony.test.stress.classloader.MixThreads.ConstantPool.testCPLmt2java version "1.5.0" 
pre-alpha : not complete or compatible
svn = r563025, (Aug  6 2007), Linux/ia32/gcc 3.3.3, release build
http://harmony.apache.org
The GC did not provide gc_add_weak_root_set_entry()

Apache Harmony Launcher : (c) Copyright 1991, 2006 The Apache Software Foundation or its licensors, as applicable.
[debug] started null(org.apache.harmony.test.share.stress.ReliabilityRunner)
[debug] timeToWork = 30, timeToAbort = 30
[debug] started null(org.apache.harmony.test.share.stress.generator.Thread)
[debug] Thread.setContext  { org.apache.harmony.test.stress.classloader.MixThreads.ConstantPool.testCPLmt {} }
[debug] Starting 1 threads
[debug] ThreadToRun.run()
[debug] completed null(org.apache.harmony.test.share.stress.generator.Thread)
[debug] Generator.execute()
[debug] class = org.apache.harmony.test.stress.classloader.MixThreads.ConstantPool.testCPLmt
[debug] org.apache.harmony.test.stress.classloader.MixThreads.ConstantPool.testCPLmt { }
[debug] started test(or...
Test: testClass: stress.org.apache.harmony.test.stress.classloader.MixThreads.FieldsLmt.testFieldsLmt1java version "1.5.0" 
pre-alpha : not complete or compatible
svn = r563025, (Aug  6 2007), Linux/ia32/gcc 3.3.3, release build
http://harmony.apache.org
The GC did not provide gc_add_weak_root_set_entry()

Apache Harmony Launcher : (c) Copyright 1991, 2006 The Apache Software Foundation or its licensors, as applicable.
[debug] started null(org.apache.harmony.test.share.stress.ReliabilityRunner)
[debug] timeToWork = 30, timeToAbort = 30
[debug] started null(org.apache.harmony.test.share.stress.generator.Thread)
[debug] Thread.setContext  { org.apache.harmony.test.stress.classloader.MixThreads.FieldsLmt.testFieldsLmt {} }
[debug] Starting 1 threads
[debug] ThreadToRun.run()
[debug] completed null(org.apache.harmony.test.share.stress.generator.Thread)
[debug] Generator.execute()
[debug] class = org.apache.harmony.test.stress.classloader.MixThreads.FieldsLmt.testFieldsLmt
[debug] org.apache.harmony.test.stress.classloader.MixThreads.FieldsLmt.testFieldsLmt { }
[debug] started test...
Test: testClass: stress.org.apache.harmony.test.stress.classloader.MixThreads.FieldsLmt.testFieldsLmt2java version "1.5.0" 
pre-alpha : not complete or compatible
svn = r563025, (Aug  6 2007), Linux/ia32/gcc 3.3.3, release build
http://harmony.apache.org
The GC did not provide gc_add_weak_root_set_entry()

Apache Harmony Launcher : (c) Copyright 1991, 2006 The Apache Software Foundation or its licensors, as applicable.
[debug] started null(org.apache.harmony.test.share.stress.ReliabilityRunner)
[debug] timeToWork = 30, timeToAbort = 30
[debug] started null(org.apache.harmony.test.share.stress.generator.Thread)
[debug] Thread.setContext  { org.apache.harmony.test.stress.classloader.MixThreads.FieldsLmt.testFieldsLmt {} }
[debug] Starting 1 threads
[debug] ThreadToRun.run()
[debug] Generator.execute()
[debug] class = org.apache.harmony.test.stress.classloader.MixThreads.FieldsLmt.testFieldsLmt
[debug] org.apache.harmony.test.stress.classloader.MixThreads.FieldsLmt.testFieldsLmt { }
[debug] completed null(org.apache.harmony.test.share.stress.generator.Thread)
[debug] started test...
Test: testClass: stress.org.apache.harmony.test.stress.classloader.MixThreads.LargeClassName.testLargeClassName_R1java version "1.5.0" 
pre-alpha : not complete or compatible
svn = r563025, (Aug  6 2007), Linux/ia32/gcc 3.3.3, release build
http://harmony.apache.org
The GC did not provide gc_add_weak_root_set_entry()

Apache Harmony Launcher : (c) Copyright 1991, 2006 The Apache Software Foundation or its licensors, as applicable.
[debug] started null(org.apache.harmony.test.share.stress.ReliabilityRunner)
[debug] timeToWork = 30, timeToAbort = 30
[debug] started null(org.apache.harmony.test.share.stress.generator.Thread)
[debug] Thread.setContext  { org.apache.harmony.test.stress.classloader.MixThreads.LargeClassName.testLCN {} }
[debug] Starting 1 threads
[debug] ThreadToRun.run()
[debug] Generator.execute()
[debug] class = org.apache.harmony.test.stress.classloader.MixThreads.LargeClassName.testLCN
[debug] completed null(org.apache.harmony.test.share.stress.generator.Thread)
[debug] org.apache.harmony.test.stress.classloader.MixThreads.LargeClassName.testLCN { }
[debug] started test(or...
Test: testClass: stress.org.apache.harmony.test.stress.classloader.MixThreads.LargeClassName.testLargeClassName_W1java version "1.5.0" 
pre-alpha : not complete or compatible
svn = r563025, (Aug  6 2007), Linux/ia32/gcc 3.3.3, release build
http://harmony.apache.org
The GC did not provide gc_add_weak_root_set_entry()

Apache Harmony Launcher : (c) Copyright 1991, 2006 The Apache Software Foundation or its licensors, as applicable.
[debug] started null(org.apache.harmony.test.share.stress.ReliabilityRunner)
[debug] timeToWork = 30, timeToAbort = 30
[debug] started null(org.apache.harmony.test.share.stress.generator.Thread)
[debug] Thread.setContext  { org.apache.harmony.test.stress.classloader.MixThreads.LargeClassName.testLCN {} }
[debug] Starting 1 threads
[debug] ThreadToRun.run()
[debug] Generator.execute()
[debug] completed null(org.apache.harmony.test.share.stress.generator.Thread)
[debug] class = org.apache.harmony.test.stress.classloader.MixThreads.LargeClassName.testLCN
[debug] org.apache.harmony.test.stress.classloader.MixThreads.LargeClassName.testLCN { }
[debug] started test(or...
Test: testClass: stress.org.apache.harmony.test.stress.classloader.MixThreads.WrongClasses.testNECLoad1java version "1.5.0" 
pre-alpha : not complete or compatible
svn = r563025, (Aug  6 2007), Linux/ia32/gcc 3.3.3, release build
http://harmony.apache.org
The GC did not provide gc_add_weak_root_set_entry()

Apache Harmony Launcher : (c) Copyright 1991, 2006 The Apache Software Foundation or its licensors, as applicable.
[debug] started null(org.apache.harmony.test.share.stress.ReliabilityRunner)
[debug] timeToWork = 30, timeToAbort = 30
[debug] started null(org.apache.harmony.test.share.stress.generator.Thread)
[debug] Thread.setContext  { org.apache.harmony.test.stress.classloader.MixThreads.WrongClasses.testNECLoad_MT {} }
[debug] Starting 1 threads
[debug] ThreadToRun.run()
[debug] Generator.execute()
[debug] class = org.apache.harmony.test.stress.classloader.MixThreads.WrongClasses.testNECLoad_MT
[debug] completed null(org.apache.harmony.test.share.stress.generator.Thread)
[debug] org.apache.harmony.test.stress.classloader.MixThreads.WrongClasses.testNECLoad_MT { }
[debug] ...
Test: testClass: stress.org.apache.harmony.test.stress.classloader.MixThreads.WrongClasses.testNECLoad2java version "1.5.0" 
pre-alpha : not complete or compatible
svn = r563025, (Aug  6 2007), Linux/ia32/gcc 3.3.3, release build
http://harmony.apache.org
The GC did not provide gc_add_weak_root_set_entry()

Apache Harmony Launcher : (c) Copyright 1991, 2006 The Apache Software Foundation or its licensors, as applicable.
[debug] started null(org.apache.harmony.test.share.stress.ReliabilityRunner)
[debug] timeToWork = 30, timeToAbort = 30
[debug] started null(org.apache.harmony.test.share.stress.generator.Thread)
[debug] Thread.setContext  { org.apache.harmony.test.stress.classloader.MixThreads.WrongClasses.testNECLoad_MT {} }
[debug] Starting 1 threads
[debug] ThreadToRun.run()
[debug] Generator.execute()
[debug] class = org.apache.harmony.test.stress.classloader.MixThreads.WrongClasses.testNECLoad_MT
[debug] org.apache.harmony.test.stress.classloader.MixThreads.WrongClasses.testNECLoad_MT { }
[debug] completed null(org.apache.harmony.test.share.stress.generator.Thread)
[debug] ...
Test: testClass: stress.org.apache.harmony.test.stress.classloader.MixThreads.WrongClasses.testWCLoad1java version "1.5.0" 
pre-alpha : not complete or compatible
svn = r563025, (Aug  6 2007), Linux/ia32/gcc 3.3.3, release build
http://harmony.apache.org
The GC did not provide gc_add_weak_root_set_entry()

Apache Harmony Launcher : (c) Copyright 1991, 2006 The Apache Software Foundation or its licensors, as applicable.
[debug] started null(org.apache.harmony.test.share.stress.ReliabilityRunner)
[debug] timeToWork = 30, timeToAbort = 30
[debug] started null(org.apache.harmony.test.share.stress.generator.Thread)
[debug] Thread.setContext  { org.apache.harmony.test.stress.classloader.MixThreads.WrongClasses.testWCLoad_MT {} }
[debug] Starting 1 threads
[debug] ThreadToRun.run()
[debug] completed null(org.apache.harmony.test.share.stress.generator.Thread)
[debug] Generator.execute()
[debug] class = org.apache.harmony.test.stress.classloader.MixThreads.WrongClasses.testWCLoad_MT
[debug] org.apache.harmony.test.stress.classloader.MixThreads.WrongClasses.testWCLoad_MT { }
[debug] sta...
Test: testClass: stress.org.apache.harmony.test.stress.classloader.MixThreads.WrongClasses.testWCLoad2java version "1.5.0" 
pre-alpha : not complete or compatible
svn = r563025, (Aug  6 2007), Linux/ia32/gcc 3.3.3, release build
http://harmony.apache.org
The GC did not provide gc_add_weak_root_set_entry()

Apache Harmony Launcher : (c) Copyright 1991, 2006 The Apache Software Foundation or its licensors, as applicable.
[debug] started null(org.apache.harmony.test.share.stress.ReliabilityRunner)
[debug] timeToWork = 30, timeToAbort = 30
[debug] started null(org.apache.harmony.test.share.stress.generator.Thread)
[debug] Thread.setContext  { org.apache.harmony.test.stress.classloader.MixThreads.WrongClasses.testWCLoad_MT {} }
[debug] Starting 1 threads
[debug] completed null(org.apache.harmony.test.share.stress.generator.Thread)
[debug] ThreadToRun.run()
[debug] Generator.execute()
[debug] class = org.apache.harmony.test.stress.classloader.MixThreads.WrongClasses.testWCLoad_MT
[debug] org.apache.harmony.test.stress.classloader.MixThreads.WrongClasses.testWCLoad_MT { }
[debug] sta...
Test: testClass: stress.org.apache.harmony.test.stress.classloader.NotSynchThreads.ConstantPool.testCPLmtjava version "1.5.0" 
pre-alpha : not complete or compatible
svn = r563025, (Aug  6 2007), Linux/ia32/gcc 3.3.3, release build
http://harmony.apache.org
The GC did not provide gc_add_weak_root_set_entry()

Apache Harmony Launcher : (c) Copyright 1991, 2006 The Apache Software Foundation or its licensors, as applicable.
[debug] started null(org.apache.harmony.test.share.stress.ReliabilityRunner)
[debug] timeToWork = 30, timeToAbort = 30
[debug] started null(org.apache.harmony.test.share.stress.generator.Thread)
[debug] Thread.setContext  { org.apache.harmony.test.stress.classloader.NotSynchThreads.ConstantPool.testCPLmt {} }
[debug] Starting 1 threads
[debug] ThreadToRun.run()
[debug] Generator.execute()
[debug] class = org.apache.harmony.test.stress.classloader.NotSynchThreads.ConstantPool.testCPLmt
[debug] completed null(org.apache.harmony.test.share.stress.generator.Thread)
[debug] org.apache.harmony.test.stress.classloader.NotSynchThreads.ConstantPool.testCPLmt { }
[debug] ...
Test: testClass: stress.org.apache.harmony.test.stress.classloader.NotSynchThreads.SupIntf.testManySupIntf1java version "1.5.0" 
pre-alpha : not complete or compatible
svn = r563025, (Aug  6 2007), Linux/ia32/gcc 3.3.3, release build
http://harmony.apache.org
The GC did not provide gc_add_weak_root_set_entry()

Apache Harmony Launcher : (c) Copyright 1991, 2006 The Apache Software Foundation or its licensors, as applicable.
[debug] started null(org.apache.harmony.test.share.stress.ReliabilityRunner)
[debug] timeToWork = 30, timeToAbort = 30
[debug] started null(org.apache.harmony.test.share.stress.generator.Thread)
[debug] Thread.setContext  { org.apache.harmony.test.stress.classloader.NotSynchThreads.SupIntf.testManySupIntf1 {} }
[debug] Starting 1 threads
[debug] ThreadToRun.run()
[debug] Generator.execute()
[debug] class = org.apache.harmony.test.stress.classloader.NotSynchThreads.SupIntf.testManySupIntf1
[debug] completed null(org.apache.harmony.test.share.stress.generator.Thread)
[debug] org.apache.harmony.test.stress.classloader.NotSynchThreads.SupIntf.testManySupIntf1 { }
[d...
Test: testClass: stress.org.apache.harmony.test.stress.classloader.NotSynchThreads.SupIntf.testManySupIntf2java version "1.5.0" 
pre-alpha : not complete or compatible
svn = r563025, (Aug  6 2007), Linux/ia32/gcc 3.3.3, release build
http://harmony.apache.org
The GC did not provide gc_add_weak_root_set_entry()

Apache Harmony Launcher : (c) Copyright 1991, 2006 The Apache Software Foundation or its licensors, as applicable.
[debug] started null(org.apache.harmony.test.share.stress.ReliabilityRunner)
[debug] timeToWork = 30, timeToAbort = 30
[debug] started null(org.apache.harmony.test.share.stress.generator.Thread)
[debug] Thread.setContext  { org.apache.harmony.test.stress.classloader.NotSynchThreads.SupIntf.testManySupIntf2 {} }
[debug] Starting 1 threads
[debug] ThreadToRun.run()
[debug] completed null(org.apache.harmony.test.share.stress.generator.Thread)
[debug] Generator.execute()
[debug] class = org.apache.harmony.test.stress.classloader.NotSynchThreads.SupIntf.testManySupIntf2
[debug] org.apache.harmony.test.stress.classloader.NotSynchThreads.SupIntf.testManySupIntf2 { }
[d...
Test: testClass: stress.org.apache.harmony.test.stress.classloader.NotSynchThreads.WrongClasses.testNECLoadjava version "1.5.0" 
pre-alpha : not complete or compatible
svn = r563025, (Aug  6 2007), Linux/ia32/gcc 3.3.3, release build
http://harmony.apache.org
The GC did not provide gc_add_weak_root_set_entry()

Apache Harmony Launcher : (c) Copyright 1991, 2006 The Apache Software Foundation or its licensors, as applicable.
[debug] started null(org.apache.harmony.test.share.stress.ReliabilityRunner)
[debug] timeToWork = 30, timeToAbort = 30
[debug] started null(org.apache.harmony.test.share.stress.generator.Thread)
[debug] Thread.setContext  { org.apache.harmony.test.stress.classloader.NotSynchThreads.WrongClasses.testNECLoad_NST {} }
[debug] Starting 1 threads
[debug] ThreadToRun.run()
[debug] Generator.execute()
[debug] class = org.apache.harmony.test.stress.classloader.NotSynchThreads.WrongClasses.testNECLoad_NST
[debug] completed null(org.apache.harmony.test.share.stress.generator.Thread)
[debug] org.apache.harmony.test.stress.classloader.NotSynchThreads.WrongClasses.testNECLoa...
Test: testClass: stress.org.apache.harmony.test.stress.classloader.NotSynchThreads.WrongClasses.testWCLoadjava version "1.5.0" 
pre-alpha : not complete or compatible
svn = r563025, (Aug  6 2007), Linux/ia32/gcc 3.3.3, release build
http://harmony.apache.org
The GC did not provide gc_add_weak_root_set_entry()

Apache Harmony Launcher : (c) Copyright 1991, 2006 The Apache Software Foundation or its licensors, as applicable.
[debug] started null(org.apache.harmony.test.share.stress.ReliabilityRunner)
[debug] timeToWork = 30, timeToAbort = 30
[debug] started null(org.apache.harmony.test.share.stress.generator.Thread)
[debug] Thread.setContext  { org.apache.harmony.test.stress.classloader.NotSynchThreads.WrongClasses.testWCLoad_NST {} }
[debug] Starting 1 threads
[debug] ThreadToRun.run()
[debug] Generator.execute()
[debug] class = org.apache.harmony.test.stress.classloader.NotSynchThreads.WrongClasses.testWCLoad_NST
[debug] completed null(org.apache.harmony.test.share.stress.generator.Thread)
[debug] org.apache.harmony.test.stress.classloader.NotSynchThreads.WrongClasses.testWCLoad_N...
Test: testClass: stress.org.apache.harmony.test.stress.classloader.OneThread.LargeClassName.testLargeClassName_W2java version "1.5.0" 
pre-alpha : not complete or compatible
svn = r563025, (Aug  6 2007), Linux/ia32/gcc 3.3.3, release build
http://harmony.apache.org
The GC did not provide gc_add_weak_root_set_entry()

Apache Harmony Launcher : (c) Copyright 1991, 2006 The Apache Software Foundation or its licensors, as applicable.
[debug] started null(org.apache.harmony.test.share.stress.ReliabilityRunner)
[debug] timeToWork = 30, timeToAbort = 30
[debug] started null(org.apache.harmony.test.share.stress.generator.Thread)
[debug] Thread.setContext  { org.apache.harmony.test.stress.classloader.share.LargeClassName.testLCN_W {} }
[debug] Starting 1 threads
[debug] ThreadToRun.run()
[debug] completed null(org.apache.harmony.test.share.stress.generator.Thread)
[debug] Generator.execute()
[debug] class = org.apache.harmony.test.stress.classloader.share.LargeClassName.testLCN_W
[debug] org.apache.harmony.test.stress.classloader.share.LargeClassName.testLCN_W { }
[debug] started test(org.apache....
Test: testClass: stress.org.apache.harmony.test.stress.classloader.OneThread.MethodArgs.testMethodArgsjava version "1.5.0" 
pre-alpha : not complete or compatible
svn = r563025, (Aug  6 2007), Linux/ia32/gcc 3.3.3, release build
http://harmony.apache.org
The GC did not provide gc_add_weak_root_set_entry()

Apache Harmony Launcher : (c) Copyright 1991, 2006 The Apache Software Foundation or its licensors, as applicable.
[debug] started null(org.apache.harmony.test.share.stress.ReliabilityRunner)
[debug] timeToWork = 30, timeToAbort = 30
[debug] started null(org.apache.harmony.test.share.stress.generator.Thread)
[debug] Thread.setContext  { org.apache.harmony.test.stress.classloader.share.MethodArgs.testMethodArgs_R {} }
[debug] Starting 1 threads
[debug] ThreadToRun.run()
[debug] Generator.execute()
[debug] class = org.apache.harmony.test.stress.classloader.share.MethodArgs.testMethodArgs_R
[debug] org.apache.harmony.test.stress.classloader.share.MethodArgs.testMethodArgs_R { }
[debug] completed null(org.apache.harmony.test.share.stress.generator.Thread)
[debug] started test(or...
Test: testClass: stress.org.apache.harmony.test.stress.classloader.OneThread.MethodNameLmt.testMethodNameLmtjava version "1.5.0" 
pre-alpha : not complete or compatible
svn = r563025, (Aug  6 2007), Linux/ia32/gcc 3.3.3, release build
http://harmony.apache.org
The GC did not provide gc_add_weak_root_set_entry()

Apache Harmony Launcher : (c) Copyright 1991, 2006 The Apache Software Foundation or its licensors, as applicable.
[debug] started null(org.apache.harmony.test.share.stress.ReliabilityRunner)
[debug] timeToWork = 30, timeToAbort = 30
[debug] started null(org.apache.harmony.test.share.stress.generator.Thread)
[debug] Thread.setContext  { org.apache.harmony.test.stress.classloader.OneThread.MethodNameLmt.testMethodNameLmt {} }
[debug] Starting 1 threads
[debug] ThreadToRun.run()
[debug] completed null(org.apache.harmony.test.share.stress.generator.Thread)
[debug] Generator.execute()
[debug] class = org.apache.harmony.test.stress.classloader.OneThread.MethodNameLmt.testMethodNameLmt
[debug] org.apache.harmony.test.stress.classloader.OneThread.MethodNameLmt.testMethodNameLmt { }...
Test: testClass: stress.org.apache.harmony.test.stress.classloader.OneThread.SubClasses.testManySubClassesjava version "1.5.0" 
pre-alpha : not complete or compatible
svn = r563025, (Aug  6 2007), Linux/ia32/gcc 3.3.3, release build
http://harmony.apache.org
The GC did not provide gc_add_weak_root_set_entry()

Apache Harmony Launcher : (c) Copyright 1991, 2006 The Apache Software Foundation or its licensors, as applicable.
[debug] started null(org.apache.harmony.test.share.stress.ReliabilityRunner)
[debug] timeToWork = 30, timeToAbort = 30
[debug] started null(org.apache.harmony.test.share.stress.generator.Thread)
[debug] Thread.setContext  { org.apache.harmony.test.stress.classloader.OneThread.SubClasses.testManySubClasses {} }
[debug] Starting 1 threads
[debug] ThreadToRun.run()
[debug] completed null(org.apache.harmony.test.share.stress.generator.Thread)
[debug] Generator.execute()
[debug] class = org.apache.harmony.test.stress.classloader.OneThread.SubClasses.testManySubClasses
[debug] org.apache.harmony.test.stress.classloader.OneThread.SubClasses.testManySubClasses { }
[debu...
Test: testClass: stress.org.apache.harmony.test.stress.classloader.OneThread.SupIntf.testManySupIntf1java version "1.5.0" 
pre-alpha : not complete or compatible
svn = r563025, (Aug  6 2007), Linux/ia32/gcc 3.3.3, release build
http://harmony.apache.org
The GC did not provide gc_add_weak_root_set_entry()

Apache Harmony Launcher : (c) Copyright 1991, 2006 The Apache Software Foundation or its licensors, as applicable.
[debug] started null(org.apache.harmony.test.share.stress.ReliabilityRunner)
[debug] timeToWork = 30, timeToAbort = 30
[debug] started null(org.apache.harmony.test.share.stress.generator.Thread)
[debug] Thread.setContext  { org.apache.harmony.test.stress.classloader.OneThread.SupIntf.testManySupIntf1 {} }
[debug] Starting 1 threads
[debug] ThreadToRun.run()
[debug] Generator.execute()
[debug] class = org.apache.harmony.test.stress.classloader.OneThread.SupIntf.testManySupIntf1
[debug] completed null(org.apache.harmony.test.share.stress.generator.Thread)
[debug] org.apache.harmony.test.stress.classloader.OneThread.SupIntf.testManySupIntf1 { }
[debug] started test...
Test: testClass: stress.org.apache.harmony.test.stress.classloader.OneThread.WrongClasses.testWCLoadjava version "1.5.0" 
pre-alpha : not complete or compatible
svn = r563025, (Aug  6 2007), Linux/ia32/gcc 3.3.3, release build
http://harmony.apache.org
The GC did not provide gc_add_weak_root_set_entry()

Apache Harmony Launcher : (c) Copyright 1991, 2006 The Apache Software Foundation or its licensors, as applicable.
[debug] started null(org.apache.harmony.test.share.stress.ReliabilityRunner)
[debug] timeToWork = 30, timeToAbort = 30
[debug] started null(org.apache.harmony.test.share.stress.generator.Thread)
[debug] Thread.setContext  { org.apache.harmony.test.stress.classloader.OneThread.WrongClasses.testWCLoad {} }
[debug] Starting 1 threads
[debug] ThreadToRun.run()
[debug] completed null(org.apache.harmony.test.share.stress.generator.Thread)
[debug] Generator.execute()
[debug] class = org.apache.harmony.test.stress.classloader.OneThread.WrongClasses.testWCLoad
[debug] org.apache.harmony.test.stress.classloader.OneThread.WrongClasses.testWCLoad { }
[debug] started test(or...
Test: testClass: stress.org.apache.harmony.test.stress.classloader.SynchThreads.ConstantPool.testCPLmt1java version "1.5.0" 
pre-alpha : not complete or compatible
svn = r563025, (Aug  6 2007), Linux/ia32/gcc 3.3.3, release build
http://harmony.apache.org
The GC did not provide gc_add_weak_root_set_entry()

Apache Harmony Launcher : (c) Copyright 1991, 2006 The Apache Software Foundation or its licensors, as applicable.
[debug] started null(org.apache.harmony.test.share.stress.ReliabilityRunner)
[debug] timeToWork = 30, timeToAbort = 30
[debug] started null(org.apache.harmony.test.share.stress.generator.Thread)
[debug] Thread.setContext  { org.apache.harmony.test.stress.classloader.SynchThreads.ConstantPool.testCPLmt {} }
[debug] Starting 1 threads
[debug] ThreadToRun.run()
[debug] Generator.execute()
[debug] class = org.apache.harmony.test.stress.classloader.SynchThreads.ConstantPool.testCPLmt
[debug] completed null(org.apache.harmony.test.share.stress.generator.Thread)
[debug] org.apache.harmony.test.stress.classloader.SynchThreads.ConstantPool.testCPLmt { }
[debug] started t...
Test: testClass: stress.org.apache.harmony.test.stress.classloader.SynchThreads.ConstantPool.testCPLmt2java version "1.5.0" 
pre-alpha : not complete or compatible
svn = r563025, (Aug  6 2007), Linux/ia32/gcc 3.3.3, release build
http://harmony.apache.org
The GC did not provide gc_add_weak_root_set_entry()

Apache Harmony Launcher : (c) Copyright 1991, 2006 The Apache Software Foundation or its licensors, as applicable.
[debug] started null(org.apache.harmony.test.share.stress.ReliabilityRunner)
[debug] timeToWork = 30, timeToAbort = 30
[debug] started null(org.apache.harmony.test.share.stress.generator.Thread)
[debug] Thread.setContext  { org.apache.harmony.test.stress.classloader.SynchThreads.ConstantPool.testCPLmt {} }
[debug] Starting 1 threads
[debug] ThreadToRun.run()
[debug] completed null(org.apache.harmony.test.share.stress.generator.Thread)
[debug] Generator.execute()
[debug] class = org.apache.harmony.test.stress.classloader.SynchThreads.ConstantPool.testCPLmt
[debug] org.apache.harmony.test.stress.classloader.SynchThreads.ConstantPool.testCPLmt { }
[debug] started t...
Test: testClass: stress.org.apache.harmony.test.stress.classloader.SynchThreads.FieldsLmt.testFieldsLmt1java version "1.5.0" 
pre-alpha : not complete or compatible
svn = r563025, (Aug  6 2007), Linux/ia32/gcc 3.3.3, release build
http://harmony.apache.org
The GC did not provide gc_add_weak_root_set_entry()

Apache Harmony Launcher : (c) Copyright 1991, 2006 The Apache Software Foundation or its licensors, as applicable.
[debug] started null(org.apache.harmony.test.share.stress.ReliabilityRunner)
[debug] timeToWork = 30, timeToAbort = 30
[debug] started null(org.apache.harmony.test.share.stress.generator.Thread)
[debug] Thread.setContext  { org.apache.harmony.test.stress.classloader.SynchThreads.FieldsLmt.testFieldsLmt {} }
[debug] Starting 1 threads
[debug] ThreadToRun.run()
[debug] completed null(org.apache.harmony.test.share.stress.generator.Thread)
[debug] Generator.execute()
[debug] class = org.apache.harmony.test.stress.classloader.SynchThreads.FieldsLmt.testFieldsLmt
[debug] org.apache.harmony.test.stress.classloader.SynchThreads.FieldsLmt.testFieldsLmt { }
[debug] starte...
Test: testClass: stress.org.apache.harmony.test.stress.classloader.SynchThreads.FieldsLmt.testFieldsLmt2java version "1.5.0" 
pre-alpha : not complete or compatible
svn = r563025, (Aug  6 2007), Linux/ia32/gcc 3.3.3, release build
http://harmony.apache.org
The GC did not provide gc_add_weak_root_set_entry()

Apache Harmony Launcher : (c) Copyright 1991, 2006 The Apache Software Foundation or its licensors, as applicable.
[debug] started null(org.apache.harmony.test.share.stress.ReliabilityRunner)
[debug] timeToWork = 30, timeToAbort = 30
[debug] started null(org.apache.harmony.test.share.stress.generator.Thread)
[debug] Thread.setContext  { org.apache.harmony.test.stress.classloader.SynchThreads.FieldsLmt.testFieldsLmt {} }
[debug] Starting 1 threads
[debug] ThreadToRun.run()
[debug] completed null(org.apache.harmony.test.share.stress.generator.Thread)
[debug] Generator.execute()
[debug] class = org.apache.harmony.test.stress.classloader.SynchThreads.FieldsLmt.testFieldsLmt
[debug] org.apache.harmony.test.stress.classloader.SynchThreads.FieldsLmt.testFieldsLmt { }
[debug] starte...
Test: testClass: stress.org.apache.harmony.test.stress.classloader.SynchThreads.LargeClassName.testLargeClassName_R1java version "1.5.0" 
pre-alpha : not complete or compatible
svn = r563025, (Aug  6 2007), Linux/ia32/gcc 3.3.3, release build
http://harmony.apache.org
The GC did not provide gc_add_weak_root_set_entry()

Apache Harmony Launcher : (c) Copyright 1991, 2006 The Apache Software Foundation or its licensors, as applicable.
[debug] started null(org.apache.harmony.test.share.stress.ReliabilityRunner)
[debug] timeToWork = 30, timeToAbort = 30
[debug] started null(org.apache.harmony.test.share.stress.generator.Thread)
[debug] Thread.setContext  { org.apache.harmony.test.stress.classloader.SynchThreads.LargeClassName.testLCN {} }
[debug] Starting 1 threads
[debug] ThreadToRun.run()
[debug] completed null(org.apache.harmony.test.share.stress.generator.Thread)
[debug] Generator.execute()
[debug] class = org.apache.harmony.test.stress.classloader.SynchThreads.LargeClassName.testLCN
[debug] org.apache.harmony.test.stress.classloader.SynchThreads.LargeClassName.testLCN { }
[debug] started t...
Test: testClass: stress.org.apache.harmony.test.stress.classloader.SynchThreads.LargeClassName.testLargeClassName_W1java version "1.5.0" 
pre-alpha : not complete or compatible
svn = r563025, (Aug  6 2007), Linux/ia32/gcc 3.3.3, release build
http://harmony.apache.org
The GC did not provide gc_add_weak_root_set_entry()

Apache Harmony Launcher : (c) Copyright 1991, 2006 The Apache Software Foundation or its licensors, as applicable.
[debug] started null(org.apache.harmony.test.share.stress.ReliabilityRunner)
[debug] timeToWork = 30, timeToAbort = 30
[debug] started null(org.apache.harmony.test.share.stress.generator.Thread)
[debug] Thread.setContext  { org.apache.harmony.test.stress.classloader.SynchThreads.LargeClassName.testLCN {} }
[debug] Starting 1 threads
[debug] ThreadToRun.run()
[debug] completed null(org.apache.harmony.test.share.stress.generator.Thread)
[debug] Generator.execute()
[debug] class = org.apache.harmony.test.stress.classloader.SynchThreads.LargeClassName.testLCN
[debug] org.apache.harmony.test.stress.classloader.SynchThreads.LargeClassName.testLCN { }
[debug] started t...
Test: testClass: stress.org.apache.harmony.test.stress.classloader.SynchThreads.LargeClassName.testLargeClassName_W2java version "1.5.0" 
pre-alpha : not complete or compatible
svn = r563025, (Aug  6 2007), Linux/ia32/gcc 3.3.3, release build
http://harmony.apache.org
The GC did not provide gc_add_weak_root_set_entry()

Apache Harmony Launcher : (c) Copyright 1991, 2006 The Apache Software Foundation or its licensors, as applicable.
[debug] started null(org.apache.harmony.test.share.stress.ReliabilityRunner)
[debug] timeToWork = 30, timeToAbort = 30
[debug] started null(org.apache.harmony.test.share.stress.generator.Thread)
[debug] Thread.setContext  { org.apache.harmony.test.stress.classloader.SynchThreads.LargeClassName.testLCN {} }
[debug] Starting 1 threads
[debug] ThreadToRun.run()
[debug] Generator.execute()
[debug] class = org.apache.harmony.test.stress.classloader.SynchThreads.LargeClassName.testLCN
[debug] org.apache.harmony.test.stress.classloader.SynchThreads.LargeClassName.testLCN { }
[debug] started test(org.apache.harmony.test.stress.classloader.SynchThreads.LargeClassName.tes...
Test: testClass: stress.org.apache.harmony.test.stress.classloader.SynchThreads.MethodArgs.testMethodArgs1java version "1.5.0" 
pre-alpha : not complete or compatible
svn = r563025, (Aug  6 2007), Linux/ia32/gcc 3.3.3, release build
http://harmony.apache.org
The GC did not provide gc_add_weak_root_set_entry()

Apache Harmony Launcher : (c) Copyright 1991, 2006 The Apache Software Foundation or its licensors, as applicable.
[debug] started null(org.apache.harmony.test.share.stress.ReliabilityRunner)
[debug] timeToWork = 30, timeToAbort = 30
[debug] started null(org.apache.harmony.test.share.stress.generator.Thread)
[debug] Thread.setContext  { org.apache.harmony.test.stress.classloader.SynchThreads.MethodArgs.testMethodArgs {} }
[debug] Starting 1 threads
[debug] ThreadToRun.run()
[debug] Generator.execute()
[debug] class = org.apache.harmony.test.stress.classloader.SynchThreads.MethodArgs.testMethodArgs
[debug] completed null(org.apache.harmony.test.share.stress.generator.Thread)
[debug] org.apache.harmony.test.stress.classloader.SynchThreads.MethodArgs.testMethodArgs { }
[debug] ...
Test: testClass: stress.org.apache.harmony.test.stress.classloader.SynchThreads.SupIntf.testManySupIntf1java version "1.5.0" 
pre-alpha : not complete or compatible
svn = r563025, (Aug  6 2007), Linux/ia32/gcc 3.3.3, release build
http://harmony.apache.org
The GC did not provide gc_add_weak_root_set_entry()

Apache Harmony Launcher : (c) Copyright 1991, 2006 The Apache Software Foundation or its licensors, as applicable.
[debug] started null(org.apache.harmony.test.share.stress.ReliabilityRunner)
[debug] timeToWork = 30, timeToAbort = 30
[debug] started null(org.apache.harmony.test.share.stress.generator.Thread)
[debug] Thread.setContext  { org.apache.harmony.test.stress.classloader.SynchThreads.SupIntf.testManySupIntf1 {} }
[debug] Starting 1 threads
[debug] ThreadToRun.run()
[debug] Generator.execute()
[debug] class = org.apache.harmony.test.stress.classloader.SynchThreads.SupIntf.testManySupIntf1
[debug] completed null(org.apache.harmony.test.share.stress.generator.Thread)
[debug] org.apache.harmony.test.stress.classloader.SynchThreads.SupIntf.testManySupIntf1 { }
[debug] sta...
Test: testClass: stress.org.apache.harmony.test.stress.classloader.SynchThreads.SupIntf.testManySupIntf2java version "1.5.0" 
pre-alpha : not complete or compatible
svn = r563025, (Aug  6 2007), Linux/ia32/gcc 3.3.3, release build
http://harmony.apache.org
The GC did not provide gc_add_weak_root_set_entry()

Apache Harmony Launcher : (c) Copyright 1991, 2006 The Apache Software Foundation or its licensors, as applicable.
[debug] started null(org.apache.harmony.test.share.stress.ReliabilityRunner)
[debug] timeToWork = 30, timeToAbort = 30
[debug] started null(org.apache.harmony.test.share.stress.generator.Thread)
[debug] Thread.setContext  { org.apache.harmony.test.stress.classloader.SynchThreads.SupIntf.testManySupIntf1 {} }
[debug] Starting 1 threads
[debug] ThreadToRun.run()
[debug] completed null(org.apache.harmony.test.share.stress.generator.Thread)
[debug] Generator.execute()
[debug] class = org.apache.harmony.test.stress.classloader.SynchThreads.SupIntf.testManySupIntf1
[debug] org.apache.harmony.test.stress.classloader.SynchThreads.SupIntf.testManySupIntf1 { }
[debug] sta...
Test: testClass: stress.org.apache.harmony.test.stress.classloader.SynchThreads.SupIntf.testManySupIntf3java version "1.5.0" 
pre-alpha : not complete or compatible
svn = r563025, (Aug  6 2007), Linux/ia32/gcc 3.3.3, release build
http://harmony.apache.org
The GC did not provide gc_add_weak_root_set_entry()

Apache Harmony Launcher : (c) Copyright 1991, 2006 The Apache Software Foundation or its licensors, as applicable.
[debug] started null(org.apache.harmony.test.share.stress.ReliabilityRunner)
[debug] timeToWork = 30, timeToAbort = 30
[debug] started null(org.apache.harmony.test.share.stress.generator.Thread)
[debug] Thread.setContext  { org.apache.harmony.test.stress.classloader.SynchThreads.SupIntf.testManySupIntf2 {} }
[debug] Starting 1 threads
[debug] ThreadToRun.run()
[debug] completed null(org.apache.harmony.test.share.stress.generator.Thread)
[debug] Generator.execute()
[debug] class = org.apache.harmony.test.stress.classloader.SynchThreads.SupIntf.testManySupIntf2
[debug] org.apache.harmony.test.stress.classloader.SynchThreads.SupIntf.testManySupIntf2 { }
[debug] sta...
Test: testClass: stress.org.apache.harmony.test.stress.classloader.SynchThreads.SupIntf.testManySupIntf4java version "1.5.0" 
pre-alpha : not complete or compatible
svn = r563025, (Aug  6 2007), Linux/ia32/gcc 3.3.3, release build
http://harmony.apache.org
The GC did not provide gc_add_weak_root_set_entry()

Apache Harmony Launcher : (c) Copyright 1991, 2006 The Apache Software Foundation or its licensors, as applicable.
[debug] started null(org.apache.harmony.test.share.stress.ReliabilityRunner)
[debug] timeToWork = 30, timeToAbort = 30
[debug] started null(org.apache.harmony.test.share.stress.generator.Thread)
[debug] Thread.setContext  { org.apache.harmony.test.stress.classloader.SynchThreads.SupIntf.testManySupIntf2 {} }
[debug] Starting 1 threads
[debug] ThreadToRun.run()
[debug] completed null(org.apache.harmony.test.share.stress.generator.Thread)
[debug] Generator.execute()
[debug] class = org.apache.harmony.test.stress.classloader.SynchThreads.SupIntf.testManySupIntf2
[debug] org.apache.harmony.test.stress.classloader.SynchThreads.SupIntf.testManySupIntf2 { }
[debug] sta...
Test: testClass: stress.org.apache.harmony.test.stress.classloader.SynchThreads.WrongClasses.testNECLoad1java version "1.5.0" 
pre-alpha : not complete or compatible
svn = r563025, (Aug  6 2007), Linux/ia32/gcc 3.3.3, release build
http://harmony.apache.org
The GC did not provide gc_add_weak_root_set_entry()

Apache Harmony Launcher : (c) Copyright 1991, 2006 The Apache Software Foundation or its licensors, as applicable.
[debug] started null(org.apache.harmony.test.share.stress.ReliabilityRunner)
[debug] timeToWork = 30, timeToAbort = 30
[debug] started null(org.apache.harmony.test.share.stress.generator.Thread)
[debug] Thread.setContext  { org.apache.harmony.test.stress.classloader.SynchThreads.WrongClasses.testNECLoad_ST {} }
[debug] Starting 1 threads
[debug] completed null(org.apache.harmony.test.share.stress.generator.Thread)
[debug] ThreadToRun.run()
[debug] Generator.execute()
[debug] class = org.apache.harmony.test.stress.classloader.SynchThreads.WrongClasses.testNECLoad_ST
[debug] org.apache.harmony.test.stress.classloader.SynchThreads.WrongClasses.testNECLoad_ST { }
[d...
Test: testClass: stress.org.apache.harmony.test.stress.classloader.SynchThreads.WrongClasses.testNECLoad2java version "1.5.0" 
pre-alpha : not complete or compatible
svn = r563025, (Aug  6 2007), Linux/ia32/gcc 3.3.3, release build
http://harmony.apache.org
The GC did not provide gc_add_weak_root_set_entry()

Apache Harmony Launcher : (c) Copyright 1991, 2006 The Apache Software Foundation or its licensors, as applicable.
[debug] started null(org.apache.harmony.test.share.stress.ReliabilityRunner)
[debug] timeToWork = 30, timeToAbort = 30
[debug] started null(org.apache.harmony.test.share.stress.generator.Thread)
[debug] Thread.setContext  { org.apache.harmony.test.stress.classloader.SynchThreads.WrongClasses.testNECLoad_ST {} }
[debug] Starting 1 threads
[debug] ThreadToRun.run()
[debug] completed null(org.apache.harmony.test.share.stress.generator.Thread)
[debug] Generator.execute()
[debug] class = org.apache.harmony.test.stress.classloader.SynchThreads.WrongClasses.testNECLoad_ST
[debug] org.apache.harmony.test.stress.classloader.SynchThreads.WrongClasses.testNECLoad_ST { }
[d...
Test: testClass: stress.org.apache.harmony.test.stress.classloader.SynchThreads.WrongClasses.testWCLoad1java version "1.5.0" 
pre-alpha : not complete or compatible
svn = r563025, (Aug  6 2007), Linux/ia32/gcc 3.3.3, release build
http://harmony.apache.org
The GC did not provide gc_add_weak_root_set_entry()

Apache Harmony Launcher : (c) Copyright 1991, 2006 The Apache Software Foundation or its licensors, as applicable.
[debug] started null(org.apache.harmony.test.share.stress.ReliabilityRunner)
[debug] timeToWork = 30, timeToAbort = 30
[debug] started null(org.apache.harmony.test.share.stress.generator.Thread)
[debug] Thread.setContext  { org.apache.harmony.test.stress.classloader.SynchThreads.WrongClasses.testWCLoad_ST {} }
[debug] Starting 1 threads
[debug] ThreadToRun.run()
[debug] Generator.execute()
[debug] completed null(org.apache.harmony.test.share.stress.generator.Thread)
[debug] class = org.apache.harmony.test.stress.classloader.SynchThreads.WrongClasses.testWCLoad_ST
[debug] org.apache.harmony.test.stress.classloader.SynchThreads.WrongClasses.testWCLoad_ST { }
[debu...
Test: testClass: stress.org.apache.harmony.test.stress.classloader.SynchThreads.WrongClasses.testWCLoad2java version "1.5.0" 
pre-alpha : not complete or compatible
svn = r563025, (Aug  6 2007), Linux/ia32/gcc 3.3.3, release build
http://harmony.apache.org
The GC did not provide gc_add_weak_root_set_entry()

Apache Harmony Launcher : (c) Copyright 1991, 2006 The Apache Software Foundation or its licensors, as applicable.
[debug] started null(org.apache.harmony.test.share.stress.ReliabilityRunner)
[debug] timeToWork = 30, timeToAbort = 30
[debug] started null(org.apache.harmony.test.share.stress.generator.Thread)
[debug] Thread.setContext  { org.apache.harmony.test.stress.classloader.SynchThreads.WrongClasses.testWCLoad_ST {} }
[debug] Starting 1 threads
[debug] ThreadToRun.run()
[debug] Generator.execute()
[debug] class = org.apache.harmony.test.stress.classloader.SynchThreads.WrongClasses.testWCLoad_ST
[debug] org.apache.harmony.test.stress.classloader.SynchThreads.WrongClasses.testWCLoad_ST { }
[debug] started test(org.apache.harmony.test.stress.classloader.SynchThreads.WrongC...
Test: testClass: stress.org.apache.harmony.test.stress.gc.frag.FragmentationGCFinalizeTest3.FragmentationGCFinalizeTest3java version "1.5.0" 
pre-alpha : not complete or compatible
svn = r563025, (Aug  6 2007), Linux/ia32/gcc 3.3.3, release build
http://harmony.apache.org
The GC did not provide gc_add_weak_root_set_entry()

Apache Harmony Launcher : (c) Copyright 1991, 2006 The Apache Software Foundation or its licensors, as applicable.
[debug] started null(org.apache.harmony.test.share.stress.ReliabilityRunner)
[debug] timeToWork = 30, timeToAbort = 30
[debug] started null(org.apache.harmony.test.share.stress.generator.Thread)
[debug] Thread.setContext  { org.apache.harmony.test.stress.gc.frag.share.FragmentationGCFinalizeTest {} }
[debug] Starting 1 threads
[debug] ThreadToRun.run()
[debug] completed null(org.apache.harmony.test.share.stress.generator.Thread)
[debug] Generator.execute()
[debug] class = org.apache.harmony.test.stress.gc.frag.share.FragmentationGCFinalizeTest
[debug] org.apache.harmony.test.stress.gc.frag.share.FragmentationGCFinalizeTest { }
[debug] started test(org.apache.har...
Test: testClass: stress.org.apache.harmony.test.stress.gc.frag.FragmentationSimpleTest2.FragmentationSimpleTest2TestHarness:ExecUnit	runProc(): Timeout!!!. The test hung (not finished in 180 second).

java version "1.5.0" 
pre-alpha : not complete or compatible
svn = r563025, (Aug  6 2007), Linux/ia32/gcc 3.3.3, release build
http://harmony.apache.org
The GC did not provide gc_add_weak_root_set_entry()

Apache Harmony Launcher : (c) Copyright 1991, 2006 The Apache Software Foundation or its licensors, as applicable.
[debug] started null(org.apache.harmony.test.share.stress.ReliabilityRunner)
[debug] timeToWork = 30, timeToAbort = 30
[debug] started null(org.apache.harmony.test.share.stress.generator.Thread)
[debug] Thread.setContext  { org.apache.harmony.test.stress.gc.frag.share.FragmentationSimpleTest {} }
[debug] Starting 1 threads
[debug] completed null(org.apache.harmony.test.share.stress.generator.Thread)
[debug] ThreadToRun.run()
[debug] Generator.execute()
[debug] class = org.apache.harmony.test.stress.gc.frag.share.FragmentationSimpleTest
[debug] org.apache.harmony.test.stress....
Test: testClass: stress.org.apache.harmony.test.stress.gc.frag.FragmentationSimpleTest6.FragmentationSimpleTest6java version "1.5.0" 
pre-alpha : not complete or compatible
svn = r563025, (Aug  6 2007), Linux/ia32/gcc 3.3.3, release build
http://harmony.apache.org
The GC did not provide gc_add_weak_root_set_entry()

Apache Harmony Launcher : (c) Copyright 1991, 2006 The Apache Software Foundation or its licensors, as applicable.
[debug] started null(org.apache.harmony.test.share.stress.ReliabilityRunner)
[debug] timeToWork = 30, timeToAbort = 30
[debug] started null(org.apache.harmony.test.share.stress.generator.Thread)
[debug] Thread.setContext  { org.apache.harmony.test.stress.gc.frag.share.FragmentationSimpleTest {} }
[debug] Starting 1 threads
[debug] completed null(org.apache.harmony.test.share.stress.generator.Thread)
[debug] ThreadToRun.run()
[debug] Generator.execute()
[debug] class = org.apache.harmony.test.stress.gc.frag.share.FragmentationSimpleTest
[debug] org.apache.harmony.test.stress.gc.frag.share.FragmentationSimpleTest { }
[debug] started test(org.apache.harmony.test.st...
Test: testClass: stress.org.apache.harmony.test.stress.jni.stack.StackTest3java version "1.5.0" 
pre-alpha : not complete or compatible
svn = r563025, (Aug  6 2007), Linux/ia32/gcc 3.3.3, release build
http://harmony.apache.org
The GC did not provide gc_add_weak_root_set_entry()

Apache Harmony Launcher : (c) Copyright 1991, 2006 The Apache Software Foundation or its licensors, as applicable.
[debug] started null(org.apache.harmony.test.share.stress.ReliabilityRunner)
[debug] timeToWork = 30, timeToAbort = 30
[debug] started null(org.apache.harmony.test.share.stress.generator.Thread)
[debug] Thread.setContext  { org.apache.harmony.test.stress.jni.stack.StackTest3 {} }
[debug] Starting 1 threads
[debug] ThreadToRun.run()
[debug] completed null(org.apache.harmony.test.share.stress.generator.Thread)
[debug] Generator.execute()
[debug] class = org.apache.harmony.test.stress.jni.stack.StackTest3
[debug] org.apache.harmony.test.stress.jni.stack.StackTest3 { }
[debug] started test(org.apache.harmony.test.stress.jni.stack.StackTest3)
Native code: Cannot get ...
Test: testClass: stress.org.apache.harmony.test.stress.jni.strings.StringsTest1java version "1.5.0" 
pre-alpha : not complete or compatible
svn = r563025, (Aug  6 2007), Linux/ia32/gcc 3.3.3, release build
http://harmony.apache.org
The GC did not provide gc_add_weak_root_set_entry()

Apache Harmony Launcher : (c) Copyright 1991, 2006 The Apache Software Foundation or its licensors, as applicable.
[debug] started null(org.apache.harmony.test.share.stress.ReliabilityRunner)
[debug] timeToWork = 30, timeToAbort = 30
[debug] started null(org.apache.harmony.test.share.stress.generator.Thread)
[debug] Thread.setContext  { org.apache.harmony.test.stress.jni.strings.StringsTest1 {} }
[debug] Starting 1 threads
[debug] ThreadToRun.run()
[debug] Generator.execute()
[debug] class = org.apache.harmony.test.stress.jni.strings.StringsTest1
[debug] completed null(org.apache.harmony.test.share.stress.generator.Thread)
[debug] org.apache.harmony.test.stress.jni.strings.StringsTest1 { }
[debug] started test(org.apache.harmony.test.stress.jni.strings.StringsTest1)
Native c...
Test: testClass: stress.org.apache.harmony.test.stress.jni.strings.StringsTest2java version "1.5.0" 
pre-alpha : not complete or compatible
svn = r563025, (Aug  6 2007), Linux/ia32/gcc 3.3.3, release build
http://harmony.apache.org
The GC did not provide gc_add_weak_root_set_entry()

Apache Harmony Launcher : (c) Copyright 1991, 2006 The Apache Software Foundation or its licensors, as applicable.
[debug] started null(org.apache.harmony.test.share.stress.ReliabilityRunner)
[debug] timeToWork = 30, timeToAbort = 30
[debug] started null(org.apache.harmony.test.share.stress.generator.Thread)
[debug] Thread.setContext  { org.apache.harmony.test.stress.jni.strings.StringsTest2 {} }
[debug] Starting 1 threads
[debug] ThreadToRun.run()
[debug] completed null(org.apache.harmony.test.share.stress.generator.Thread)
[debug] Generator.execute()
[debug] class = org.apache.harmony.test.stress.jni.strings.StringsTest2
[debug] org.apache.harmony.test.stress.jni.strings.StringsTest2 { }
[debug] started test(org.apache.harmony.test.stress.jni.strings.StringsTest2)
Native c...
Test: testClass: stress.org.apache.harmony.test.stress.jni.strings.StringsTest3java version "1.5.0" 
pre-alpha : not complete or compatible
svn = r563025, (Aug  6 2007), Linux/ia32/gcc 3.3.3, release build
http://harmony.apache.org
The GC did not provide gc_add_weak_root_set_entry()

Apache Harmony Launcher : (c) Copyright 1991, 2006 The Apache Software Foundation or its licensors, as applicable.
[debug] started null(org.apache.harmony.test.share.stress.ReliabilityRunner)
[debug] timeToWork = 30, timeToAbort = 30
[debug] started null(org.apache.harmony.test.share.stress.generator.Thread)
[debug] Thread.setContext  { org.apache.harmony.test.stress.jni.strings.StringsTest3 {} }
[debug] Starting 1 threads
[debug] ThreadToRun.run()
[debug] Generator.execute()
[debug] class = org.apache.harmony.test.stress.jni.strings.StringsTest3
[debug] completed null(org.apache.harmony.test.share.stress.generator.Thread)
[debug] org.apache.harmony.test.stress.jni.strings.StringsTest3 { }
[debug] started test(org.apache.harmony.test.stress.jni.strings.StringsTest3)
[debug] ...
Test: testClass: stress.org.apache.harmony.test.stress.jni.strings.StringsTest7java version "1.5.0" 
pre-alpha : not complete or compatible
svn = r563025, (Aug  6 2007), Linux/ia32/gcc 3.3.3, release build
http://harmony.apache.org
The GC did not provide gc_add_weak_root_set_entry()

Apache Harmony Launcher : (c) Copyright 1991, 2006 The Apache Software Foundation or its licensors, as applicable.
[debug] started null(org.apache.harmony.test.share.stress.ReliabilityRunner)
[debug] timeToWork = 30, timeToAbort = 30
[debug] started null(org.apache.harmony.test.share.stress.generator.Thread)
[debug] Thread.setContext  { org.apache.harmony.test.stress.jni.strings.StringsTest7 {} }
[debug] Starting 1 threads
[debug] ThreadToRun.run()
[debug] Generator.execute()
[debug] class = org.apache.harmony.test.stress.jni.strings.StringsTest7
[debug] completed null(org.apache.harmony.test.share.stress.generator.Thread)
[debug] org.apache.harmony.test.stress.jni.strings.StringsTest7 { }
[debug] started test(org.apache.harmony.test.stress.jni.strings.StringsTest7)
[debug] ...
Test: testClass: stress.org.apache.harmony.test.stress.jpda.jdwp.scenario.FRAME002.FrameTest002TestHarness:ExecUnit	runProc(): Timeout!!!. The test hung (not finished in 540 second).

java version "1.5.0" 
pre-alpha : not complete or compatible
svn = r563025, (Aug  6 2007), Linux/ia32/gcc 3.3.3, release build
http://harmony.apache.org
08:19:30| Test: class org.apache.harmony.test.stress.jpda.jdwp.scenario.FRAME002.FrameTest002
		test case(s) to run 1
08:19:31| Launching as a server listening on: nstdrlxl16:41868
08:19:31| Launching: /export/users/cc/cc-suites/build/checkouts/snapshot/hdk/jdk/jre/bin/java -cp "/export/users/cc/cc-suites/build/classes/stress/classes:/export/users/cc/cc-suites/build/results/stress/temp:/export/users/cc/cc-suites/build/classes/stress/classes:/export/users/cc/cc-suites/build/classes/stress/lib:/export/users/cc/cc-suites/build/libs/th.jar:/export/users/cc/cc-suites/build/libs/junit-3.8.2.jar" -agentlib:jdwp=transport=dt_socket,address=nstdrlxl16:41868,server=n -Dvm.assert_dialog=false -Djpda.settings.verbose=true org.apache.harmony.test.stres...
Test: testClass: stress.org.apache.harmony.test.stress.jpda.jdwp.scenario.MEMORY005.MemoryTest005TestHarness:ExecUnit	runProc(): Timeout!!!. The test hung (not finished in 540 second).

java version "1.5.0" 
pre-alpha : not complete or compatible
svn = r563025, (Aug  6 2007), Linux/ia32/gcc 3.3.3, release build
http://harmony.apache.org
07:28:20| Test: class org.apache.harmony.test.stress.jpda.jdwp.scenario.MEMORY005.MemoryTest005
		test case(s) to run 1
07:28:20| Launching as a server listening on: nstdrlxl16:41795
07:28:20| Launching: /export/users/cc/cc-suites/build/checkouts/snapshot/hdk/jdk/jre/bin/java -cp "/export/users/cc/cc-suites/build/classes/stress/classes:/export/users/cc/cc-suites/build/results/stress/temp:/export/users/cc/cc-suites/build/classes/stress/classes:/export/users/cc/cc-suites/build/classes/stress/lib:/export/users/cc/cc-suites/build/libs/th.jar:/export/users/cc/cc-suites/build/libs/junit-3.8.2.jar" -agentlib:jdwp=transport=dt_socket,address=nstdrlxl16:41795,server=n -Dvm.assert_dialog=false -Djpda.settings.verbose=true org.apache.harmony.test.str...
Test: testClass: stress.org.apache.harmony.test.stress.jpda.jdwp.scenario.MEMORY006.MemoryTest006TestHarness:ExecUnit	runProc(): Timeout!!!. The test hung (not finished in 180 second).

java version "1.5.0" 
pre-alpha : not complete or compatible
svn = r563025, (Aug  6 2007), Linux/ia32/gcc 3.3.3, release build
http://harmony.apache.org
07:37:30| Test: class org.apache.harmony.test.stress.jpda.jdwp.scenario.MEMORY006.MemoryTest006
		test case(s) to run 1
07:37:30| Launching as a server listening on: nstdrlxl16:41802
07:37:30| Launching: /export/users/cc/cc-suites/build/checkouts/snapshot/hdk/jdk/jre/bin/java -cp "/export/users/cc/cc-suites/build/classes/stress/classes:/export/users/cc/cc-suites/build/results/stress/temp:/export/users/cc/cc-suites/build/classes/stress/classes:/export/users/cc/cc-suites/build/classes/stress/lib:/export/users/cc/cc-suites/build/libs/th.jar:/export/users/cc/cc-suites/build/libs/junit-3.8.2.jar" -agentlib:jdwp=transport=dt_socket,address=nstdrlxl16:41802,server=n -Dvm.assert_dialog=false -Djpda.settings.verbose=true org.apache.harmony.test.str...
Test: testClass: stress.org.apache.harmony.test.stress.jpda.jdwp.scenario.MEMORY007.MemoryTest007TestHarness:ExecUnit	runProc(): Timeout!!!. The test hung (not finished in 180 second).

java version "1.5.0" 
pre-alpha : not complete or compatible
svn = r563025, (Aug  6 2007), Linux/ia32/gcc 3.3.3, release build
http://harmony.apache.org
07:40:35| Test: class org.apache.harmony.test.stress.jpda.jdwp.scenario.MEMORY007.MemoryTest007
		test case(s) to run 1
07:40:35| Launching as a server listening on: nstdrlxl16:41804
07:40:35| Launching: /export/users/cc/cc-suites/build/checkouts/snapshot/hdk/jdk/jre/bin/java -cp "/export/users/cc/cc-suites/build/classes/stress/classes:/export/users/cc/cc-suites/build/results/stress/temp:/export/users/cc/cc-suites/build/classes/stress/classes:/export/users/cc/cc-suites/build/classes/stress/lib:/export/users/cc/cc-suites/build/libs/th.jar:/export/users/cc/cc-suites/build/libs/junit-3.8.2.jar" -agentlib:jdwp=transport=dt_socket,address=nstdrlxl16:41804,server=n -Dvm.assert_dialog=false -Djpda.settings.verbose=true org.apache.harmony.test.str...
Test: testClass: stress.org.apache.harmony.test.stress.jpda.jdwp.scenario.OBJECT006.ObjectTest006TestHarness:ExecUnit	runProc(): Timeout!!!. The test hung (not finished in 360 second).

java version "1.5.0" 
pre-alpha : not complete or compatible
svn = r563025, (Aug  6 2007), Linux/ia32/gcc 3.3.3, release build
http://harmony.apache.org
07:55:18| Test: class org.apache.harmony.test.stress.jpda.jdwp.scenario.OBJECT006.ObjectTest006
		test case(s) to run 1
07:55:18| Launching as a server listening on: nstdrlxl16:41835
07:55:18| Launching: /export/users/cc/cc-suites/build/checkouts/snapshot/hdk/jdk/jre/bin/java -cp "/export/users/cc/cc-suites/build/classes/stress/classes:/export/users/cc/cc-suites/build/results/stress/temp:/export/users/cc/cc-suites/build/classes/stress/classes:/export/users/cc/cc-suites/build/classes/stress/lib:/export/users/cc/cc-suites/build/libs/th.jar:/export/users/cc/cc-suites/build/libs/junit-3.8.2.jar" -agentlib:jdwp=transport=dt_socket,address=nstdrlxl16:41835,server=n -Dvm.assert_dialog=false -Djpda.settings.verbose=true org.apache.harmony.test.str...
Test: testClass: stress.org.apache.harmony.test.stress.jpda.jdwp.scenario.OBJECT007.ObjectTest007TestHarness:ExecUnit	runProc(): Timeout!!!. The test hung (not finished in 360 second).

java version "1.5.0" 
pre-alpha : not complete or compatible
svn = r563025, (Aug  6 2007), Linux/ia32/gcc 3.3.3, release build
http://harmony.apache.org
08:02:11| Test: class org.apache.harmony.test.stress.jpda.jdwp.scenario.OBJECT007.ObjectTest007
		test case(s) to run 1
08:02:12| Launching as a server listening on: nstdrlxl16:41840
08:02:12| Launching: /export/users/cc/cc-suites/build/checkouts/snapshot/hdk/jdk/jre/bin/java -cp "/export/users/cc/cc-suites/build/classes/stress/classes:/export/users/cc/cc-suites/build/results/stress/temp:/export/users/cc/cc-suites/build/classes/stress/classes:/export/users/cc/cc-suites/build/classes/stress/lib:/export/users/cc/cc-suites/build/libs/th.jar:/export/users/cc/cc-suites/build/libs/junit-3.8.2.jar" -agentlib:jdwp=transport=dt_socket,address=nstdrlxl16:41840,server=n -Dvm.assert_dialog=false -Djpda.settings.verbose=true org.apache.harmony.test.str...
Test: testClass: stress.org.apache.harmony.test.stress.jpda.jdwp.scenario.THREAD002.ThreadTest002TestHarness:ExecUnit	runProc(): Timeout!!!. The test hung (not finished in 180 second).

java version "1.5.0" 
pre-alpha : not complete or compatible
svn = r563025, (Aug  6 2007), Linux/ia32/gcc 3.3.3, release build
http://harmony.apache.org
07:47:00| Test: class org.apache.harmony.test.stress.jpda.jdwp.scenario.THREAD002.ThreadTest002
		test case(s) to run 1
07:47:00| Launching as a server listening on: nstdrlxl16:41819
07:47:00| Launching: /export/users/cc/cc-suites/build/checkouts/snapshot/hdk/jdk/jre/bin/java -cp "/export/users/cc/cc-suites/build/classes/stress/classes:/export/users/cc/cc-suites/build/results/stress/temp:/export/users/cc/cc-suites/build/classes/stress/classes:/export/users/cc/cc-suites/build/classes/stress/lib:/export/users/cc/cc-suites/build/libs/th.jar:/export/users/cc/cc-suites/build/libs/junit-3.8.2.jar" -agentlib:jdwp=transport=dt_socket,address=nstdrlxl16:41819,server=n -Dvm.assert_dialog=false -Djpda.settings.verbose=true org.apache.harmony.test.str...
Test: testClass: stress.org.apache.harmony.test.stress.jpda.jdwp.scenario.THREAD004.ThreadTest004TestHarness:ExecUnit	runProc(): Timeout!!!. The test hung (not finished in 180 second).

java version "1.5.0" 
pre-alpha : not complete or compatible
svn = r563025, (Aug  6 2007), Linux/ia32/gcc 3.3.3, release build
http://harmony.apache.org
07:52:15| Test: class org.apache.harmony.test.stress.jpda.jdwp.scenario.THREAD004.ThreadTest004
		test case(s) to run 1
07:52:15| Launching as a server listening on: nstdrlxl16:41833
07:52:15| Launching: /export/users/cc/cc-suites/build/checkouts/snapshot/hdk/jdk/jre/bin/java -cp "/export/users/cc/cc-suites/build/classes/stress/classes:/export/users/cc/cc-suites/build/results/stress/temp:/export/users/cc/cc-suites/build/classes/stress/classes:/export/users/cc/cc-suites/build/classes/stress/lib:/export/users/cc/cc-suites/build/libs/th.jar:/export/users/cc/cc-suites/build/libs/junit-3.8.2.jar" -agentlib:jdwp=transport=dt_socket,address=nstdrlxl16:41833,server=n -Dvm.assert_dialog=false -Djpda.settings.verbose=true org.apache.harmony.test.str...
Test: testClass: stress.org.apache.harmony.test.stress.jpda.jdwp.scenario.THREAD007.ThreadTest007TestHarness:ExecUnit	runProc(): Timeout!!!. The test hung (not finished in 180 second).

java version "1.5.0" 
pre-alpha : not complete or compatible
svn = r563025, (Aug  6 2007), Linux/ia32/gcc 3.3.3, release build
http://harmony.apache.org
08:10:21| Test: class org.apache.harmony.test.stress.jpda.jdwp.scenario.THREAD007.ThreadTest007
		test case(s) to run 1
08:10:21| Launching as a server listening on: nstdrlxl16:41855
08:10:21| Launching: /export/users/cc/cc-suites/build/checkouts/snapshot/hdk/jdk/jre/bin/java -cp "/export/users/cc/cc-suites/build/classes/stress/classes:/export/users/cc/cc-suites/build/results/stress/temp:/export/users/cc/cc-suites/build/classes/stress/classes:/export/users/cc/cc-suites/build/classes/stress/lib:/export/users/cc/cc-suites/build/libs/th.jar:/export/users/cc/cc-suites/build/libs/junit-3.8.2.jar" -agentlib:jdwp=transport=dt_socket,address=nstdrlxl16:41855,server=n -Dvm.assert_dialog=false -Djpda.settings.verbose=true org.apache.harmony.test.str...
Test: testClass: stress.org.apache.harmony.test.stress.jpda.jdwp.scenario.THREAD008.ThreadTest008TestHarness:ExecUnit	runProc(): Timeout!!!. The test hung (not finished in 180 second).

java version "1.5.0" 
pre-alpha : not complete or compatible
svn = r563025, (Aug  6 2007), Linux/ia32/gcc 3.3.3, release build
http://harmony.apache.org
08:15:14| Test: class org.apache.harmony.test.stress.jpda.jdwp.scenario.THREAD008.ThreadTest008
		test case(s) to run 1
08:15:14| Launching as a server listening on: nstdrlxl16:41859
08:15:14| Launching: /export/users/cc/cc-suites/build/checkouts/snapshot/hdk/jdk/jre/bin/java -cp "/export/users/cc/cc-suites/build/classes/stress/classes:/export/users/cc/cc-suites/build/results/stress/temp:/export/users/cc/cc-suites/build/classes/stress/classes:/export/users/cc/cc-suites/build/classes/stress/lib:/export/users/cc/cc-suites/build/libs/th.jar:/export/users/cc/cc-suites/build/libs/junit-3.8.2.jar" -agentlib:jdwp=transport=dt_socket,address=nstdrlxl16:41859,server=n -Dvm.assert_dialog=false -Djpda.settings.verbose=true org.apache.harmony.test.str...
Test: testClass: stress.org.apache.harmony.test.stress.jpda.jdwp.scenario.THREAD010.ThreadTest010TestHarness:ExecUnit	runProc(): Timeout!!!. The test hung (not finished in 180 second).

java version "1.5.0" 
pre-alpha : not complete or compatible
svn = r563025, (Aug  6 2007), Linux/ia32/gcc 3.3.3, release build
http://harmony.apache.org
07:21:46| Test: class org.apache.harmony.test.stress.jpda.jdwp.scenario.THREAD010.ThreadTest010
		test case(s) to run 1
07:21:46| Launching as a server listening on: nstdrlxl16:41780
07:21:46| Launching: /export/users/cc/cc-suites/build/checkouts/snapshot/hdk/jdk/jre/bin/java -cp "/export/users/cc/cc-suites/build/classes/stress/classes:/export/users/cc/cc-suites/build/results/stress/temp:/export/users/cc/cc-suites/build/classes/stress/classes:/export/users/cc/cc-suites/build/classes/stress/lib:/export/users/cc/cc-suites/build/libs/th.jar:/export/users/cc/cc-suites/build/libs/junit-3.8.2.jar" -agentlib:jdwp=transport=dt_socket,address=nstdrlxl16:41780,server=n -Dvm.assert_dialog=false -Djpda.settings.verbose=true org.apache.harmony.test.str...
Test: testClass: stress.org.apache.harmony.test.stress.misc.WaitNotifyTestjava version "1.5.0" 
pre-alpha : not complete or compatible
svn = r563025, (Aug  6 2007), Linux/ia32/gcc 3.3.3, release build
http://harmony.apache.org
The GC did not provide gc_add_weak_root_set_entry()

Apache Harmony Launcher : (c) Copyright 1991, 2006 The Apache Software Foundation or its licensors, as applicable.
[debug] started null(org.apache.harmony.test.share.stress.ReliabilityRunner)
[debug] timeToWork = 30, timeToAbort = 30
[debug] started null(org.apache.harmony.test.share.stress.generator.Thread)
[debug] Thread.setContext  { org.apache.harmony.test.stress.misc.WaitNotifyTest {} }
[debug] Starting 1 threads
[debug] ThreadToRun.run()
[debug] Generator.execute()
[debug] class = org.apache.harmony.test.stress.misc.WaitNotifyTest
[debug] org.apache.harmony.test.stress.misc.WaitNotifyTest { }
[debug] started test(org.apache.harmony.test.stress.misc.WaitNotifyTest)
[debug] i=0
[debug] completed null(org.apache.harmony.test.share.stress.generator.Thread)
[debug] i=1
[deb...

***********************************************************
Modifications since last successful build:	(9)
            
add cc-snapshot log20070806193336Lbuild.9 08/06/2007 19:33:36snapshot
add cc-snapshot log20070802033730Lbuild.8 08/02/2007 03:37:30snapshot
add cc-snapshot log20070730190130Lbuild.7 07/30/2007 19:01:30snapshot
add cc-snapshot log20070724161215Lbuild.6 07/24/2007 16:12:15snapshot
add cc-snapshot log20070720152501Lbuild.5 07/20/2007 15:25:01snapshot
add cc-snapshot log20070719194303Lbuild.4 07/19/2007 19:43:03snapshot
add cc-snapshot log20070713091307Lbuild.3 07/13/2007 09:13:07snapshot
add cc-snapshot log20070712133841Lbuild.2 07/12/2007 13:38:41snapshot
add cc-snapshot log20070706021248Lbuild.1 07/06/2007 02:12:48snapshot

begin 644 execution_log.zip
M4$L#! H    ( *M#!S<+^7V7! L  *&)   2    97AE8W5T:6]N7VQO9RYH
M=&ULU9W]4]LX&L=_IG^%9N=NELZT<9PWP,<RPT*XT@+I)'2YFYL.(VPE47%D
M5Y*![,W^[R?),=@A"DF7/3UI@=B2+'_TU:-';TF\/Y:3^&#_)HFF!_LI)P?[
M& DYC<DO/P\3)M\+^CL)T&[][__X^> -SUCP!B'TGXC$1)*OZ%B_4C9"_MXN
M&M*8"#3DR01YY"%-N/0R0;CPPE#]O!<9E41X-QF-(X\3D<52>$*J(Z'S5+E^
MPW?X*_I5)]!Y!<BDK3U,XDJ"RDDX)N%M+4S8D(Z"2DQ^3,)Q\A4=F?B,8TD3
M%J#B7\P>KBEN-JY'86B]]K?SG /][;]WD]F=_@A01&ZRD?6B2R(DB=!'%8&4
M:I).B+I>FM#:+. /.Z_^]Z*&INA)IE5D.!7C1'KCZ-;[IG\Y\6XH\W3.BV[R
M0,*OZ##%*@OT ?-)PJ;H#&=,G7,4H.WPK9(LG7(Z&DM5MWO^.]2HUSOH4J6?
M739(AO(><X).DHQ%1EB4<$2E0#$-"1,)%^\0%@BGJ0K -S&I65%T"+I3Y=2Y
M_.37VK7Z3\B:6IGI>QRG8ZQ062)1F$Q2;8_Z_OI8P:B[62\7=PS]@GB[TZPW
MVN_0]F$V0JBC"[CS]ATZHRQ[\+15>,HJ4+.F_K]#7!DZ%B2W!&O.8RG3P//&
MN:(U;)2J)=QN)TI\IAH "LL&:EJ2,I=Q'ED+AZ,?MQ5M<T4[\[YC3V6F?Z\)
MNWO6LLK9=A_".(M(P?(=UT@>4HNID*_+4^2L[V5OZJK9U,S5B^Z='VO[U$G0
M3+I'FZ("U6O:A.MMOX.VS_$4^9W<J-_:<U,YS2HH.,>4;2F"[;<!.N($*VL+
MJTZE]VGUC(3$7 ZF[&B,&2.QSE2=*6=F3C5MQM25-+8UF^?Y'E-^0EE$^-90
MO>@<53L8(YD@03 /QT87H;->HW($#TV8M[9&E^9N]T0Y"*':3JC\GI8(;<M$
MXECYE.9JNA]3H<JA_9+.^2P)L5&K'31;06,7]3.&8AU8,U?IXNJFF$G5>ZA[
MK'2+@4PXZ1-Q*#Y^V<)15."C>^6]U$W13 _5CKV\21<M/-=F%OV-40]SCJ?"
M.S0O.@\?H>W/AX-!]WBUXOZ5+ U +&U +!U +'N 6/RZ2YA1-B%,:I[9D<G)
M&9#RV.&M-]!_';?K.9*F(NGV^[V^:Y 6&$D<.I<Y$H>N98[$H6.9;SH.^Z%Y
ME"8<%*?-AZLYO% PYE7GLN/0JSR#V04EC0])F@8D&)==T3,8IYW ,QJ''8&9
M'G$R%)Z9/?75D<-&I:;Z)-439C7SS.=UN0_\PN[5M%7)=8[9M'?S3<T8#:98
M'NVH+WGE4CCR_:]<BAV@I3AE@D;DE%&YJ!#56%=SGE<MA"/7]ZIE<.0P7[4,
M4!O$(G+(78*-U]$D_(=YH;9+&Z\C^\4I-1M77HS9R%,C%V]PK48MA!,6$IW?
M==U?$ 0'5F^-+0!>%+PFM&4UO!-T@D;GV6*X67V?8(9')-(KXWK[%C5W <K3
ML 0[KE.:%$&<X$COEARI]&:%M&\"YL^O.)6$#\PUYL;0^#_3E$0S]M(Q>.Y\
M*C4#+Y_ (!^%WI#CD7>B_NC%:K,E:.8G"X* (387! %"'%"]N=_'+$HFIM-_
M(1HP>N>%:,#H>R]$ T+_Y]$)93BFOY,%UCT7Z63!:B'UDY8-:P0@D9^HFM8(
M0+BYO5K=!TS'L< 82A%P3/<):J&#*UP;.-J%/@V:-YN-BA>9;BG&&7"JKM8C
ML@F.XWPI\ ..AY]-*#0R0%27M%@Y!2;7$Q@$J F9Y!6HWX7\='1!1FX[F.5<
MCE;S7^1RM/QDYP)I7&Y'6DN@P)D[9%L'9U8S+K>6=4XF"9_FHW9U[-ZJGH Z
M!9"C6; <ZZ4FL]"D3@>92 F+=#X>2WJ]\ZYZ&?2ZSZ-=K3M7>4^9))QGJ2P3
MWU,Y?F*N)'&ULKH"=5GG*C,(I:\PE1>)I,.I7>IJ&AA:+^8NBSU'#4+MR_S,
M;QCH!6&OM7_2: >MYFH;*#L==WI\3*A9H/7",:9LL?45:6#8W6+BLMT]\H*P
MN$?>.-]K6"XQB,[*@KQ08T=S@+G>-28DM;O/QV@8%OR,MC(2>&1U9+T3*D+O
M2 TR#_G(X0:8P3#O(.C=$3Z,DWO7+%,6]DF8F8__.6:I]JQ.ED+#& L1)_GV
MJ9)F/.M%O3/,1^1(QU[@"3'75(.N^V[>\/QGB!WYC3^!?+5Q(E^YV8&P$NLW
MHQJZV<=82^>.7/./H$*SW*.$"8F9_)PDL;GBZ//9Q-%'(-:$!&:?)Y3$D5!<
M)OGC&3 I+93 M!QD-_/MYRD(6A,:9.DID\,2J3EW\]Z#=2E;&T$)K!%9*($U
MHBN>L%&Y&5UTC\Y4.F!BVC"AJWFU$6)>;9"6CK8JUL5TM"5F'VT2.4XBO3R0
M.Z3'4V"V><D)*:M9.H<V@%^""FWTD5>WGK$5@[I*R(;A C"$BT3^R +*YE&O
M:QK6O9767M!8<6_%]UN;H]#51M;K%8 F/T^]9$$$'NSBU0;G?>D\)MBITHJ@
M[L>D\Z"VF0A\T*N-X@3H5JUC:(7ZY>+31>_J @SKDL$I5&&MXSWWP.?T8:.V
MRM;C!3 66 L8P#;9>KRP!(:]1[8:*"Q%H>Z/O8CH?GA50@2[-_8R(R@=EVPU
MP6DR2W::P$/"\I)+9DYP(.%N,ZT ":IU@]UB>IEQ$W2$Y27A;BZ5AVG+MI8V
M !.6IX2] ;8:*"Q%X6]^K0[[2E\5MA/XK<!?\;O"_';#E3 ]1G)A-F098QU>
M &^=?<)=^EXZ4)Q ]S.>$*&NN[]("*![>6)<MM8.14?0:^SS4BY;77?P=>UI
MA+UOT7WJB9 PS&GB77[H=P^/ZW[=R[EUKG7S3<P@\,Z[Y[W^O^MUO_1Q];JK
MSWLMD<^OR >'K]"O4='/U5- [/HU*OK!X2OT:U;T<_7H$CM?J\+GZGDF=KYV
MA:\-S;UT*GANOC%M"=Y.!<_1\V&>XW5_ZUY<:M_<O2-,0G/-,[I&F0Z.8YG1
M[97I7#TG:H'AG?ZK>VQZ7?I (F@U.Z-KE.G@U.RL2ZM7A@2 U"OX*EUNW='#
MC)[C]7[]V#VZU#U:_EUXT'JT0KYF13XX(X)"OW9%/U=/9++KUZKHY^:S;DOD
MZU3D S,B*-1K5]2#4[N%?#L5^<",6 KY.A7Y7#T@S"[?;D4^5\_@L^NW4]$/
M3/46\NU5Y(,SK"KDVZW(M[N>?);-A=W 5S^M%3<7]NI I-BK2 &GJD[ZA^==
M/8@[X7A"H(WA9G2-,AV8$=P,KEF&6W=\9'F<O3'>WB=K%M(D-8^YWVK7?6LZ
MA%*]8!QM^<WVDD1#3&.5R-Y6$"*<)WQKJ[VS)(VXI6FJ\FG6[<__02ACMRRY
M9UL^VM;?R85\50-89D*UUN:>7;7CA)$:&A""Y-@(A#A)$RX1928DHEQYPH1/
MK3EL>>1!7^%E0C_N)0S5SWN1426F=Y/1./)436>Q%+,Z7UJ! I$'$F;Z2]*1
MI!,2;-4;0;L5M#H(LPAU6NW)D@QTQ>67(7^GC2:498H"-9 @8<*BZI65DU^_
MG)X=HY/#T[/N<25B2>&,M12&_!WGA:T]3.+ [^P%Z*.Z7HDI,V6248 :[;;]
M]C;RSB/YFTM5&4_:Y*3(U+2NIF$2Q\D]92/T^,BPP%Q2BM"FAI(PS#A7OOQ^
MK(RSR%%%RS$5**:,!&^6E!E'.%76\%CLV7E>ZGI=M;;_\SW]SE]R3Q%RFJK:
M'6H?=)_PVUD)%U2L_V;?PP?[7LJ)^GN31%/U,I:3^.!_4$L! A0#"@    @ 
MJT,'-POY?9<$"P  H8D  !(              *2!     &5X96-U=&EO;E]L
=;V<N:'1M;%!+!08      0 ! $     T"P     ! 
end

Mime
View raw message