harmony-alerts mailing list archives

Site index · List index
Message view « Date » · « Thread »
Top « Date » · « Thread »
From nom...@intel.com
Subject [build-test alert] FAILED Linux x86: jedit_test
Date Mon, 06 Aug 2007 22:34:01 GMT
svn.revision=563025
BUILD FAILED:
	Ant Error Message:
/export/users/cc/cc-suites/scripts/cc-exec-adaptor.xml:101: The following error occurred while
executing this line: /export/users/cc/cc-suites/adaptors/jedit_test/adaptor.xml:122: Some
of JEdit tests failed.

Date of build:	08/07/2007 05:33:28
Time to build:	26 seconds
Last changed:	08/06/2007 19:33:36
Last log entry:	snapshot

***********************************************************
Errors/Warnings:	(16)
            
Java Result: 1
Java Result: 1
[junit] Test org.apache.harmony.guitests.JEditLaunchTest FAILED
BUILD FAILED
/export/users/cc/cc-suites/tests/jedit_test/build.xml:118: if=test.not.passed
Total time: 7 seconds
[junit] Test org.apache.harmony.guitests.JEditFunctionalTest FAILED
BUILD FAILED
/export/users/cc/cc-suites/tests/jedit_test/build.xml:122: if=test.not.passed
Total time: 7 seconds
[junit] Test org.apache.harmony.guitests.JEditStressTest FAILED
BUILD FAILED
/export/users/cc/cc-suites/tests/jedit_test/build.xml:126: if=test.not.passed
Total time: 7 seconds
The execution FAILED with the following exception:
The following error occurred while executing this line:
/export/users/cc/cc-suites/adaptors/jedit_test/adaptor.xml:122: Some of JEdit tests failed.

***********************************************************
Unit Tests: (1)
        
failure: warning org.apache.harmony.guitests.JEditStressTest
Unit Test Error Details:	(3)
                
Test: warningClass: org.apache.harmony.guitests.JEditStressTestjunit.framework.AssertionFailedError:
Exception in constructor: test (java.lang.ExceptionInInitializerError
	at abbot.tester.WindowTracker.getTracker(WindowTracker.java:48)
	at abbot.finder.AWTHierarchy.<clinit>(AWTHierarchy.java:15)
	at junit.extensions.abbot.ScriptFixture.<clinit>(ScriptFixture.java:19)
	at org.apache.harmony.guitests.JEditStressTest.<init>(Unknown Source)
	at java.lang.reflect.VMReflection.newClassInstance(VMReflection.java)
	at java.lang.reflect.Constructor.newInstance(Constructor.java:283)
Caused by: java.lang.NullPointerException
	at java.awt.Toolkit.init(Unknown Source)
	at java.awt.Toolkit.<init>(Unknown Source)
	at java.awt.ToolkitImpl.<init>(ToolkitImpl.java:39)
	at java.awt.Toolkit.getDefaultToolkit(Unknown Source)
	at abbot.util.WeakAWTEventListener.<init>(WeakAWTEventListener.java:18)
	at abbot.tester.WindowTracker.<init>(WindowTracker.java:60)
	at abbot.tester.WindowTracker$Holder.<clinit>(WindowTracker.java:22)
	at abbot.tester.WindowTracker.getTracker(WindowTracker.java:48)
	... 11 more
)

***********************************************************
Modifications since last successful build:	(4)
            
add cc-snapshot log20070806193336Lbuild.9 08/06/2007 19:33:36snapshot
add cc-snapshot log20070802033730Lbuild.8 08/02/2007 03:37:30snapshot
add cc-snapshot log20070730190130Lbuild.7 07/30/2007 19:01:30snapshot
add cc-snapshot log20070724161215Lbuild.6 07/24/2007 16:12:15snapshot

begin 644 execution_log.zip
M4$L#! H    ( #PL!S=6NY:"IP0  ,<H   2    97AE8W5T:6]N7VQO9RYH
M=&UL[5IM3R,W$/Y<?H4_7 65;E\"7 )I+M*5%XDK/;40>I5.")G=V<3$L;>V
MER3]]1U[@;"0+!L@%;HN0IM=>_S,[-CS\D Z S/BW<ZEC*?=3JJ@VZ%$FRF'
MC^N)%,;3[!]HDYWPQY_7NVLJ$^TU8G^^7=%K>DY^R1B/$\91Y-+>^I,1+P@4
M'CP-QDN5G$S;)4()F&C@Q9""B'69(!/:4,Z]*XB9J2SHI3SKXTB5!5(Q%*7<
MHY>7LE1%2JW1U>4C.4K1;?DZB)]><$55=>%;^RL+5O#VC<7^@*J1%%/?&5.R
M /<Z2\L -;V&FRU!6<-$O_INVU.4@C(,'JRQ=S%P,'!.]NTGPI*8*8B,5%,2
MB$0'B!0,Y @"3B]CQ2_^IH'O4!\BD6^C(:X])WL*J('8 K67P2@\1!RH\!6D
M4IGEC(:)71-D&I0.H@A_/9TQ SIP01?@H8B&,C,Z<"9<X(P)<D5E1Q8EJ (/
M*)[<1Y&]$IO&4@T1IZ*?WZJ*)SV+SO0XS<3#^,AO,\',.3G)A+ NE:KOTQ2W
M8!99?6>!T?[G ]1Y[(!Z.+ 0ZTQ$-.L/#(%)!*EA4A FR*>O/>_@&H399]H%
M:V^ [QXO-FDQS!=JV#4XL*= [(C/J>C[1\* PF1XH)1$7^]1(:0A&+8"G:]3
M3J=D?7TAS@_4S/,-'1M_;(8^9R*;^'^=@KH&M2>%P'.)!OL=AJN[&X\GK(;V
M=OC3RQ0>V^M7)F(Y/J0N$FXUSIG)539?167OUZ(B?';PNYOE\+/M4)!P](7_
MYV\G^9WUBH#Q'J=:']GD*B+8*,S:Q<O"H\NU49GU@$6_ [X_[BS?W-FJBNU,
M+**Y$8?3W-VN@&-]VI.2#YGQ(Y<"T(4;9V(HY%B04YFI"):$H5$$6K_;"L,7
MX;QK^'9CE\(H.32/0M7';+3Q>#0_G*W%>F;N_Y)Q_KMD-IP/;C/#<J[J@[EG
MP1\99/ \G\W)9^[]YHWG;_AA,;+-J9K8RD<:[\DA93Q3V$^0\#UQ.4N[\1X;
M 0%.4PTQSF%?$Y4B+I/1R>&GH^.#_9)2T@<!"D^K-Z]OR-7F,ZA<4:$3J4;$
MH,EMTMIMCO1BZ'D%JMC;GQT=[\^SL*1JNK>\7ROO6$&[T=AI$Y9\M,,^5@)L
M(#6Z=+'^GL1^[_9=K-LE=J@%B<]X)2>@,VYPJVZF(IE.L<SCU9;7!K'LA!CY
M=*U7#JA@_688MKQPQPM;%^&'K:V:^M34IZ8^-?5YH[SDK5"?! N+[1$H?P7Z
M<W@']DP*5'.7FKO4W.7_Q5U>Z0\B-05:%04J9O65TJ#=5JN,!BTJ5BNE0IN;
M-16JJ5!-A6HJM(31-15Z4RHJ42%L&['/>@4:=.J _HO_ GW_34_-%6NN6'/%
MFBN64Z#&C *%CRB0O]ULO@(-FF7U%5.@1AD%FE>D5DM_FM\#_7E18S1'!8:Z
MF6OYEK-</]=TA[O6&^#YG4"4N7J7[R49,S,@!F<2R;D<6V5W-;'MEMR;L,% 
M9!1E2F'G-!Y8;]X@XK09,$TPDT-[K<1(&M,4'52P[V9LQHQ/L:,F,B$N1(@[
M2"3!N(387^L$M-L)W/<4@_P[BX'[ N._4$L! A0#"@    @ /"P'-U:[EH*G
M!   QR@  !(              *2!     &5X96-U=&EO;E]L;V<N:'1M;%!+
4!08      0 ! $    #7!      ! 
end

Mime
View raw message