harmony-alerts mailing list archives

Site index · List index
Message view « Date » · « Thread »
Top « Date » · « Thread »
From nom...@intel.com
Subject [build-test alert] BUILD FAILED Linux x86: reliability
Date Mon, 06 Aug 2007 13:07:36 GMT
BUILD FAILED:
	Ant Error Message:
/export/users/cc/cc-reliability/scripts/cc-exec-adaptor.xml:101: The following error occurred while executing this line: /export/users/cc/cc-reliability/adaptors/reliability/adaptor.xml:97: Some reliability tests failed on /export/users/cc/cc-reliability/build/checkouts/snapshot/hdk/jdk/jre/bin/java

Date of build:	08/06/2007 19:41:52
Time to build:	25 minutes 36 seconds
Last changed:	08/06/2007 19:41:22
Last log entry:	snapshot

***********************************************************
Errors/Warnings:	(279)
            
[java] Java Result: 104
[java] Java Result: 104
[java] Java Result: 104
[java] Java Result: 104
[java] Java Result: 104
[java] Java Result: 104
[java] Java Result: 104
[java] Java Result: 104
[java] Java Result: 104
[java] Java Result: 104
[java] Java Result: 104
[java] Java Result: 104
[java] Java Result: 104
[java] Java Result: 1
[java] Java Result: 104
[java] Java Result: 104
[java] Java Result: 104
[java] Java Result: 104
[java] Java Result: 104
[java] Java Result: 104
[java] Java Result: 104
[java] Java Result: 1
[java] Java Result: 104
[java] Java Result: 104
[java] Timeout: killed the sub-process
[java] 	at org.apache.tools.ant.taskdefs.Java.fork(Java.java:754)
[java] 	at org.apache.tools.ant.taskdefs.Java.executeJava(Java.java:171)
[java] 	at org.apache.tools.ant.taskdefs.Java.execute(Java.java:84)
[java] 	at org.apache.tools.ant.UnknownElement.execute(UnknownElement.java:275)
[java] 	at org.apache.tools.ant.Task.perform(Task.java:364)
[java] 	at org.apache.tools.ant.taskdefs.Sequential.execute(Sequential.java:64)
[java] 	at net.sf.antcontrib.logic.IfTask.execute(IfTask.java:197)
[java] 	at sun.reflect.GeneratedMethodAccessor5.invoke(Unknown Source)
[java] 	at sun.reflect.DelegatingMethodAccessorImpl.invoke(DelegatingMethodAccessorImpl.java:25)
[java] 	at java.lang.reflect.Method.invoke(Method.java:585)
[java] 	at org.apache.tools.ant.TaskAdapter.execute(TaskAdapter.java:123)
[java] 	at org.apache.tools.ant.UnknownElement.execute(UnknownElement.java:275)
[java] 	at org.apache.tools.ant.Task.perform(Task.java:364)
[java] 	at org.apache.tools.ant.taskdefs.Sequential.execute(Sequential.java:64)
[java] 	at org.apache.tools.ant.UnknownElement.execute(UnknownElement.java:275)
[java] 	at org.apache.tools.ant.Task.perform(Task.java:364)
[java] 	at org.apache.tools.ant.taskdefs.MacroInstance.execute(MacroInstance.java:378)
[java] 	at org.apache.tools.ant.UnknownElement.execute(UnknownElement.java:275)
[java] 	at org.apache.tools.ant.Task.perform(Task.java:364)
[java] 	at org.apache.tools.ant.Target.execute(Target.java:341)
[java] 	at org.apache.tools.ant.Target.performTasks(Target.java:369)
[java] 	at org.apache.tools.ant.Project.executeSortedTargets(Project.java:1216)
[java] 	at org.apache.tools.ant.Project.executeTarget(Project.java:1185)
[java] 	at org.apache.tools.ant.helper.DefaultExecutor.executeTargets(DefaultExecutor.java:40)
[java] 	at org.apache.tools.ant.Project.executeTargets(Project.java:1068)
[java] 	at org.apache.tools.ant.Main.runBuild(Main.java:668)
[java] 	at org.apache.tools.ant.Main.startAnt(Main.java:187)
[java] 	at org.apache.tools.ant.launch.Launcher.run(Launcher.java:246)
[java] 	at org.apache.tools.ant.launch.Launcher.main(Launcher.java:67)
[java] Timeout: killed the sub-process
[java] 	at org.apache.tools.ant.taskdefs.Java.fork(Java.java:754)
[java] 	at org.apache.tools.ant.taskdefs.Java.executeJava(Java.java:171)
[java] 	at org.apache.tools.ant.taskdefs.Java.execute(Java.java:84)
[java] 	at org.apache.tools.ant.UnknownElement.execute(UnknownElement.java:275)
[java] 	at org.apache.tools.ant.Task.perform(Task.java:364)
[java] 	at org.apache.tools.ant.taskdefs.Sequential.execute(Sequential.java:64)
[java] 	at net.sf.antcontrib.logic.IfTask.execute(IfTask.java:197)
[java] 	at sun.reflect.GeneratedMethodAccessor5.invoke(Unknown Source)
[java] 	at sun.reflect.DelegatingMethodAccessorImpl.invoke(DelegatingMethodAccessorImpl.java:25)
[java] 	at java.lang.reflect.Method.invoke(Method.java:585)
[java] 	at org.apache.tools.ant.TaskAdapter.execute(TaskAdapter.java:123)
[java] 	at org.apache.tools.ant.UnknownElement.execute(UnknownElement.java:275)
[java] 	at org.apache.tools.ant.Task.perform(Task.java:364)
[java] 	at org.apache.tools.ant.taskdefs.Sequential.execute(Sequential.java:64)
[java] 	at org.apache.tools.ant.UnknownElement.execute(UnknownElement.java:275)
[java] 	at org.apache.tools.ant.Task.perform(Task.java:364)
[java] 	at org.apache.tools.ant.taskdefs.MacroInstance.execute(MacroInstance.java:378)
[java] 	at org.apache.tools.ant.UnknownElement.execute(UnknownElement.java:275)
[java] 	at org.apache.tools.ant.Task.perform(Task.java:364)
[java] 	at org.apache.tools.ant.Target.execute(Target.java:341)
[java] 	at org.apache.tools.ant.Target.performTasks(Target.java:369)
[java] 	at org.apache.tools.ant.Project.executeSortedTargets(Project.java:1216)
[java] 	at org.apache.tools.ant.Project.executeTarget(Project.java:1185)
[java] 	at org.apache.tools.ant.helper.DefaultExecutor.executeTargets(DefaultExecutor.java:40)
[java] 	at org.apache.tools.ant.Project.executeTargets(Project.java:1068)
[java] 	at org.apache.tools.ant.Main.runBuild(Main.java:668)
[java] 	at org.apache.tools.ant.Main.startAnt(Main.java:187)
[java] 	at org.apache.tools.ant.launch.Launcher.run(Launcher.java:246)
[java] 	at org.apache.tools.ant.launch.Launcher.main(Launcher.java:67)
[java] Java Result: 104
[java] Java Result: 104
[java] Java Result: 1
[java] Java Result: 104
[java] Java Result: 104
[java] Java Result: 104
[java] Java Result: 104
[java] Java Result: 104
[java] Java Result: 104
[java] Java Result: 104
[java] Java Result: 104
[java] Timeout: killed the sub-process
[java] 	at org.apache.tools.ant.taskdefs.Java.fork(Java.java:754)
[java] 	at org.apache.tools.ant.taskdefs.Java.executeJava(Java.java:171)
[java] 	at org.apache.tools.ant.taskdefs.Java.execute(Java.java:84)
[java] 	at org.apache.tools.ant.UnknownElement.execute(UnknownElement.java:275)
[java] 	at org.apache.tools.ant.Task.perform(Task.java:364)
[java] 	at org.apache.tools.ant.taskdefs.Sequential.execute(Sequential.java:64)
[java] 	at net.sf.antcontrib.logic.IfTask.execute(IfTask.java:197)
[java] 	at sun.reflect.GeneratedMethodAccessor5.invoke(Unknown Source)
[java] 	at sun.reflect.DelegatingMethodAccessorImpl.invoke(DelegatingMethodAccessorImpl.java:25)
[java] 	at java.lang.reflect.Method.invoke(Method.java:585)
[java] 	at org.apache.tools.ant.TaskAdapter.execute(TaskAdapter.java:123)
[java] 	at org.apache.tools.ant.UnknownElement.execute(UnknownElement.java:275)
[java] 	at org.apache.tools.ant.Task.perform(Task.java:364)
[java] 	at org.apache.tools.ant.taskdefs.Sequential.execute(Sequential.java:64)
[java] 	at org.apache.tools.ant.UnknownElement.execute(UnknownElement.java:275)
[java] 	at org.apache.tools.ant.Task.perform(Task.java:364)
[java] 	at org.apache.tools.ant.taskdefs.MacroInstance.execute(MacroInstance.java:378)
[java] 	at org.apache.tools.ant.UnknownElement.execute(UnknownElement.java:275)
[java] 	at org.apache.tools.ant.Task.perform(Task.java:364)
[java] 	at org.apache.tools.ant.Target.execute(Target.java:341)
[java] 	at org.apache.tools.ant.Target.performTasks(Target.java:369)
[java] 	at org.apache.tools.ant.Project.executeSortedTargets(Project.java:1216)
[java] 	at org.apache.tools.ant.Project.executeTarget(Project.java:1185)
[java] 	at org.apache.tools.ant.helper.DefaultExecutor.executeTargets(DefaultExecutor.java:40)
[java] 	at org.apache.tools.ant.Project.executeTargets(Project.java:1068)
[java] 	at org.apache.tools.ant.Main.runBuild(Main.java:668)
[java] 	at org.apache.tools.ant.Main.startAnt(Main.java:187)
[java] 	at org.apache.tools.ant.launch.Launcher.run(Launcher.java:246)
[java] 	at org.apache.tools.ant.launch.Launcher.main(Launcher.java:67)
[java] Java Result: 104
[java] Timeout: killed the sub-process
[java] 	at org.apache.tools.ant.taskdefs.Java.fork(Java.java:754)
[java] 	at org.apache.tools.ant.taskdefs.Java.executeJava(Java.java:171)
[java] 	at org.apache.tools.ant.taskdefs.Java.execute(Java.java:84)
[java] 	at org.apache.tools.ant.UnknownElement.execute(UnknownElement.java:275)
[java] 	at org.apache.tools.ant.Task.perform(Task.java:364)
[java] 	at org.apache.tools.ant.taskdefs.Sequential.execute(Sequential.java:64)
[java] 	at net.sf.antcontrib.logic.IfTask.execute(IfTask.java:197)
[java] 	at sun.reflect.GeneratedMethodAccessor5.invoke(Unknown Source)
[java] 	at sun.reflect.DelegatingMethodAccessorImpl.invoke(DelegatingMethodAccessorImpl.java:25)
[java] 	at java.lang.reflect.Method.invoke(Method.java:585)
[java] 	at org.apache.tools.ant.TaskAdapter.execute(TaskAdapter.java:123)
[java] 	at org.apache.tools.ant.UnknownElement.execute(UnknownElement.java:275)
[java] 	at org.apache.tools.ant.Task.perform(Task.java:364)
[java] 	at org.apache.tools.ant.taskdefs.Sequential.execute(Sequential.java:64)
[java] 	at org.apache.tools.ant.UnknownElement.execute(UnknownElement.java:275)
[java] 	at org.apache.tools.ant.Task.perform(Task.java:364)
[java] 	at org.apache.tools.ant.taskdefs.MacroInstance.execute(MacroInstance.java:378)
[java] 	at org.apache.tools.ant.UnknownElement.execute(UnknownElement.java:275)
[java] 	at org.apache.tools.ant.Task.perform(Task.java:364)
[java] 	at org.apache.tools.ant.Target.execute(Target.java:341)
[java] 	at org.apache.tools.ant.Target.performTasks(Target.java:369)
[java] 	at org.apache.tools.ant.Project.executeSortedTargets(Project.java:1216)
[java] 	at org.apache.tools.ant.Project.executeTarget(Project.java:1185)
[java] 	at org.apache.tools.ant.helper.DefaultExecutor.executeTargets(DefaultExecutor.java:40)
[java] 	at org.apache.tools.ant.Project.executeTargets(Project.java:1068)
[java] 	at org.apache.tools.ant.Main.runBuild(Main.java:668)
[java] 	at org.apache.tools.ant.Main.startAnt(Main.java:187)
[java] 	at org.apache.tools.ant.launch.Launcher.run(Launcher.java:246)
[java] 	at org.apache.tools.ant.launch.Launcher.main(Launcher.java:67)
[java] Java Result: 104
[java] Java Result: 104
[java] Java Result: 104
[java] Java Result: 104
[java] Java Result: 104
[java] Java Result: 104
[java] Java Result: 104
[java] Java Result: 104
[java] Java Result: 104
[java] Java Result: 104
[java] Java Result: 104
[java] Java Result: 104
[java] Java Result: 104
[java] Java Result: 104
[java] Java Result: 104
[java] Java Result: 104
[java] Java Result: 104
[java] Java Result: 104
[java] Java Result: 104
[java] Timeout: killed the sub-process
[java] 	at org.apache.tools.ant.taskdefs.Java.fork(Java.java:754)
[java] 	at org.apache.tools.ant.taskdefs.Java.executeJava(Java.java:171)
[java] 	at org.apache.tools.ant.taskdefs.Java.execute(Java.java:84)
[java] 	at org.apache.tools.ant.UnknownElement.execute(UnknownElement.java:275)
[java] 	at org.apache.tools.ant.Task.perform(Task.java:364)
[java] 	at org.apache.tools.ant.taskdefs.Sequential.execute(Sequential.java:64)
[java] 	at net.sf.antcontrib.logic.IfTask.execute(IfTask.java:197)
[java] 	at sun.reflect.GeneratedMethodAccessor5.invoke(Unknown Source)
[java] 	at sun.reflect.DelegatingMethodAccessorImpl.invoke(DelegatingMethodAccessorImpl.java:25)
[java] 	at java.lang.reflect.Method.invoke(Method.java:585)
[java] 	at org.apache.tools.ant.TaskAdapter.execute(TaskAdapter.java:123)
[java] 	at org.apache.tools.ant.UnknownElement.execute(UnknownElement.java:275)
[java] 	at org.apache.tools.ant.Task.perform(Task.java:364)
[java] 	at org.apache.tools.ant.taskdefs.Sequential.execute(Sequential.java:64)
[java] 	at org.apache.tools.ant.UnknownElement.execute(UnknownElement.java:275)
[java] 	at org.apache.tools.ant.Task.perform(Task.java:364)
[java] 	at org.apache.tools.ant.taskdefs.MacroInstance.execute(MacroInstance.java:378)
[java] 	at org.apache.tools.ant.UnknownElement.execute(UnknownElement.java:275)
[java] 	at org.apache.tools.ant.Task.perform(Task.java:364)
[java] 	at org.apache.tools.ant.Target.execute(Target.java:341)
[java] 	at org.apache.tools.ant.Target.performTasks(Target.java:369)
[java] 	at org.apache.tools.ant.Project.executeSortedTargets(Project.java:1216)
[java] 	at org.apache.tools.ant.Project.executeTarget(Project.java:1185)
[java] 	at org.apache.tools.ant.helper.DefaultExecutor.executeTargets(DefaultExecutor.java:40)
[java] 	at org.apache.tools.ant.Project.executeTargets(Project.java:1068)
[java] 	at org.apache.tools.ant.Main.runBuild(Main.java:668)
[java] 	at org.apache.tools.ant.Main.startAnt(Main.java:187)
[java] 	at org.apache.tools.ant.launch.Launcher.run(Launcher.java:246)
[java] 	at org.apache.tools.ant.launch.Launcher.main(Launcher.java:67)
[java] Java Result: 104
[java] Java Result: 139
[java] Java Result: 105
[java] Java Result: 104
[java] Java Result: 134
[java] Java Result: 104
[java] Timeout: killed the sub-process
[java] 	at org.apache.tools.ant.taskdefs.Java.fork(Java.java:754)
[java] 	at org.apache.tools.ant.taskdefs.Java.executeJava(Java.java:171)
[java] 	at org.apache.tools.ant.taskdefs.Java.execute(Java.java:84)
[java] 	at org.apache.tools.ant.UnknownElement.execute(UnknownElement.java:275)
[java] 	at org.apache.tools.ant.Task.perform(Task.java:364)
[java] 	at org.apache.tools.ant.taskdefs.Sequential.execute(Sequential.java:64)
[java] 	at net.sf.antcontrib.logic.IfTask.execute(IfTask.java:197)
[java] 	at sun.reflect.GeneratedMethodAccessor5.invoke(Unknown Source)
[java] 	at sun.reflect.DelegatingMethodAccessorImpl.invoke(DelegatingMethodAccessorImpl.java:25)
[java] 	at java.lang.reflect.Method.invoke(Method.java:585)
[java] 	at org.apache.tools.ant.TaskAdapter.execute(TaskAdapter.java:123)
[java] 	at org.apache.tools.ant.UnknownElement.execute(UnknownElement.java:275)
[java] 	at org.apache.tools.ant.Task.perform(Task.java:364)
[java] 	at org.apache.tools.ant.taskdefs.Sequential.execute(Sequential.java:64)
[java] 	at org.apache.tools.ant.UnknownElement.execute(UnknownElement.java:275)
[java] 	at org.apache.tools.ant.Task.perform(Task.java:364)
[java] 	at org.apache.tools.ant.taskdefs.MacroInstance.execute(MacroInstance.java:378)
[java] 	at org.apache.tools.ant.UnknownElement.execute(UnknownElement.java:275)
[java] 	at org.apache.tools.ant.Task.perform(Task.java:364)
[java] 	at org.apache.tools.ant.Target.execute(Target.java:341)
[java] 	at org.apache.tools.ant.Target.performTasks(Target.java:369)
[java] 	at org.apache.tools.ant.Project.executeSortedTargets(Project.java:1216)
[java] 	at org.apache.tools.ant.Project.executeTarget(Project.java:1185)
[java] 	at org.apache.tools.ant.helper.DefaultExecutor.executeTargets(DefaultExecutor.java:40)
[java] 	at org.apache.tools.ant.Project.executeTargets(Project.java:1068)
[java] 	at org.apache.tools.ant.Main.runBuild(Main.java:668)
[java] 	at org.apache.tools.ant.Main.startAnt(Main.java:187)
[java] 	at org.apache.tools.ant.launch.Launcher.run(Launcher.java:246)
[java] 	at org.apache.tools.ant.launch.Launcher.main(Launcher.java:67)
[java] Java Result: 104
[java] Java Result: 104
[java] Java Result: 104
[java] Java Result: 104
[java] Java Result: 104
[java] Timeout: killed the sub-process
[java] 	at org.apache.tools.ant.taskdefs.Java.fork(Java.java:754)
[java] 	at org.apache.tools.ant.taskdefs.Java.executeJava(Java.java:171)
[java] 	at org.apache.tools.ant.taskdefs.Java.execute(Java.java:84)
[java] 	at org.apache.tools.ant.UnknownElement.execute(UnknownElement.java:275)
[java] 	at org.apache.tools.ant.Task.perform(Task.java:364)
[java] 	at org.apache.tools.ant.taskdefs.Sequential.execute(Sequential.java:64)
[java] 	at net.sf.antcontrib.logic.IfTask.execute(IfTask.java:197)
[java] 	at sun.reflect.GeneratedMethodAccessor5.invoke(Unknown Source)
[java] 	at sun.reflect.DelegatingMethodAccessorImpl.invoke(DelegatingMethodAccessorImpl.java:25)
[java] 	at java.lang.reflect.Method.invoke(Method.java:585)
[java] 	at org.apache.tools.ant.TaskAdapter.execute(TaskAdapter.java:123)
[java] 	at org.apache.tools.ant.UnknownElement.execute(UnknownElement.java:275)
[java] 	at org.apache.tools.ant.Task.perform(Task.java:364)
[java] 	at org.apache.tools.ant.taskdefs.Sequential.execute(Sequential.java:64)
[java] 	at org.apache.tools.ant.UnknownElement.execute(UnknownElement.java:275)
[java] 	at org.apache.tools.ant.Task.perform(Task.java:364)
[java] 	at org.apache.tools.ant.taskdefs.MacroInstance.execute(MacroInstance.java:378)
[java] 	at org.apache.tools.ant.UnknownElement.execute(UnknownElement.java:275)
[java] 	at org.apache.tools.ant.Task.perform(Task.java:364)
[java] 	at org.apache.tools.ant.Target.execute(Target.java:341)
[java] 	at org.apache.tools.ant.Target.performTasks(Target.java:369)
[java] 	at org.apache.tools.ant.Project.executeSortedTargets(Project.java:1216)
[java] 	at org.apache.tools.ant.Project.executeTarget(Project.java:1185)
[java] 	at org.apache.tools.ant.helper.DefaultExecutor.executeTargets(DefaultExecutor.java:40)
[java] 	at org.apache.tools.ant.Project.executeTargets(Project.java:1068)
[java] 	at org.apache.tools.ant.Main.runBuild(Main.java:668)
[java] 	at org.apache.tools.ant.Main.startAnt(Main.java:187)
[java] 	at org.apache.tools.ant.launch.Launcher.run(Launcher.java:246)
[java] 	at org.apache.tools.ant.launch.Launcher.main(Launcher.java:67)
[java] Java Result: 104
[java] Java Result: 104
The execution FAILED with the following exception:
The following error occurred while executing this line:
/export/users/cc/cc-reliability/adaptors/reliability/adaptor.xml:97: Some reliability tests failed on /export/users/cc/cc-reliability/build/checkouts/snapshot/hdk/jdk/jre/bin/java

***********************************************************
Unit Tests: (75)
        
error: test api.kernel.hooks.AddRmPropertiesHooksTest
error: test api.kernel.string.InternThreadingTest
error: test api.kernel.thread.RecursiveThreadTest.RecursiveTest
error: test api.kernel.thread.ThreadArrayTest.ThreadArrayTest
error: test api.kernel.thread.ThreadSuspendResume.ThreadSuspendResume
error: test api.net.HttpConnectionTest
error: test api.net.MultiConnectTest
error: test api.net.SingleConnectTest
error: test api.nio.charset.DecodingModesTest
error: test api.nio.charset.EncodingModesTest
error: test api.util.ConcurrentTest
error: test vm.classloading.ClassCastTest
error: test vm.stack.StackUnwindTest
Unit Test Error Details:	(13)
                
Test: testClass: api.kernel.hooks.AddRmPropertiesHooksTestOK
The GC did not provide gc_add_weak_root_set_entry()
OK
OK
OK
OK
OK
OK
OK
OK
OK
OK
OK
OK
OK
OK
OK
OK
OK
OK
OK
OK
OK
OK
OK
OK
OK
OK
Uncaught exception in main:
java.lang.OutOfMemoryError: Failed to create new thread
	at java.lang.Thread.start(Thread.java:744)
	at org.apache.harmony.test.reliability.api.kernel.hooks.AddRmPropertiesHooksTest.createExecutedHooks(Unknown Source)
	at org.apache.harmony.test.reliability.api.kernel.hooks.AddRmPropertiesHooksTest.playWithShutdownHooks(Unknown Source)
	at org.apache.harmony.test.reliability.api.kernel.hooks.AddRmPropertiesHooksTest.test(Unknown Source)
	at org.apache.harmony.test.reliability.share.LongRunningTestStarter.test(Unknown Source)
	at org.apache.harmony.test.reliability.share.ReliabilityTestStarter.test(Unknown Source)
	at org.apache.harmony.test.reliability.share.ReliabilityTestStarter.main(Unknown Source)
Test: testClass: api.kernel.string.InternThreadingTestThe GC did not provide gc_add_weak_root_set_entry()
OK
OK
OK
OK
OK
OK
OK
OK
OK
OK
OK
OK
OK
OK
OK
OK
OK
OK
OK
OK
OK
OK
OK
OK
OK
OK
OK
OK
OK
OK
OK
OK
OK
OK
OK
OK
OK
OK
OK
OK
OK
OK
OK
OK
OK
OK
OK
OK
OK
OK
OK
OK
OK
OK
OK
OK
OK
OK
OK
OK
OK
OK
OK
OK
OK
OK
OK
OK
OK
OK
OK
OK
OK
OK
OK
OK
OK
OK
OK
OK
OK
OK
OK
OK
OK
OK
OK
OK
OK
OK
OK
OK
OK
OK
OK
OK
OK
OK
OK
OK
OK
OK
OK
OK
OK
OK
OK
OK
OK
Uncaught exception in main:
java.lang.OutOfMemoryError: Failed to create new thread
	at java.lang.Thread.start(Thread.java:744)
	at org.apache.harmony.test.reliability.api.kernel.string.InternThreadingTest.test(Unknown Source)
	at org.apache.harmony.test.reliability.share.LongRunningTestStarter.test(Unknown Source)
	at org.apache.harmony.test.reliability.share.ReliabilityTestStarter.test(Unknown Source)
	at org.apache.harmony.test.reliability.share.ReliabilityTestStarter.main(Unknown Source)
Test: testClass: api.kernel.thread.RecursiveThreadTest.RecursiveTestOK
The GC did not provide gc_add_weak_root_set_entry()
OK
OK
OK
OK
OK
OK
OK
OK
OK
OK
OK
OK
OK
OK
OK
OK
OK
OK
OK
OK
OK
OK
OK
OK
OK
OK
OK
OK
OK
OK
OK
OK
OK
OK
OK
OK
OK
OK
OK
OK
OK
OK
OK
OK
OK
OK
OK
OK
OK
OK
OK
OK
OK
Uncaught exception in Thread-5527:
java.lang.OutOfMemoryError: Failed to create new thread
	at java.lang.Thread.start(Thread.java:744)
	at org.apache.harmony.test.reliability.api.kernel.thread.RecursiveThreadTest.recurThread.run(Unknown Source)
Test: testClass: api.kernel.thread.ThreadArrayTest.ThreadArrayTestThe GC did not provide gc_add_weak_root_set_entry()
OK
Uncaught exception in main:
java.lang.OutOfMemoryError: Failed to create new thread
	at java.lang.Thread.start(Thread.java:744)
	at org.apache.harmony.test.reliability.api.kernel.thread.ThreadArrayTest.ThreadArrayTest.test(Unknown Source)
	at org.apache.harmony.test.reliability.share.LongRunningTestStarter.test(Unknown Source)
	at org.apache.harmony.test.reliability.share.ReliabilityTestStarter.test(Unknown Source)
	at org.apache.harmony.test.reliability.share.ReliabilityTestStarter.main(Unknown Source)
Test: testClass: api.kernel.thread.ThreadSuspendResume.ThreadSuspendResumeThe GC did not provide gc_add_weak_root_set_entry()
Test: testClass: api.net.HttpConnectionTest
Test: testClass: api.net.MultiConnectTestThe GC did not provide gc_add_weak_root_set_entry()
SIGSEGV in VM code.
Stack trace:
Warning: Cannot get modules info, no symbolic information will be provided
  0: ?? (??:-1)
  1: org/apache/harmony/luni/platform/OSNetworkSystem.createServerStreamSocketImpl(Ljava/io/FileDescriptor;Z)V (OSNetworkSystem.java:-2)
  2: org/apache/harmony/luni/platform/OSNetworkSystem.createServerStreamSocket(Ljava/io/FileDescriptor;Z)V (OSNetworkSystem.java:223)
  3: org/apache/harmony/luni/net/PlainServerSocketImpl.create(Z)V (PlainServerSocketImpl.java:49)
  4: java/net/ServerSocket.LTinitGT(IILjava/net/InetAddress;)V (ServerSocket.java:117)
  5: java/net/ServerSocket.LTinitGT(I)V (ServerSocket.java:76)
  6: org/apache/harmony/test/reliability/api/net/ServerRunner.run()V (??:-1)
  7: java/lang/Thread.runImpl()V (Thread.java:673)
LTend of stack traceGT
Test: testClass: api.net.SingleConnectTestThe GC did not provide gc_add_weak_root_set_entry()
Server thread 42 could not accept request: The address is not available
FAILED
*** iteration: 0
test result is 105
Test FAILED
Test: testClass: api.nio.charset.DecodingModesTestSIGABRT in VM code.
Stack trace:
Test: testClass: api.nio.charset.EncodingModesTestThe GC did not provide gc_add_weak_root_set_entry()
Test: testClass: api.util.ConcurrentTest
Test: testClass: vm.classloading.ClassCastTestThe GC did not provide gc_add_weak_root_set_entry()
Test: testClass: vm.stack.StackUnwindTestclass constructor has thrown an exception
SIGABRT in VM code.
Stack trace:
addr2line: '[vdso]': No such file
  0: ?? (Dʷ:-1)
  1: abort (??:-1)
  2: .L676 (jit_runtime_support.cpp:-1)
  3: create_lazy_exception(Class*, Method*, unsigned char*, jvalue*) (exceptions_jit.cpp:-1)
  4: exn_propagate_exception(StackIterator*, ManagedObject**, Class*, Method*, unsigned char*, jvalue*) (exceptions_jit.cpp:-1)
  5: exn_throw_for_JIT(ManagedObject*, Class*, Method*, unsigned char*, jvalue*) (??:-1)
  6: exn_athrow(ManagedObject*, Class*, Method*, unsigned char*) (??:-1)
  7: ?? (??:-1)
  8: org/apache/harmony/test/reliability/vm/stack/Method1Class.Test3()V (??:-1)
  9: org/apache/harmony/test/reliability/vm/stack/StackUnwindTest.intersectMethodCall()V (??:-1)
 10: org/apache/harmony/test/reliability/vm/stack/Method3Class.TestHotInline()V (??:-1)
 11: org/apache/harmony/test/reliability/vm/stack/StackUnwindTest.intersectMethodCall()V (??:-1)
 12: org/apache/harmony/test/reliability/vm/stack/Method2Class.Test1()V (??:-1)
 13: org/apache/harmony/test/reliability/vm/stack/StackUnwindTest.intersectMethodCall()V (??:-1)
 14: org/apache/harmony/test/reliability/vm/stack/Method1Class.Test1()V (??:-1)
 15: org/apache/harmony/test/reliability/vm/stack/StackUnwindTest.intersectMethodCall()V (??:-1)
 16: org/apache/harmony/test/reliability/vm/stack/Method3Class.TestHotInline()V (??:-1)
 17: org/apache/harmony/test/reliability/vm/stack/StackUnwindTest.intersectMethodCall()V (??:-1)
 18: org/apache/harmony/test/reliability/vm/stack/Method2Class.Test3()V (??:-1)
 19: org/apache/harmony/test/reliability/vm/stack/StackUnwindTest.intersectMethodCall()V (??:-1)
 20: org/apache/harmony/test/reliability/vm/stack/Method1Class.Test1()V (??:-1)
 21: org/apache/harmony/test/reliability/vm/stack/StackUnwindTest.intersectMethodCall()V (??:-1)
 22: org/apache/harmony/test/reliability/vm/stack/Method3Class.Test3()V (??:-1)
 23: org/apache/harmony/test/reliability/vm/stack/Method3Class.Test2()V (??:-1)
 24: org/apache/harmony/test/reliability/vm/stack/Method3Class.Test1()V (??:-1)
 25: org/apache/harmony/test/reliability/vm/stack/StackUnwindTest.intersectMethodCall()V (??:-1)
 26: org/apache/harmony/test/reliability/vm/stack/Method1Class.TestHotInline()V (??:-1)
 27: org/apache/harmony/test/reliability/vm/stack/StackUnwindTest.intersectMethodCall()V (??:-1)
 28: org/apache/harmony/test/reliability/vm/stack/Method3Class.Test3()V (??:-1)
 29: org/apache/harmony/test/reliability/vm/stack/Method3Class.Test2()V (??:-1)
 30: org/apache/harmony/test/reliability/vm/stack/Method3Class.Test1()V (??:-1)
 31: org/apache/harmony/test/reliability/vm/stack/StackUnwindTest.intersectMethodCall()V (??:-1)
 32: org/apache/harmony/test/reliability/vm/stack/Method3Class.TestHotInline()V (??:-1)
 33: org/apache/harmony/test/reliability/vm/stack/StackUnwindTest.intersectMethodCall()V (??:-1)
 34: org/apache/harmony/test/reliability/vm/stack/Method1Class.Test3()V (??:-1)
 35: org/apache/harmony/test/reliability/vm/stack/StackUnwindTest.intersectMethodCall()V (??:-1)
 36: org/apache/harmony/test/reliability/vm/stack/Method2Class.TestHotInline()V (??:-1)
 37: org/apache/harmony/test/reliability/vm/stack/StackUnwindTest.intersectMethodCall()V (??:-1)
 38: org/apache/harmony/test/reliability/vm/stack/Method3Class.Test3()V (??:-1)
 39: org/apache/harmony/test/reliability/vm/stack/Method3Class.Test2()V (??:-1)
 40: org/apache/harmony/test/reliability/vm/stack/StackUnwindTest.intersectMethodCall()V (??:-1)
 41: org/apache/harmony/test/reliability/vm/stack/Method2Class.Test2()V (??:-1)
 42: org/apache/harmony/test/reliability/vm/stack/StackUnwindTest.intersectMethodCall()V (??:-1)
 43: org/apache/harmony/test/reliability/vm/stack/Method1Class.Test2()V (??:-1)
 44: org/apache/harmony/test/reliability/vm/stack/StackUnwindTest.intersectMethodCall()V (??:-1)
 45: org/apache/harmony/test/reliability/vm/stack/Method3Class.Test3()V (??:-1)
 46: org/apache/harmony/test/reliability/vm/stack/Method3Class.Test2()V (??:-1)
 47: org/apache/harmony/test/reliability/vm/stack/StackUnwindTest.intersectMethodCall()V (??:-1)
 48: org/apache/harmony/test/reliability/vm/stack/Method2Class.Test2()V (??:-1)
 49: org/apache/harmony/test/reliability/vm/stack/StackUnwindTest.intersectMethodCall()V (??:-1)
 50: org/apache/harmony/test/reliability/vm/stack/Method2Class.Test2()V (??:-1)
 51: org/apache/harmony/test/reliability/vm/stack/StackUnwindTest.intersectMethodCall()V (??:-1)
 52: org/apache/harmony/test/reliability/vm/stack/Method3Class.TestHotInline()V (??:-1)
 53: org/apache/harmony/test/reliability/vm/stack/StackUnwindTest.intersectMethodCall()V (??:-1)
 54: org/apache/harmony/test/reliability/vm/stack/Method2Class.TestHotInline()V (??:-1)
 55: org/apache/harmony/test/reliability/vm/stack/StackUnwindTest.intersectMethodCall()V (??:-1)
 56: org/apache/harmony/test/reliability/vm/stack/Method3Class.Test3()V (??:-1)
 57: org/apache/harmony/test/reliability/vm/stack/Method3Class.Test2()V (??:-1)
 58: org/apache/harmony/test/reliability/vm/stack/StackUnwindTest.intersectMethodCall()V (??:-1)
 59: org/apache/harmony/test/reliability/vm/stack/Method1Class.Test2()V (??:-1)
 60: org/apache/harmony/test/reliability/vm/stack/StackUnwindTest.intersectMethodCall()V (??:-1)
 61: org/apache/harmony/test/reliability/vm/stack/Method2Class.TestHotInline()V (??:-1)
 62: org/apache/harmony/test/reliability/vm/stack/StackUnwindTest.intersectMethodCall()V (??:-1)
 63: org/apache/harmony/test/reliability/vm/stack/Method3Class.Test3()V (??:-1)
 64: org/apache/harmony/test/reliability/vm/stack/StackUnwindTest.intersectMethodCall()V (??:-1)
 65: org/apache/harmony/test/reliability/vm/stack/Method3Class.TestHotInline()V (??:-1)
 66: org/apache/harmony/test/reliability/vm/stack/StackUnwindTest.intersectMethodCall()V (??:-1)
 67: org/apache/harmony/test/reliability/vm/stack/Method1Class.TestHotInline()V (??:-1)
 68: org/apache/harmony/test/reliability/vm/stack/StackUnwindTest.intersectMethodCall()V (??:-1)
 69: org/apache/harmony/test/reliability/vm/stack/Method2Class.TestHotInline()V (??:-1)
 70: org/apache/harmony/test/reliability/vm/stack/StackUnwindTest.intersectMethodCall()V (??:-1)
 71: org/apache/harmony/test/reliability/vm/stack/Method3Class.Test3()V (??:-1)
 72: org/apache/harmony/test/reliability/vm/stack/Method3Class.Test2()V (??:-1)
 73: org/apache/harmony/test/reliability/vm/stack/Method3Class.Test1()V (??:-1)
 74: org/apache/harmony/test/reliability/vm/stack/StackUnwindTest.intersectMethodCall()V (??:-1)
 75: org/apache/harmony/test/reliability/vm/stack/Method1Class.Test1()V (??:-1)
 76: org/apache/harmony/test/reliability/vm/stack/StackUnwindTest.intersectMethodCall()V (??:-1)
 77: org/apache/harmony/test/reliability/vm/stack/Method3Class.Test3()V (??:-1)
 78: org/apache/harmony/test/reliability/vm/stack/StackUnwindTest.intersectMethodCall()V (??:-1)
 79: org/apache/harmony/test/reliability/vm/stack/Method2Class.TestHotInline()V (??:-1)
 80: org/apache/harmony/test/reliability/vm/stack/StackUnwindTest.intersectMethodCall()V (??:-1)
 81: org/apache/harmony/test/reliability/vm/stack/Method3Class.TestHotInline()V (??:-1)
 82: org/apache/harmony/test/reliability/vm/stack/StackUnwindTest.intersectMethodCall()V (??:-1)
 83: org/apache/harmony/test/reliability/vm/stack/Method1Class.TestHotInline()V (??:-1)
 84: org/apache/harmony/test/reliability/vm/stack/StackUnwindTest.intersectMethodCall()V (??:-1)
 85: org/apache/harmony/test/reliability/vm/stack/Method1Class.Test1()V (??:-1)
 86: org/apache/harmony/test/reliability/vm/stack/StackUnwindTest.intersectMethodCall()V (??:-1)
 87: org/apache/harmony/test/reliability/vm/stack/Method1Class.Test2()V (??:-1)
 88: org/apache/harmony/test/reliability/vm/stack/StackUnwindTest.intersectMethodCall()V (??:-1)
 89: org/apache/harmony/test/reliability/vm/stack/Method2Class.TestHotInline()V (??:-1)
 90: org/apache/harmony/test/reliability/vm/stack/StackUnwindTest.intersectMethodCall()V (??:-1)
 91: org/apache/harmony/test/reliability/vm/stack/Method3Class.Test3()V (??:-1)
 92: org/apache/harmony/test/reliability/vm/stack/StackUnwindTest.intersectMethodCall()V (??:-1)
 93: org/apache/harmony/test/reliability/vm/stack/Method1Class.Test1()V (??:-1)
 94: org/apache/harmony/test/reliability/vm/stack/StackUnwindTest.intersectMethodCall()V (??:-1)
 95: org/apache/harmony/test/reliability/vm/stack/Method2Class.Test1()V (??:-1)
 96: org/apache/harmony/test/reliability/vm/stack/StackUnwindTest.intersectMethodCall()V (??:-1)
 97: org/apache/harmony/test/reliability/vm/stack/Method3Class.Test3()V (??:-1)
 98: org/apache/harmony/test/reliability/vm/stack/StackUnwindTest.intersectMethodCall()V (??:-1)
 99: org/apache/harmony/test/reliability/vm/stack/Method1Class.Test1()V (??:-1)
100: org/apache/harmony/test/reliability/vm/stack/StackUnwindTest.intersectMethodCall()V (??:-1)
101: org/apache/harmony/test/reliability/vm/stack/Method3Class.TestHotInline()V (??:-1)
102: org/apache/harmony/test/reliability/vm/stack/StackUnwindTest.intersectMethodCall()V (??:-1)
103: org/apache/harmony/test/reliability/vm/stack/Method1Class.Test3()V (??:-1)
104: org/apache/harmony/test/reliability/vm/stack/StackUnwindTest.intersectMethodCall()V (??:-1)
105: org/apache/harmony/test/reliability/vm/stack/Method3Class.TestHotInline()V (??:-1)
106: org/apache/harmony/test/reliability/vm/stack/StackUnwindTest.intersectMethodCall()V (??:-1)
107: org/apache/harmony/test/reliability/vm/stack/Method2Class.Test2()V (??:-1)
108: org/apache/harmony/test/reliability/vm/stack/StackUnwindTest.intersectMethodCall()V (??:-1)
109: org/apache/harmony/test/reliability/vm/stack/Method2Class.TestHotInline()V (??:-1)
110: org/apache/harmony/test/reliability/vm/stack/StackUnwindTest.intersectMethodCall()V (??:-1)
111: org/apache/harmony/test/reliability/vm/stack/Method3Class.Test3()V (??:-1)
112: org/apache/harmony/test/reliability/vm/stack/StackUnwindTest.intersectMethodCall()V (??:-1)
113: org/apache/harmony/test/reliability/vm/stack/Method3Class.Test3()V (??:-1)
114: org/apache/harmony/test/reliability/vm/stack/Method3Class.Test2()V (??:-1)
115: org/apache/harmony/test/reliability/vm/stack/Method3Class.Test1()V (??:-1)
116: org/apache/harmony/test/reliability/vm/stack/StackUnwindTest.intersectMethodCall()V (??:-1)
117: org/apache/harmony/test/reliability/vm/stack/Method3Class.TestHotInline()V (??:-1)
118: org/apache/harmony/test/reliability/vm/stack/StackUnwindTest.intersectMethodCall()V (??:-1)
119: org/apache/harmony/test/reliability/vm/stack/Method3Class.Test3()V (??:-1)
120: org/apache/harmony/test/reliability/vm/stack/Method3Class.Test2()V (??:-1)
121: org/apache/harmony/test/reliability/vm/stack/Method3Class.Test1()V (??:-1)
122: org/apache/harmony/test/reliability/vm/stack/StackUnwindTest.intersectMethodCall()V (??:-1)
123: org/apache/harmony/test/reliability/vm/stack/Method3Class.Test3()V (??:-1)
124: org/apache/harmony/test/reliability/vm/stack/Method3Class.Test2()V (??:-1)
125: org/apache/harmony/test/reliability/vm/stack/Method3Class.Test1()V (??:-1)
126: org/apache/harmony/test/reliability/vm/stack/StackUnwindTest.intersectMethodCall()V (??:-1)
127: org/apache/harmony/test/reliability/vm/stack/Method2Class.Test2()V (??:-1)
128: org/apache/harmony/test/reliability/vm/stack/StackUnwindTest.intersectMethodCall()V (??:-1)
129: org/apache/harmony/test/reliability/vm/stack/Method1Class.Test2()V (??:-1)
130: org/apache/harmony/test/reliability/vm/stack/StackUnwindTest.intersectMethodCall()V (??:-1)
131: org/apache/harmony/test/reliability/vm/stack/Method3Class.Test3()V (??:-1)
132: org/apache/harmony/test/reliability/vm/stack/Method3Class.Test2()V (??:-1)
133: org/apache/harmony/test/reliability/vm/stack/StackUnwindTest.intersectMethodCall()V (??:-1)
134: org/apache/harmony/test/reliability/vm/stack/Method2Class.Test3()V (??:-1)
135: org/apache/harmony/test/reliability/vm/stack/StackUnwindTest.intersectMethodCall()V (??:-1)
136: org/apache/harmony/test/reliability/vm/stack/Method1Class.TestHotInline()V (??:-1)
137: org/apache/harmony/test/reliability/vm/stack/StackUnwindTest.intersectMethodCall()V (??:-1)
138: org/apache/harmony/test/reliability/vm/stack/Method3Class.Test3()V (??:-1)
139: org/apache/harmony/test/reliability/vm/stack/Method3Class.Test2()V (??:-1)
140: org/apache/harmony/test/reliability/vm/stack/Method3Class.Test1()V (??:-1)
141: org/apache/harmony/test/reliability/vm/stack/StackUnwindTest.intersectMethodCall()V (??:-1)
142: org/apache/harmony/test/reliability/vm/stack/Method3Class.Test3()V (??:-1)
143: org/apache/harmony/test/reliability/vm/stack/Method3Class.Test2()V (??:-1)
144: org/apache/harmony/test/reliability/vm/stack/StackUnwindTest.intersectMethodCall()V (??:-1)
145: org/apache/harmony/test/reliability/vm/stack/Method3Class.TestHotInline()V (??:-1)
146: org/apache/harmony/test/reliability/vm/stack/StackUnwindTest.intersectMethodCall()V (??:-1)
147: org/apache/harmony/test/reliability/vm/stack/Method1Class.Test2()V (??:-1)
148: org/apache/harmony/test/reliability/vm/stack/StackUnwindTest.intersectMethodCall()V (??:-1)
149: org/apache/harmony/test/reliability/vm/stack/Method3Class.Test3()V (??:-1)
150: org/apache/harmony/test/reliability/vm/stack/StackUnwindTest.intersectMethodCall()V (??:-1)
151: org/apache/harmony/test/reliability/vm/stack/Method3Class.TestHotInline()V (??:-1)
152: org/apache/harmony/test/reliability/vm/stack/StackUnwindTest.intersectMethodCall()V (??:-1)
153: org/apache/harmony/test/reliability/vm/stack/Method2Class.TestHotInline()V (??:-1)
154: org/apache/harmony/test/reliability/vm/stack/StackUnwindTest.intersectMethodCall()V (??:-1)
155: org/apache/harmony/test/reliability/vm/stack/Method1Class.Test1()V (??:-1)
156: org/apache/harmony/test/reliability/vm/stack/StackUnwindTest.intersectMethodCall()V (??:-1)
157: org/apache/harmony/test/reliability/vm/stack/Method3Class.Test3()V (??:-1)
158: org/apache/harmony/test/reliability/vm/stack/Method3Class.Test2()V (??:-1)
159: org/apache/harmony/test/reliability/vm/stack/StackUnwindTest.intersectMethodCall()V (??:-1)
160: org/apache/harmony/test/reliability/vm/stack/Method3Class.Test3()V (??:-1)
161: org/apache/harmony/test/reliability/vm/stack/StackUnwindTest.intersectMethodCall()V (??:-1)
162: org/apache/harmony/test/reliability/vm/stack/Method2Class.Test3()V (??:-1)
163: org/apache/harmony/test/reliability/vm/stack/StackUnwindTest.intersectMethodCall()V (??:-1)
164: org/apache/harmony/test/reliability/vm/stack/Method2Class.Test3()V (??:-1)
165: org/apache/harmony/test/reliability/vm/stack/StackUnwindTest.intersectMethodCall()V (??:-1)
166: org/apache/harmony/test/reliability/vm/stack/Method1Class.Test2()V (??:-1)
167: org/apache/harmony/test/reliability/vm/stack/StackUnwindTest.intersectMethodCall()V (??:-1)
168: org/apache/harmony/test/reliability/vm/stack/Method1Class.Test3()V (??:-1)
169: org/apache/harmony/test/reliability/vm/stack/StackUnwindTest.intersectMethodCall()V (??:-1)
170: org/apache/harmony/test/reliability/vm/stack/Method3Class.TestHotInline()V (??:-1)
171: org/apache/harmony/test/reliability/vm/stack/StackUnwindTest.intersectMethodCall()V (??:-1)
172: org/apache/harmony/test/reliability/vm/stack/Method2Class.Test2()V (??:-1)
173: org/apache/harmony/test/reliability/vm/stack/StackUnwindTest.intersectMethodCall()V (??:-1)
174: org/apache/harmony/test/reliability/vm/stack/Method1Class.Test3()V (??:-1)
175: org/apache/harmony/test/reliability/vm/stack/StackUnwindTest.intersectMethodCall()V (??:-1)
176: org/apache/harmony/test/reliability/vm/stack/Method1Class.Test1()V (??:-1)
177: org/apache/harmony/test/reliability/vm/stack/StackUnwindTest.intersectMethodCall()V (??:-1)
178: org/apache/harmony/test/reliability/vm/stack/Method3Class.TestHotInline()V (??:-1)
179: org/apache/harmony/test/reliability/vm/stack/StackUnwindTest.intersectMethodCall()V (??:-1)
180: org/apache/harmony/test/reliability/vm/stack/Method3Class.Test3()V (??:-1)
181: org/apache/harmony/test/reliability/vm/stack/Method3Class.Test2()V (??:-1)
182: org/apache/harmony/test/reliability/vm/stack/Method3Class.Test1()V (??:-1)
183: org/apache/harmony/test/reliability/vm/stack/StackUnwindTest.intersectMethodCall()V (??:-1)
184: org/apache/harmony/test/reliability/vm/stack/Method2Class.Test1()V (??:-1)
185: org/apache/harmony/test/reliability/vm/stack/StackUnwindTest.intersectMethodCall()V (??:-1)
186: org/apache/harmony/test/reliability/vm/stack/Method1Class.Test2()V (??:-1)
187: org/apache/harmony/test/reliability/vm/stack/StackUnwindTest.intersectMethodCall()V (??:-1)
188: org/apache/harmony/test/reliability/vm/stack/Method2Class.Test1()V (??:-1)
189: org/apache/harmony/test/reliability/vm/stack/StackUnwindTest.intersectMethodCall()V (??:-1)
190: org/apache/harmony/test/reliability/vm/stack/Method1Class.Test2()V (??:-1)
191: org/apache/harmony/test/reliability/vm/stack/StackUnwindTest.intersectMethodCall()V (??:-1)
192: org/apache/harmony/test/reliability/vm/stack/Method3Class.TestHotInline()V (??:-1)
193: org/apache/harmony/test/reliability/vm/stack/StackUnwindTest.intersectMethodCall()V (??:-1)
194: org/apache/harmony/test/reliability/vm/stack/Method2Class.Test3()V (??:-1)
195: org/apache/harmony/test/reliability/vm/stack/StackUnwindTest.intersectMethodCall()V (??:-1)
196: org/apache/harmony/test/reliability/vm/stack/Method1Class.TestHotInline()V (??:-1)
197: org/apache/harmony/test/reliability/vm/stack/StackUnwindTest.intersectMethodCall()V (??:-1)
198: org/apache/harmony/test/reliability/vm/stack/Method3Class.Test3()V (??:-1)
199: org/apache/harmony/test/reliability/vm/stack/StackUnwindTest.intersectMethodCall()V (??:-1)
200: org/apache/harmony/test/reliability/vm/stack/Method3Class.Test3()V (??:-1)
201: org/apache/harmony/test/reliability/vm/stack/StackUnwindTest.intersectMethodCall()V (??:-1)
202: org/apache/harmony/test/reliability/vm/stack/Method3Class.Test3()V (??:-1)
203: org/apache/harmony/test/reliability/vm/stack/Method3Class.Test2()V (??:-1)
204: org/apache/harmony/test/reliability/vm/stack/StackUnwindTest.intersectMethodCall()V (??:-1)
205: org/apache/harmony/test/reliability/vm/stack/Method3Class.TestHotInline()V (??:-1)
206: org/apache/harmony/test/reliability/vm/stack/StackUnwindTest.intersectMethodCall()V (??:-1)
207: org/apache/harmony/test/reliability/vm/stack/Method2Class.TestHotInline()V (??:-1)
208: org/apache/harmony/test/reliability/vm/stack/StackUnwindTest.intersectMethodCall()V (??:-1)
209: org/apache/harmony/test/reliability/vm/stack/Method1Class.Test1()V (??:-1)
210: org/apache/harmony/test/reliability/vm/stack/StackUnwindTest.intersectMethodCall()V (??:-1)
211: org/apache/harmony/test/reliability/vm/stack/Method1Class.Test3()V (??:-1)
212: org/apache/harmony/test/reliability/vm/stack/StackUnwindTest.intersectMethodCall()V (??:-1)
213: org/apache/harmony/test/reliability/vm/stack/Method3Class.Test3()V (??:-1)
214: org/apache/harmony/test/reliability/vm/stack/Method3Class.Test2()V (??:-1)
215: org/apache/harmony/test/reliability/vm/stack/StackUnwindTest.intersectMethodCall()V (??:-1)
216: org/apache/harmony/test/reliability/vm/stack/Method2Class.Test2()V (??:-1)
217: org/apache/harmony/test/reliability/vm/stack/StackUnwindTest.intersectMethodCall()V (??:-1)
218: org/apache/harmony/test/reliability/vm/stack/Method3Class.Test3()V (??:-1)
219: org/apache/harmony/test/reliability/vm/stack/Method3Class.Test2()V (??:-1)
220: org/apache/harmony/test/reliability/vm/stack/Method3Class.Test1()V (??:-1)
221: org/apache/harmony/test/reliability/vm/stack/StackUnwindTest.intersectMethodCall()V (??:-1)
222: org/apache/harmony/test/reliability/vm/stack/Method2Class.Test2()V (??:-1)
223: org/apache/harmony/test/reliability/vm/stack/StackUnwindTest.intersectMethodCall()V (??:-1)
224: org/apache/harmony/test/reliability/vm/stack/Method2Class.Test3()V (??:-1)
225: org/apache/harmony/test/reliability/vm/stack/StackUnwindTest.intersectMethodCall()V (??:-1)
226: org/apache/harmony/test/reliability/vm/stack/Method1Class.Test3()V (??:-1)
227: org/apache/harmony/test/reliability/vm/stack/StackUnwindTest.intersectMethodCall()V (??:-1)
228: org/apache/harmony/test/reliability/vm/stack/Method3Class.Test3()V (??:-1)
229: org/apache/harmony/test/reliability/vm/stack/Method3Class.Test2()V (??:-1)
230: org/apache/harmony/test/reliability/vm/stack/StackUnwindTest.intersectMethodCall()V (??:-1)
231: org/apache/harmony/test/reliability/vm/stack/Method2Class.Test2()V (??:-1)
232: org/apache/harmony/test/reliability/vm/stack/StackUnwindTest.intersectMethodCall()V (??:-1)
233: org/apache/harmony/test/reliability/vm/stack/Method3Class.TestHotInline()V (??:-1)
234: org/apache/harmony/test/reliability/vm/stack/StackUnwindTest.intersectMethodCall()V (??:-1)
235: org/apache/harmony/test/reliability/vm/stack/Method2Class.Test1()V (??:-1)
236: org/apache/harmony/test/reliability/vm/stack/StackUnwindTest.intersectMethodCall()V (??:-1)
237: org/apache/harmony/test/reliability/vm/stack/Method3Class.TestHotInline()V (??:-1)
238: org/apache/harmony/test/reliability/vm/stack/StackUnwindTest.intersectMethodCall()V (??:-1)
239: org/apache/harmony/test/reliability/vm/stack/Method2Class.TestHotInline()V (??:-1)
240: org/apache/harmony/test/reliability/vm/stack/StackUnwindTest.intersectMethodCall()V (??:-1)
241: org/apache/harmony/test/reliability/vm/stack/Method2Class.TestHotInline()V (??:-1)
242: org/apache/harmony/test/reliability/vm/stack/StackUnwindTest.intersectMethodCall()V (??:-1)
243: org/apache/harmony/test/reliability/vm/stack/Method3Class.Test3()V (??:-1)
244: org/apache/harmony/test/reliability/vm/stack/Method3Class.Test2()V (??:-1)
245: org/apache/harmony/test/reliability/vm/stack/Method3Class.Test1()V (??:-1)
246: org/apache/harmony/test/reliability/vm/stack/StackUnwindTest.intersectMethodCall()V (??:-1)
247: org/apache/harmony/test/reliability/vm/stack/Method3Class.TestHotInline()V (??:-1)
248: org/apache/harmony/test/reliability/vm/stack/StackUnwindTest.intersectMethodCall()V (??:-1)
249: org/apache/harmony/test/reliability/vm/stack/Method2Class.Test3()V (??:-1)
250: org/apache/harmony/test/reliability/vm/stack/StackUnwindTest.intersectMethodCall()V (??:-1)
251: org/apache/harmony/test/reliability/vm/stack/Method1Class.Test3()V (??:-1)
252: org/apache/harmony/test/reliability/vm/stack/StackUnwindTest.intersectMethodCall()V (??:-1)
253: org/apache/harmony/test/reliability/vm/stack/Method3Class.TestHotInline()V (??:-1)
254: org/apache/harmony/test/reliability/vm/stack/StackUnwindTest.intersectMethodCall()V (??:-1)
255: org/apache/harmony/test/reliability/vm/stack/Method2Class.Test1()V (??:-1)
256: org/apache/harmony/test/reliability/vm/stack/StackUnwindTest.intersectMethodCall()V (??:-1)
257: org/apache/harmony/test/reliability/vm/stack/Method2Class.Test2()V (??:-1)
258: org/apache/harmony/test/reliability/vm/stack/StackUnwindTest.intersectMethodCall()V (??:-1)
259: org/apache/harmony/test/reliability/vm/stack/Method1Class.Test3()V (??:-1)
260: org/apache/harmony/test/reliability/vm/stack/StackUnwindTest.intersectMethodCall()V (??:-1)
261: org/apache/harmony/test/reliability/vm/stack/Method2Class.Test3()V (??:-1)
262: org/apache/harmony/test/reliability/vm/stack/StackUnwindTest.intersectMethodCall()V (??:-1)
263: org/apache/harmony/test/reliability/vm/stack/Method3Class.Test3()V (??:-1)
264: org/apache/harmony/test/reliability/vm/stack/StackUnwindTest.intersectMethodCall()V (??:-1)
265: org/apache/harmony/test/reliability/vm/stack/Method1Class.Test3()V (??:-1)
266: org/apache/harmony/test/reliability/vm/stack/StackUnwindTest.intersectMethodCall()V (??:-1)
267: org/apache/harmony/test/reliability/vm/stack/Method2Class.TestHotInline()V (??:-1)
268: org/apache/harmony/test/reliability/vm/stack/StackUnwindTest.intersectMethodCall()V (??:-1)
269: org/apache/harmony/test/reliability/vm/stack/Method1Class.Test3()V (??:-1)
270: org/apache/harmony/test/reliability/vm/stack/StackUnwindTest.intersectMethodCall()V (??:-1)
271: org/apache/harmony/test/reliability/vm/stack/Method2Class.Test2()V (??:-1)
272: org/apache/harmony/test/reliability/vm/stack/StackUnwindTest.intersectMethodCall()V (??:-1)
273: org/apache/harmony/test/reliability/vm/stack/Method2Class.Test1()V (??:-1)
274: org/apache/harmony/test/reliability/vm/stack/StackUnwindTest.intersectMethodCall()V (??:-1)
275: org/apache/harmony/test/reliability/vm/stack/Method1Class.TestHotInline()V (??:-1)
276: org/apache/harmony/test/reliability/vm/stack/StackUnwindTest.intersectMethodCall()V (??:-1)
277: org/apache/harmony/test/reliability/vm/stack/Method1Class.TestHotInline()V (??:-1)
278: org/apache/harmony/test/reliability/vm/stack/StackUnwindTest.intersectMethodCall()V (??:-1)
279: org/apache/harmony/test/reliability/vm/stack/Method1Class.Test2()V (??:-1)
280: org/apache/harmony/test/reliability/vm/stack/StackUnwindTest.intersectMethodCall()V (??:-1)
281: org/apache/harmony/test/reliability/vm/stack/Method2Class.Test1()V (??:-1)
282: org/apache/harmony/test/reliability/vm/stack/StackUnwindTest.intersectMethodCall()V (??:-1)
283: org/apache/harmony/test/reliability/vm/stack/Method2Class.Test2()V (??:-1)
284: org/apache/harmony/test/reliability/vm/stack/StackUnwindTest.intersectMethodCall()V (??:-1)
285: org/apache/harmony/test/reliability/vm/stack/Method1Class.Test2()V (??:-1)
286: org/apache/harmony/test/reliability/vm/stack/StackUnwindTest.intersectMethodCall()V (??:-1)
287: org/apache/harmony/test/reliability/vm/stack/Method2Class.Test1()V (??:-1)
288: org/apache/harmony/test/reliability/vm/stack/StackUnwindTest.intersectMethodCall()V (??:-1)
289: org/apache/harmony/test/reliability/vm/stack/Method2Class.Test2()V (??:-1)
290: org/apache/harmony/test/reliability/vm/stack/StackUnwindTest.intersectMethodCall()V (??:-1)
291: org/apache/harmony/test/reliability/vm/stack/Method1Class.Test1()V (??:-1)
292: org/apache/harmony/test/reliability/vm/stack/StackUnwindTest.intersectMethodCall()V (??:-1)
293: org/apache/harmony/test/reliability/vm/stack/Method2Class.Test3()V (??:-1)
294: org/apache/harmony/test/reliability/vm/stack/StackUnwindTest.intersectMethodCall()V (??:-1)
295: org/apache/harmony/test/reliability/vm/stack/Method1Class.TestHotInline()V (??:-1)
296: org/apache/harmony/test/reliability/vm/stack/StackUnwindTest.intersectMethodCall()V (??:-1)
297: org/apache/harmony/test/reliability/vm/stack/Method2Class.Test2()V (??:-1)
298: org/apache/harmony/test/reliability/vm/stack/StackUnwindTest.intersectMethodCall()V (??:-1)
299: org/apache/harmony/test/reliability/vm/stack/Method1Class.Test3()V (??:-1)
300: org/apache/harmony/test/reliability/vm/stack/StackUnwindTest.intersectMethodCall()V (??:-1)
301: org/apache/harmony/test/reliability/vm/stack/Method1Class.Test1()V (??:-1)
302: org/apache/harmony/test/reliability/vm/stack/StackUnwindTest.intersectMethodCall()V (??:-1)
303: org/apache/harmony/test/reliability/vm/stack/Method3Class.Test3()V (??:-1)
304: org/apache/harmony/test/reliability/vm/stack/Method3Class.Test2()V (??:-1)
305: org/apache/harmony/test/reliability/vm/stack/StackUnwindTest.intersectMethodCall()V (??:-1)
306: org/apache/harmony/test/reliability/vm/stack/Method3Class.TestHotInline()V (??:-1)
307: org/apache/harmony/test/reliability/vm/stack/StackUnwindTest.intersectMethodCall()V (??:-1)
308: org/apache/harmony/test/reliability/vm/stack/Method2Class.Test3()V (??:-1)
309: org/apache/harmony/test/reliability/vm/stack/StackUnwindTest.intersectMethodCall()V (??:-1)
310: org/apache/harmony/test/reliability/vm/stack/Method3Class.Test3()V (??:-1)
311: org/apache/harmony/test/reliability/vm/stack/Method3Class.Test2()V (??:-1)
312: org/apache/harmony/test/reliability/vm/stack/StackUnwindTest.intersectMethodCall()V (??:-1)
313: org/apache/harmony/test/reliability/vm/stack/Method3Class.Test3()V (??:-1)
314: org/apache/harmony/test/reliability/vm/stack/Method3Class.Test2()V (??:-1)
315: org/apache/harmony/test/reliability/vm/stack/StackUnwindTest.intersectMethodCall()V (??:-1)
316: org/apache/harmony/test/reliability/vm/stack/Method3Class.Test3()V (??:-1)
317: org/apache/harmony/test/reliability/vm/stack/StackUnwindTest.intersectMethodCall()V (??:-1)
318: org/apache/harmony/test/reliability/vm/stack/Method2Class.TestHotInline()V (??:-1)
319: org/apache/harmony/test/reliability/vm/stack/StackUnwindTest.intersectMethodCall()V (??:-1)
320: org/apache/harmony/test/reliability/vm/stack/Method2Class.Test2()V (??:-1)
321: org/apache/harmony/test/reliability/vm/stack/StackUnwindTest.intersectMethodCall()V (??:-1)
322: org/apache/harmony/test/reliability/vm/stack/Method3Class.Test3()V (??:-1)
323: org/apache/harmony/test/reliability/vm/stack/Method3Class.Test2()V (??:-1)
324: org/apache/harmony/test/reliability/vm/stack/Method3Class.Test1()V (??:-1)
325: org/apache/harmony/test/reliability/vm/stack/StackUnwindTest.intersectMethodCall()V (??:-1)
326: org/apache/harmony/test/reliability/vm/stack/Method2Class.Test2()V (??:-1)
327: org/apache/harmony/test/reliability/vm/stack/StackUnwindTest.intersectMethodCall()V (??:-1)
328: org/apache/harmony/test/reliability/vm/stack/Method2Class.Test3()V (??:-1)
329: org/apache/harmony/test/reliability/vm/stack/StackUnwindTest.intersectMethodCall()V (??:-1)
330: org/apache/harmony/test/reliability/vm/stack/Method1Class.TestHotInline()V (??:-1)
331: org/apache/harmony/test/reliability/vm/stack/StackUnwindTest.intersectMethodCall()V (??:-1)
332: org/apache/harmony/test/reliability/vm/stack/Method3Class.Test3()V (??:-1)
333: org/apache/harmony/test/reliability/vm/stack/Method3Class.Test2()V (??:-1)
334: org/apache/harmony/test/reliability/vm/stack/StackUnwindTest.intersectMethodCall()V (??:-1)
335: org/apache/harmony/test/reliability/vm/stack/Method3Class.TestHotInline()V (??:-1)
336: org/apache/harmony/test/reliability/vm/stack/StackUnwindTest.intersectMethodCall()V (??:-1)
337: org/apache/harmony/test/reliability/vm/stack/Method2Class.Test3()V (??:-1)
338: org/apache/harmony/test/reliability/vm/stack/StackUnwindTest.intersectMethodCall()V (??:-1)
339: org/apache/harmony/test/reliability/vm/stack/Method3Class.Test3()V (??:-1)
340: org/apache/harmony/test/reliability/vm/stack/Method3Class.Test2()V (??:-1)
341: org/apache/harmony/test/reliability/vm/stack/StackUnwindTest.intersectMethodCall()V (??:-1)
342: org/apache/harmony/test/reliability/vm/stack/Method3Class.Test3()V (??:-1)
343: org/apache/harmony/test/reliability/vm/stack/Method3Class.Test2()V (??:-1)
344: org/apache/harmony/test/reliability/vm/stack/Method3Class.Test1()V (??:-1)
345: org/apache/harmony/test/reliability/vm/stack/StackUnwindTest.intersectMethodCall()V (??:-1)
346: org/apache/harmony/test/reliability/vm/stack/Method2Class.Test2()V (??:-1)
347: org/apache/harmony/test/reliability/vm/stack/StackUnwindTest.intersectMethodCall()V (??:-1)
348: org/apache/harmony/test/reliability/vm/stack/Method2Class.Test3()V (??:-1)
349: org/apache/harmony/test/reliability/vm/stack/StackUnwindTest.intersectMethodCall()V (??:-1)
350: org/apache/harmony/test/reliability/vm/stack/Method3Class.Test3()V (??:-1)
351: org/apache/harmony/test/reliability/vm/stack/StackUnwindTest.intersectMethodCall()V (??:-1)
352: org/apache/harmony/test/reliability/vm/stack/Method2Class.Test1()V (??:-1)
353: org/apache/harmony/test/reliability/vm/stack/StackUnwindTest.intersectMethodCall()V (??:-1)
354: org/apache/harmony/test/reliability/vm/stack/Method3Class.TestHotInline()V (??:-1)
355: org/apache/harmony/test/reliability/vm/stack/StackUnwindTest.intersectMethodCall()V (??:-1)
356: org/apache/harmony/test/reliability/vm/stack/Method1Class.Test2()V (??:-1)
357: org/apache/harmony/test/reliability/vm/stack/StackUnwindTest.intersectMethodCall()V (??:-1)
358: org/apache/harmony/test/reliability/vm/stack/Method2Class.Test2()V (??:-1)
359: org/apache/harmony/test/reliability/vm/stack/StackUnwindTest.intersectMethodCall()V (??:-1)
360: org/apache/harmony/test/reliability/vm/stack/Method2Class.Test2()V (??:-1)
361: org/apache/harmony/test/reliability/vm/stack/StackUnwindTest.intersectMethodCall()V (??:-1)
362: org/apache/harmony/test/reliability/vm/stack/Method2Class.Test3()V (??:-1)
363: org/apache/harmony/test/reliability/vm/stack/StackUnwindTest.intersectMethodCall()V (??:-1)
364: org/apache/harmony/test/reliability/vm/stack/Method1Class.Test3()V (??:-1)
365: org/apache/harmony/test/reliability/vm/stack/StackUnwindTest.intersectMethodCall()V (??:-1)
366: org/apache/harmony/test/reliability/vm/stack/Method3Class.Test3()V (??:-1)
367: org/apache/harmony/test/reliability/vm/stack/Method3Class.Test2()V (??:-1)
368: org/apache/harmony/test/reliability/vm/stack/Method3Class.Test1()V (??:-1)
369: org/apache/harmony/test/reliability/vm/stack/StackUnwindTest.intersectMethodCall()V (??:-1)
370: org/apache/harmony/test/reliability/vm/stack/Method1Class.Test1()V (??:-1)
371: org/apache/harmony/test/reliability/vm/stack/StackUnwindTest.intersectMethodCall()V (??:-1)
372: org/apache/harmony/test/reliability/vm/stack/Method1Class.Test1()V (??:-1)
373: org/apache/harmony/test/reliability/vm/stack/StackUnwindTest.intersectMethodCall()V (??:-1)
374: org/apache/harmony/test/reliability/vm/stack/Method2Class.Test3()V (??:-1)
375: org/apache/harmony/test/reliability/vm/stack/StackUnwindTest.intersectMethodCall()V (??:-1)
376: org/apache/harmony/test/reliability/vm/stack/Method1Class.Test1()V (??:-1)
377: org/apache/harmony/test/reliability/vm/stack/StackUnwindTest.intersectMethodCall()V (??:-1)
378: org/apache/harmony/test/reliability/vm/stack/Method3Class.TestHotInline()V (??:-1)
379: org/apache/harmony/test/reliability/vm/stack/StackUnwindTest.intersectMethodCall()V (??:-1)
380: org/apache/harmony/test/reliability/vm/stack/Method1Class.TestHotInline()V (??:-1)
381: org/apache/harmony/test/reliability/vm/stack/StackUnwindTest.intersectMethodCall()V (??:-1)
382: org/apache/harmony/test/reliability/vm/stack/Method2Class.Test3()V (??:-1)
383: org/apache/harmony/test/reliability/vm/stack/StackUnwindTest.intersectMethodCall()V (??:-1)
384: org/apache/harmony/test/reliability/vm/stack/Method2Class.Test2()V (??:-1)
385: org/apache/harmony/test/reliability/vm/stack/StackUnwindTest.intersectMethodCall()V (??:-1)
386: org/apache/harmony/test/reliability/vm/stack/Method2Class.Test3()V (??:-1)
387: org/apache/harmony/test/reliability/vm/stack/StackUnwindTest.intersectMethodCall()V (??:-1)
388: org/apache/harmony/test/reliability/vm/stack/Method2Class.Test2()V (??:-1)
389: org/apache/harmony/test/reliability/vm/stack/StackUnwindTest.intersectMethodCall()V (??:-1)
390: org/apache/harmony/test/reliability/vm/stack/Method2Class.Test2()V (??:-1)
391: org/apache/harmony/test/reliability/vm/stack/StackUnwindTest.intersectMethodCall()V (??:-1)
392: org/apache/harmony/test/reliability/vm/stack/Method1Class.Test2()V (??:-1)
393: org/apache/harmony/test/reliability/vm/stack/StackUnwindTest.intersectMethodCall()V (??:-1)
394: org/apache/harmony/test/reliability/vm/stack/Method1Class.Test1()V (??:-1)
395: org/apache/harmony/test/reliability/vm/stack/StackUnwindTest.intersectMethodCall()V (??:-1)
396: org/apache/harmony/test/reliability/vm/stack/Method2Class.Test3()V (??:-1)
397: org/apache/harmony/test/reliability/vm/stack/StackUnwindTest.intersectMethodCall()V (??:-1)
398: org/apache/harmony/test/reliability/vm/stack/Method3Class.Test3()V (??:-1)
399: org/apache/harmony/test/reliability/vm/stack/StackUnwindTest.intersectMethodCall()V (??:-1)
400: org/apache/harmony/test/reliability/vm/stack/Method1Class.TestHotInline()V (??:-1)
401: org/apache/harmony/test/reliability/vm/stack/StackUnwindTest.intersectMethodCall()V (??:-1)
402: org/apache/harmony/test/reliability/vm/stack/Method3Class.TestHotInline()V (??:-1)
403: org/apache/harmony/test/reliability/vm/stack/StackUnwindTest.intersectMethodCall()V (??:-1)
404: org/apache/harmony/test/reliability/vm/stack/Method2Class.Test1()V (??:-1)
405: org/apache/harmony/test/reliability/vm/stack/StackUnwindTest.intersectMethodCall()V (??:-1)
406: org/apache/harmony/test/reliability/vm/stack/Method2Class.Test1()V (??:-1)
407: org/apache/harmony/test/reliability/vm/stack/StackUnwindTest.intersectMethodCall()V (??:-1)
408: org/apache/harmony/test/reliability/vm/stack/Method2Class.TestHotInline()V (??:-1)
409: org/apache/harmony/test/reliability/vm/stack/StackUnwindTest.intersectMethodCall()V (??:-1)
410: org/apache/harmony/test/reliability/vm/stack/Method2Class.Test2()V (??:-1)
411: org/apache/harmony/test/reliability/vm/stack/StackUnwindTest.intersectMethodCall()V (??:-1)
412: org/apache/harmony/test/reliability/vm/stack/Method3Class.TestHotInline()V (??:-1)
413: org/apache/harmony/test/reliability/vm/stack/StackUnwindTest.intersectMethodCall()V (??:-1)
414: org/apache/harmony/test/reliability/vm/stack/Method3Class.TestHotInline()V (??:-1)
415: org/apache/harmony/test/reliability/vm/stack/StackUnwindTest.intersectMethodCall()V (??:-1)
416: org/apache/harmony/test/reliability/vm/stack/Method1Class.TestHotInline()V (??:-1)
417: org/apache/harmony/test/reliability/vm/stack/StackUnwindTest.intersectMethodCall()V (??:-1)
418: org/apache/harmony/test/reliability/vm/stack/Method1Class.Test1()V (??:-1)
419: org/apache/harmony/test/reliability/vm/stack/StackUnwindTest.intersectMethodCall()V (??:-1)
420: org/apache/harmony/test/reliability/vm/stack/Method3Class.Test3()V (??:-1)
421: org/apache/harmony/test/reliability/vm/stack/Method3Class.Test2()V (??:-1)
422: org/apache/harmony/test/reliability/vm/stack/Method3Class.Test1()V (??:-1)
423: org/apache/harmony/test/reliability/vm/stack/StackUnwindTest.intersectMethodCall()V (??:-1)
424: org/apache/harmony/test/reliability/vm/stack/Method3Class.Test3()V (??:-1)
425: org/apache/harmony/test/reliability/vm/stack/StackUnwindTest.intersectMethodCall()V (??:-1)
426: org/apache/harmony/test/reliability/vm/stack/Method3Class.Test3()V (??:-1)
427: org/apache/harmony/test/reliability/vm/stack/StackUnwindTest.intersectMethodCall()V (??:-1)
428: org/apache/harmony/test/reliability/vm/stack/Method2Class.Test1()V (??:-1)
429: org/apache/harmony/test/reliability/vm/stack/StackUnwindTest.intersectMethodCall()V (??:-1)
430: org/apache/harmony/test/reliability/vm/stack/Method1Class.TestHotInline()V (??:-1)
431: org/apache/harmony/test/reliability/vm/stack/StackUnwindTest.intersectMethodCall()V (??:-1)
432: org/apache/harmony/test/reliability/vm/stack/Method3Class.Test3()V (??:-1)
433: org/apache/harmony/test/reliability/vm/stack/Method3Class.Test2()V (??:-1)
434: org/apache/harmony/test/reliability/vm/stack/Method3Class.Test1()V (??:-1)
435: org/apache/harmony/test/reliability/vm/stack/StackUnwindTest.intersectMethodCall()V (??:-1)
436: org/apache/harmony/test/reliability/vm/stack/Method2Class.TestHotInline()V (??:-1)
437: org/apache/harmony/test/reliability/vm/stack/StackUnwindTest.intersectMethodCall()V (??:-1)
438: org/apache/harmony/test/reliability/vm/stack/Method2Class.Test2()V (??:-1)
439: org/apache/harmony/test/reliability/vm/stack/StackUnwindTest.intersectMethodCall()V (??:-1)
440: org/apache/harmony/test/reliability/vm/stack/Method3Class.Test3()V (??:-1)
441: org/apache/harmony/test/reliability/vm/stack/Method3Class.Test2()V (??:-1)
442: org/apache/harmony/test/reliability/vm/stack/StackUnwindTest.intersectMethodCall()V (??:-1)
443: org/apache/harmony/test/reliability/vm/stack/Method2Class.Test3()V (??:-1)
444: org/apache/harmony/test/reliability/vm/stack/StackUnwindTest.intersectMethodCall()V (??:-1)
445: org/apache/harmony/test/reliability/vm/stack/Method3Class.TestHotInline()V (??:-1)
446: org/apache/harmony/test/reliability/vm/stack/StackUnwindTest.intersectMethodCall()V (??:-1)
447: org/apache/harmony/test/reliability/vm/stack/Method2Class.Test1()V (??:-1)
448: org/apache/harmony/test/reliability/vm/stack/StackUnwindTest.intersectMethodCall()V (??:-1)
449: org/apache/harmony/test/reliability/vm/stack/Method2Class.TestHotInline()V (??:-1)
450: org/apache/harmony/test/reliability/vm/stack/StackUnwindTest.intersectMethodCall()V (??:-1)
451: org/apache/harmony/test/reliability/vm/stack/Method3Class.Test3()V (??:-1)
452: org/apache/harmony/test/reliability/vm/stack/StackUnwindTest.intersectMethodCall()V (??:-1)
453: org/apache/harmony/test/reliability/vm/stack/Method2Class.Test2()V (??:-1)
454: org/apache/harmony/test/reliability/vm/stack/StackUnwindTest.intersectMethodCall()V (??:-1)
455: org/apache/harmony/test/reliability/vm/stack/Method3Class.TestHotInline()V (??:-1)
456: org/apache/harmony/test/reliability/vm/stack/StackUnwindTest.intersectMethodCall()V (??:-1)
457: org/apache/harmony/test/reliability/vm/stack/Method2Class.Test2()V (??:-1)
458: org/apache/harmony/test/reliability/vm/stack/StackUnwindTest.intersectMethodCall()V (??:-1)
459: org/apache/harmony/test/reliability/vm/stack/Method2Class.Test2()V (??:-1)
460: org/apache/harmony/test/reliability/vm/stack/StackUnwindTest.intersectMethodCall()V (??:-1)
461: org/apache/harmony/test/reliability/vm/stack/Method1Class.Test1()V (??:-1)
462: org/apache/harmony/test/reliability/vm/stack/StackUnwindTest.intersectMethodCall()V (??:-1)
463: org/apache/harmony/test/reliability/vm/stack/Method3Class.Test3()V (??:-1)
464: org/apache/harmony/test/reliability/vm/stack/Method3Class.Test2()V (??:-1)
465: org/apache/harmony/test/reliability/vm/stack/StackUnwindTest.intersectMethodCall()V (??:-1)
466: org/apache/harmony/test/reliability/vm/stack/Method2Class.TestHotInline()V (??:-1)
467: org/apache/harmony/test/reliability/vm/stack/StackUnwindTest.intersectMethodCall()V (??:-1)
468: org/apache/harmony/test/reliability/vm/stack/Method1Class.Test3()V (??:-1)
469: org/apache/harmony/test/reliability/vm/stack/StackUnwindTest.intersectMethodCall()V (??:-1)
470: org/apache/harmony/test/reliability/vm/stack/Method2Class.Test3()V (??:-1)
471: org/apache/harmony/test/reliability/vm/stack/StackUnwindTest.intersectMethodCall()V (??:-1)
472: org/apache/harmony/test/reliability/vm/stack/Method3Class.TestHotInline()V (??:-1)
473: org/apache/harmony/test/reliability/vm/stack/StackUnwindTest.intersectMethodCall()V (??:-1)
474: org/apache/harmony/test/reliability/vm/stack/Method1Class.Test2()V (??:-1)
475: org/apache/harmony/test/reliability/vm/stack/StackUnwindTest.intersectMethodCall()V (??:-1)
476: org/apache/harmony/test/reliability/vm/stack/Method1Class.Test1()V (??:-1)
477: org/apache/harmony/test/reliability/vm/stack/StackUnwindTest.intersectMethodCall()V (??:-1)
478: org/apache/harmony/test/reliability/vm/stack/Method3Class.Test3()V (??:-1)
479: org/apache/harmony/test/reliability/vm/stack/StackUnwindTest.intersectMethodCall()V (??:-1)
480: org/apache/harmony/test/reliability/vm/stack/Method1Class.Test3()V (??:-1)
481: org/apache/harmony/test/reliability/vm/stack/StackUnwindTest.intersectMethodCall()V (??:-1)
482: org/apache/harmony/test/reliability/vm/stack/Method1Class.Test1()V (??:-1)
483: org/apache/harmony/test/reliability/vm/stack/StackUnwindTest.intersectMethodCall()V (??:-1)
484: org/apache/harmony/test/reliability/vm/stack/Method3Class.Test3()V (??:-1)
485: org/apache/harmony/test/reliability/vm/stack/Method3Class.Test2()V (??:-1)
486: org/apache/harmony/test/reliability/vm/stack/StackUnwindTest.intersectMethodCall()V (??:-1)
487: org/apache/harmony/test/reliability/vm/stack/Method1Class.Test1()V (??:-1)
488: org/apache/harmony/test/reliability/vm/stack/StackUnwindTest.intersectMethodCall()V (??:-1)
489: org/apache/harmony/test/reliability/vm/stack/Method1Class.Test1()V (??:-1)
490: org/apache/harmony/test/reliability/vm/stack/StackUnwindTest.intersectMethodCall()V (??:-1)
491: org/apache/harmony/test/reliability/vm/stack/Method2Class.Test3()V (??:-1)
492: org/apache/harmony/test/reliability/vm/stack/StackUnwindTest.intersectMethodCall()V (??:-1)
493: org/apache/harmony/test/reliability/vm/stack/Method2Class.Test2()V (??:-1)
494: org/apache/harmony/test/reliability/vm/stack/StackUnwindTest.intersectMethodCall()V (??:-1)
495: org/apache/harmony/test/reliability/vm/stack/Method3Class.Test3()V (??:-1)
496: org/apache/harmony/test/reliability/vm/stack/StackUnwindTest.intersectMethodCall()V (??:-1)
497: org/apache/harmony/test/reliability/vm/stack/Method2Class.Test1()V (??:-1)
498: org/apache/harmony/test/reliability/vm/stack/StackUnwindTest.intersectMethodCall()V (??:-1)
499: org/apache/harmony/test/reliability/vm/stack/Method1Class.Test2()V (??:-1)
500: org/apache/harmony/test/reliability/vm/stack/StackUnwindTest.intersectMethodCall()V (??:-1)
501: org/apache/harmony/test/reliability/vm/stack/Method3Class.Test3()V (??:-1)
502: org/apache/harmony/test/reliability/vm/stack/Method3Class.Test2()V (??:-1)
503: org/apache/harmony/test/reliability/vm/stack/StackUnwindTest.intersectMethodCall()V (??:-1)
504: org/apache/harmony/test/reliability/vm/stack/Method2Class.TestHotInline()V (??:-1)
505: org/apache/harmony/test/reliability/vm/stack/StackUnwindTest.intersectMethodCall()V (??:-1)
506: org/apache/harmony/test/reliability/vm/stack/Method1Class.Test3()V (??:-1)
507: org/apache/harmony/test/reliability/vm/stack/StackUnwindTest.intersectMethodCall()V (??:-1)
508: org/apache/harmony/test/reliability/vm/stack/Method1Class.Test2()V (??:-1)
509: org/apache/harmony/test/reliability/vm/stack/StackUnwindTest.intersectMethodCall()V (??:-1)
510: org/apache/harmony/test/reliability/vm/stack/Method3Class.Test3()V (??:-1)
511: org/apache/harmony/test/reliability/vm/stack/StackUnwindTest.intersectMethodCall()V (??:-1)
512: org/apache/harmony/test/reliability/vm/stack/Method3Class.Test3()V (??:-1)
513: org/apache/harmony/test/reliability/vm/stack/Method3Class.Test2()V (??:-1)
514: org/apache/harmony/test/reliability/vm/stack/Method3Class.Test1()V (??:-1)
515: org/apache/harmony/test/reliability/vm/stack/StackUnwindTest.intersectMethodCall()V (??:-1)
516: org/apache/harmony/test/reliability/vm/stack/Method1Class.TestHotInline()V (??:-1)
517: org/apache/harmony/test/reliability/vm/stack/StackUnwindTest.intersectMethodCall()V (??:-1)
518: org/apache/harmony/test/reliability/vm/stack/Method1Class.Test1()V (??:-1)
519: org/apache/harmony/test/reliability/vm/stack/StackUnwindTest.intersectMethodCall()V (??:-1)
520: org/apache/harmony/test/reliability/vm/stack/Method3Class.Test3()V (??:-1)
521: org/apache/harmony/test/reliability/vm/stack/Method3Class.Test2()V (??:-1)
522: org/apache/harmony/test/reliability/vm/stack/StackUnwindTest.intersectMethodCall()V (??:-1)
523: org/apache/harmony/test/reliability/vm/stack/Method2Class.TestHotInline()V (??:-1)
524: org/apache/harmony/test/reliability/vm/stack/StackUnwindTest.intersectMethodCall()V (??:-1)
525: org/apache/harmony/test/reliability/vm/stack/Method1Class.Test2()V (??:-1)
526: org/apache/harmony/test/reliability/vm/stack/StackUnwindTest.intersectMethodCall()V (??:-1)
527: org/apache/harmony/test/reliability/vm/stack/Method2Class.Test2()V (??:-1)
528: org/apache/harmony/test/reliability/vm/stack/StackUnwindTest.intersectMethodCall()V (??:-1)
529: org/apache/harmony/test/reliability/vm/stack/Method2Class.Test3()V (??:-1)
530: org/apache/harmony/test/reliability/vm/stack/StackUnwindTest.intersectMethodCall()V (??:-1)
531: org/apache/harmony/test/reliability/vm/stack/Method1Class.Test2()V (??:-1)
532: org/apache/harmony/test/reliability/vm/stack/StackUnwindTest.intersectMethodCall()V (??:-1)
533: org/apache/harmony/test/reliability/vm/stack/Method2Class.Test3()V (??:-1)
534: org/apache/harmony/test/reliability/vm/stack/StackUnwindTest.intersectMethodCall()V (??:-1)
535: org/apache/harmony/test/reliability/vm/stack/Method2Class.TestHotInline()V (??:-1)
536: org/apache/harmony/test/reliability/vm/stack/StackUnwindTest.intersectMethodCall()V (??:-1)
537: org/apache/harmony/test/reliability/vm/stack/Method1Class.Test1()V (??:-1)
538: org/apache/harmony/test/reliability/vm/stack/StackUnwindTest.intersectMethodCall()V (??:-1)
539: org/apache/harmony/test/reliability/vm/stack/Method1Class.Test2()V (??:-1)
540: org/apache/harmony/test/reliability/vm/stack/StackUnwindTest.intersectMethodCall()V (??:-1)
541: org/apache/harmony/test/reliability/vm/stack/Method2Class.Test1()V (??:-1)
542: org/apache/harmony/test/reliability/vm/stack/StackUnwindTest.intersectMethodCall()V (??:-1)
543: org/apache/harmony/test/reliability/vm/stack/Method1Class.Test1()V (??:-1)
544: org/apache/harmony/test/reliability/vm/stack/StackUnwindTest.intersectMethodCall()V (??:-1)
545: org/apache/harmony/test/reliability/vm/stack/Method2Class.Test1()V (??:-1)
546: org/apache/harmony/test/reliability/vm/stack/StackUnwindTest.intersectMethodCall()V (??:-1)
547: org/apache/harmony/test/reliability/vm/stack/Method3Class.Test3()V (??:-1)
548: org/apache/harmony/test/reliability/vm/stack/Method3Class.Test2()V (??:-1)
549: org/apache/harmony/test/reliability/vm/stack/Method3Class.Test1()V (??:-1)
550: org/apache/harmony/test/reliability/vm/stack/StackUnwindTest.intersectMethodCall()V (??:-1)
551: org/apache/harmony/test/reliability/vm/stack/Method3Class.Test3()V (??:-1)
552: org/apache/harmony/test/reliability/vm/stack/StackUnwindTest.intersectMethodCall()V (??:-1)
553: org/apache/harmony/test/reliability/vm/stack/Method3Class.Test3()V (??:-1)
554: org/apache/harmony/test/reliability/vm/stack/StackUnwindTest.intersectMethodCall()V (??:-1)
555: org/apache/harmony/test/reliability/vm/stack/Method1Class.Test1()V (??:-1)
556: org/apache/harmony/test/reliability/vm/stack/StackUnwindTest.intersectMethodCall()V (??:-1)
557: org/apache/harmony/test/reliability/vm/stack/Method1Class.TestHotInline()V (??:-1)
558: org/apache/harmony/test/reliability/vm/stack/StackUnwindTest.intersectMethodCall()V (??:-1)
559: org/apache/harmony/test/reliability/vm/stack/Method2Class.Test2()V (??:-1)
560: org/apache/harmony/test/reliability/vm/stack/StackUnwindTest.intersectMethodCall()V (??:-1)
561: org/apache/harmony/test/reliability/vm/stack/Method1Class.TestHotInline()V (??:-1)
562: org/apache/harmony/test/reliability/vm/stack/StackUnwindTest.intersectMethodCall()V (??:-1)
563: org/apache/harmony/test/reliability/vm/stack/Method2Class.Test1()V (??:-1)
564: org/apache/harmony/test/reliability/vm/stack/StackUnwindTest.intersectMethodCall()V (??:-1)
565: org/apache/harmony/test/reliability/vm/stack/Method3Class.Test3()V (??:-1)
566: org/apache/harmony/test/reliability/vm/stack/Method3Class.Test2()V (??:-1)
567: org/apache/harmony/test/reliability/vm/stack/StackUnwindTest.intersectMethodCall()V (??:-1)
568: org/apache/harmony/test/reliability/vm/stack/Method3Class.Test3()V (??:-1)
569: org/apache/harmony/test/reliability/vm/stack/Method3Class.Test2()V (??:-1)
570: org/apache/harmony/test/reliability/vm/stack/StackUnwindTest.intersectMethodCall()V (??:-1)
571: org/apache/harmony/test/reliability/vm/stack/Method3Class.Test3()V (??:-1)
572: org/apache/harmony/test/reliability/vm/stack/StackUnwindTest.intersectMethodCall()V (??:-1)
573: org/apache/harmony/test/reliability/vm/stack/Method1Class.Test2()V (??:-1)
574: org/apache/harmony/test/reliability/vm/stack/StackUnwindTest.intersectMethodCall()V (??:-1)
575: org/apache/harmony/test/reliability/vm/stack/Method3Class.Test3()V (??:-1)
576: org/apache/harmony/test/reliability/vm/stack/Method3Class.Test2()V (??:-1)
577: org/apache/harmony/test/reliability/vm/stack/Method3Class.Test1()V (??:-1)
578: org/apache/harmony/test/reliability/vm/stack/StackUnwindTest.intersectMethodCall()V (??:-1)
579: org/apache/harmony/test/reliability/vm/stack/Method2Class.Test3()V (??:-1)
580: org/apache/harmony/test/reliability/vm/stack/StackUnwindTest.intersectMethodCall()V (??:-1)
581: org/apache/harmony/test/reliability/vm/stack/Method2Class.Test2()V (??:-1)
582: org/apache/harmony/test/reliability/vm/stack/StackUnwindTest.intersectMethodCall()V (??:-1)
583: org/apache/harmony/test/reliability/vm/stack/Method1Class.Test1()V (??:-1)
584: org/apache/harmony/test/reliability/vm/stack/StackUnwindTest.intersectMethodCall()V (??:-1)
585: org/apache/harmony/test/reliability/vm/stack/Method3Class.Test3()V (??:-1)
586: org/apache/harmony/test/reliability/vm/stack/StackUnwindTest.intersectMethodCall()V (??:-1)
587: org/apache/harmony/test/reliability/vm/stack/Method1Class.TestHotInline()V (??:-1)
588: org/apache/harmony/test/reliability/vm/stack/StackUnwindTest.intersectMethodCall()V (??:-1)
589: org/apache/harmony/test/reliability/vm/stack/Method2Class.TestHotInline()V (??:-1)
590: org/apache/harmony/test/reliability/vm/stack/StackUnwindTest.intersectMethodCall()V (??:-1)
591: org/apache/harmony/test/reliability/vm/stack/Method3Class.Test3()V (??:-1)
592: org/apache/harmony/test/reliability/vm/stack/Method3Class.Test2()V (??:-1)
593: org/apache/harmony/test/reliability/vm/stack/StackUnwindTest.intersectMethodCall()V (??:-1)
594: org/apache/harmony/test/reliability/vm/stack/Method3Class.TestHotInline()V (??:-1)
595: org/apache/harmony/test/reliability/vm/stack/StackUnwindTest.intersectMethodCall()V (??:-1)
596: org/apache/harmony/test/reliability/vm/stack/Method2Class.Test1()V (??:-1)
597: org/apache/harmony/test/reliability/vm/stack/StackUnwindTest.intersectMethodCall()V (??:-1)
598: org/apache/harmony/test/reliability/vm/stack/Method2Class.Test2()V (??:-1)
599: org/apache/harmony/test/reliability/vm/stack/StackUnwindTest.intersectMethodCall()V (??:-1)
600: org/apache/harmony/test/reliability/vm/stack/Method3Class.Test3()V (??:-1)
601: org/apache/harmony/test/reliability/vm/stack/Method3Class.Test2()V (??:-1)
602: org/apache/harmony/test/reliability/vm/stack/Method3Class.Test1()V (??:-1)
603: org/apache/harmony/test/reliability/vm/stack/StackUnwindTest.intersectMethodCall()V (??:-1)
604: org/apache/harmony/test/reliability/vm/stack/Method3Class.TestHotInline()V (??:-1)
605: org/apache/harmony/test/reliability/vm/stack/StackUnwindTest.intersectMethodCall()V (??:-1)
606: org/apache/harmony/test/reliability/vm/stack/Method3Class.TestHotInline()V (??:-1)
607: org/apache/harmony/test/reliability/vm/stack/StackUnwindTest.intersectMethodCall()V (??:-1)
608: org/apache/harmony/test/reliability/vm/stack/Method3Class.Test3()V (??:-1)
609: org/apache/harmony/test/reliability/vm/stack/StackUnwindTest.intersectMethodCall()V (??:-1)
610: org/apache/harmony/test/reliability/vm/stack/Method1Class.Test2()V (??:-1)
611: org/apache/harmony/test/reliability/vm/stack/StackUnwindTest.intersectMethodCall()V (??:-1)
612: org/apache/harmony/test/reliability/vm/stack/Method2Class.Test2()V (??:-1)
613: org/apache/harmony/test/reliability/vm/stack/StackUnwindTest.intersectMethodCall()V (??:-1)
614: org/apache/harmony/test/reliability/vm/stack/Method3Class.Test3()V (??:-1)
615: org/apache/harmony/test/reliability/vm/stack/StackUnwindTest.intersectMethodCall()V (??:-1)
616: org/apache/harmony/test/reliability/vm/stack/Method1Class.Test1()V (??:-1)
617: org/apache/harmony/test/reliability/vm/stack/StackUnwindTest.intersectMethodCall()V (??:-1)
618: org/apache/harmony/test/reliability/vm/stack/Method2Class.Test3()V (??:-1)
619: org/apache/harmony/test/reliability/vm/stack/StackUnwindTest.intersectMethodCall()V (??:-1)
620: org/apache/harmony/test/reliability/vm/stack/Method2Class.Test2()V (??:-1)
621: org/apache/harmony/test/reliability/vm/stack/StackUnwindTest.intersectMethodCall()V (??:-1)
622: org/apache/harmony/test/reliability/vm/stack/Method2Class.Test2()V (??:-1)
623: org/apache/harmony/test/reliability/vm/stack/StackUnwindTest.intersectMethodCall()V (??:-1)
624: org/apache/harmony/test/reliability/vm/stack/Method1Class.Test2()V (??:-1)
625: org/apache/harmony/test/reliability/vm/stack/StackUnwindTest.intersectMethodCall()V (??:-1)
626: org/apache/harmony/test/reliability/vm/stack/Method2Class.TestHotInline()V (??:-1)
627: org/apache/harmony/test/reliability/vm/stack/StackUnwindTest.intersectMethodCall()V (??:-1)
628: org/apache/harmony/test/reliability/vm/stack/Method2Class.TestHotInline()V (??:-1)
629: org/apache/harmony/test/reliability/vm/stack/StackUnwindTest.intersectMethodCall()V (??:-1)
630: org/apache/harmony/test/reliability/vm/stack/Method3Class.Test3()V (??:-1)
631: org/apache/harmony/test/reliability/vm/stack/Method3Class.Test2()V (??:-1)
632: org/apache/harmony/test/reliability/vm/stack/StackUnwindTest.intersectMethodCall()V (??:-1)
633: org/apache/harmony/test/reliability/vm/stack/Method2Class.Test1()V (??:-1)
634: org/apache/harmony/test/reliability/vm/stack/StackUnwindTest.intersectMethodCall()V (??:-1)
635: org/apache/harmony/test/reliability/vm/stack/Method2Class.Test1()V (??:-1)
636: org/apache/harmony/test/reliability/vm/stack/StackUnwindTest.intersectMethodCall()V (??:-1)
637: org/apache/harmony/test/reliability/vm/stack/Method1Class.Test1()V (??:-1)
638: org/apache/harmony/test/reliability/vm/stack/StackUnwindTest.intersectMethodCall()V (??:-1)
639: org/apache/harmony/test/reliability/vm/stack/Method3Class.Test3()V (??:-1)
640: org/apache/harmony/test/reliability/vm/stack/Method3Class.Test2()V (??:-1)
641: org/apache/harmony/test/reliability/vm/stack/Method3Class.Test1()V (??:-1)
642: org/apache/harmony/test/reliability/vm/stack/StackUnwindTest.intersectMethodCall()V (??:-1)
643: org/apache/harmony/test/reliability/vm/stack/Method1Class.Test1()V (??:-1)
644: org/apache/harmony/test/reliability/vm/stack/StackUnwindTest.intersectMethodCall()V (??:-1)
645: org/apache/harmony/test/reliability/vm/stack/Method3Class.Test3()V (??:-1)
646: org/apache/harmony/test/reliability/vm/stack/StackUnwindTest.intersectMethodCall()V (??:-1)
647: org/apache/harmony/test/reliability/vm/stack/Method2Class.TestHotInline()V (??:-1)
648: org/apache/harmony/test/reliability/vm/stack/StackUnwindTest.intersectMethodCall()V (??:-1)
649: org/apache/harmony/test/reliability/vm/stack/Method1Class.Test1()V (??:-1)
650: org/apache/harmony/test/reliability/vm/stack/StackUnwindTest.intersectMethodCall()V (??:-1)
651: org/apache/harmony/test/reliability/vm/stack/Method3Class.Test3()V (??:-1)
652: org/apache/harmony/test/reliability/vm/stack/Method3Class.Test2()V (??:-1)
653: org/apache/harmony/test/reliability/vm/stack/Method3Class.Test1()V (??:-1)
654: org/apache/harmony/test/reliability/vm/stack/StackUnwindTest.intersectMethodCall()V (??:-1)
655: org/apache/harmony/test/reliability/vm/stack/Method1Class.Test3()V (??:-1)
656: org/apache/harmony/test/reliability/vm/stack/StackUnwindTest.intersectMethodCall()V (??:-1)
657: org/apache/harmony/test/reliability/vm/stack/Method3Class.Test3()V (??:-1)
658: org/apache/harmony/test/reliability/vm/stack/Method3Class.Test2()V (??:-1)
659: org/apache/harmony/test/reliability/vm/stack/StackUnwindTest.intersectMethodCall()V (??:-1)
660: org/apache/harmony/test/reliability/vm/stack/Method1Class.Test3()V (??:-1)
661: org/apache/harmony/test/reliability/vm/stack/StackUnwindTest.intersectMethodCall()V (??:-1)
662: org/apache/harmony/test/reliability/vm/stack/Method2Class.TestHotInline()V (??:-1)
663: org/apache/harmony/test/reliability/vm/stack/StackUnwindTest.intersectMethodCall()V (??:-1)
664: org/apache/harmony/test/reliability/vm/stack/Method3Class.Test3()V (??:-1)
665: org/apache/harmony/test/reliability/vm/stack/Method3Class.Test2()V (??:-1)
666: org/apache/harmony/test/reliability/vm/stack/StackUnwindTest.intersectMethodCall()V (??:-1)
667: org/apache/harmony/test/reliability/vm/stack/Method2Class.Test3()V (??:-1)
668: org/apache/harmony/test/reliability/vm/stack/StackUnwindTest.intersectMethodCall()V (??:-1)
669: org/apache/harmony/test/reliability/vm/stack/Method3Class.Test3()V (??:-1)
670: org/apache/harmony/test/reliability/vm/stack/Method3Class.Test2()V (??:-1)
671: org/apache/harmony/test/reliability/vm/stack/StackUnwindTest.intersectMethodCall()V (??:-1)
672: org/apache/harmony/test/reliability/vm/stack/Method3Class.Test3()V (??:-1)
673: org/apache/harmony/test/reliability/vm/stack/StackUnwindTest.intersectMethodCall()V (??:-1)
674: org/apache/harmony/test/reliability/vm/stack/Method1Class.Test3()V (??:-1)
675: org/apache/harmony/test/reliability/vm/stack/StackUnwindTest.intersectMethodCall()V (??:-1)
676: org/apache/harmony/test/reliability/vm/stack/Method2Class.TestHotInline()V (??:-1)
677: org/apache/harmony/test/reliability/vm/stack/StackUnwindTest.intersectMethodCall()V (??:-1)
678: org/apache/harmony/test/reliability/vm/stack/Method3Class.Test3()V (??:-1)
679: org/apache/harmony/test/reliability/vm/stack/Method3Class.Test2()V (??:-1)
680: org/apache/harmony/test/reliability/vm/stack/StackUnwindTest.intersectMethodCall()V (??:-1)
681: org/apache/harmony/test/reliability/vm/stack/Method2Class.Test3()V (??:-1)
682: org/apache/harmony/test/reliability/vm/stack/StackUnwindTest.intersectMethodCall()V (??:-1)
683: org/apache/harmony/test/reliability/vm/stack/Method1Class.Test1()V (??:-1)
684: org/apache/harmony/test/reliability/vm/stack/StackUnwindTest.intersectMethodCall()V (??:-1)
685: org/apache/harmony/test/reliability/vm/stack/Method2Class.Test1()V (??:-1)
686: org/apache/harmony/test/reliability/vm/stack/StackUnwindTest.intersectMethodCall()V (??:-1)
687: org/apache/harmony/test/reliability/vm/stack/Method3Class.Test3()V (??:-1)
688: org/apache/harmony/test/reliability/vm/stack/Method3Class.Test2()V (??:-1)
689: org/apache/harmony/test/reliability/vm/stack/StackUnwindTest.intersectMethodCall()V (??:-1)
690: org/apache/harmony/test/reliability/vm/stack/Method3Class.Test3()V (??:-1)
691: org/apache/harmony/test/reliability/vm/stack/Method3Class.Test2()V (??:-1)
692: org/apache/harmony/test/reliability/vm/stack/StackUnwindTest.intersectMethodCall()V (??:-1)
693: org/apache/harmony/test/reliability/vm/stack/Method1Class.TestHotInline()V (??:-1)
694: org/apache/harmony/test/reliability/vm/stack/StackUnwindTest.intersectMethodCall()V (??:-1)
695: org/apache/harmony/test/reliability/vm/stack/Method1Class.Test3()V (??:-1)
696: org/apache/harmony/test/reliability/vm/stack/StackUnwindTest.intersectMethodCall()V (??:-1)
697: org/apache/harmony/test/reliability/vm/stack/Method3Class.Test3()V (??:-1)
698: org/apache/harmony/test/reliability/vm/stack/Method3Class.Test2()V (??:-1)
699: org/apache/harmony/test/reliability/vm/stack/StackUnwindTest.intersectMethodCall()V (??:-1)
700: org/apache/harmony/test/reliability/vm/stack/Method3Class.Test3()V (??:-1)
701: org/apache/harmony/test/reliability/vm/stack/Method3Class.Test2()V (??:-1)
702: org/apache/harmony/test/reliability/vm/stack/Method3Class.Test1()V (??:-1)
703: org/apache/harmony/test/reliability/vm/stack/StackUnwindTest.intersectMethodCall()V (??:-1)
704: org/apache/harmony/test/reliability/vm/stack/Method1Class.Test2()V (??:-1)
705: org/apache/harmony/test/reliability/vm/stack/StackUnwindTest.intersectMethodCall()V (??:-1)
706: org/apache/harmony/test/reliability/vm/stack/Method2Class.Test3()V (??:-1)
707: org/apache/harmony/test/reliability/vm/stack/StackUnwindTest.intersectMethodCall()V (??:-1)
708: org/apache/harmony/test/reliability/vm/stack/Method1Class.TestHotInline()V (??:-1)
709: org/apache/harmony/test/reliability/vm/stack/StackUnwindTest.intersectMethodCall()V (??:-1)
710: org/apache/harmony/test/reliability/vm/stack/Method1Class.Test1()V (??:-1)
711: org/apache/harmony/test/reliability/vm/stack/StackUnwindTest.intersectMethodCall()V (??:-1)
712: org/apache/harmony/test/reliability/vm/stack/Method3Class.Test3()V (??:-1)
713: org/apache/harmony/test/reliability/vm/stack/StackUnwindTest.intersectMethodCall()V (??:-1)
714: org/apache/harmony/test/reliability/vm/stack/Method3Class.Test3()V (??:-1)
715: org/apache/harmony/test/reliability/vm/stack/Method3Class.Test2()V (??:-1)
716: org/apache/harmony/test/reliability/vm/stack/StackUnwindTest.intersectMethodCall()V (??:-1)
717: org/apache/harmony/test/reliability/vm/stack/Method3Class.TestHotInline()V (??:-1)
718: org/apache/harmony/test/reliability/vm/stack/StackUnwindTest.intersectMethodCall()V (??:-1)
719: org/apache/harmony/test/reliability/vm/stack/Method3Class.Test3()V (??:-1)
720: org/apache/harmony/test/reliability/vm/stack/Method3Class.Test2()V (??:-1)
721: org/apache/harmony/test/reliability/vm/stack/Method3Class.Test1()V (??:-1)
722: org/apache/harmony/test/reliability/vm/stack/StackUnwindTest.intersectMethodCall()V (??:-1)
723: org/apache/harmony/test/reliability/vm/stack/Method1Class.Test3()V (??:-1)
724: org/apache/harmony/test/reliability/vm/stack/StackUnwindTest.intersectMethodCall()V (??:-1)
725: org/apache/harmony/test/reliability/vm/stack/Method3Class.Test3()V (??:-1)
726: org/apache/harmony/test/reliability/vm/stack/StackUnwindTest.intersectMethodCall()V (??:-1)
727: org/apache/harmony/test/reliability/vm/stack/Method2Class.Test2()V (??:-1)
728: org/apache/harmony/test/reliability/vm/stack/StackUnwindTest.intersectMethodCall()V (??:-1)
729: org/apache/harmony/test/reliability/vm/stack/Method2Class.TestHotInline()V (??:-1)
730: org/apache/harmony/test/reliability/vm/stack/StackUnwindTest.intersectMethodCall()V (??:-1)
731: org/apache/harmony/test/reliability/vm/stack/Method1Class.Test2()V (??:-1)
732: org/apache/harmony/test/reliability/vm/stack/StackUnwindTest.intersectMethodCall()V (??:-1)
733: org/apache/harmony/test/reliability/vm/stack/Method1Class.TestHotInline()V (??:-1)
734: org/apache/harmony/test/reliability/vm/stack/StackUnwindTest.intersectMethodCall()V (??:-1)
735: org/apache/harmony/test/reliability/vm/stack/Method1Class.TestHotInline()V (??:-1)
736: org/apache/harmony/test/reliability/vm/stack/StackUnwindTest.intersectMethodCall()V (??:-1)
737: org/apache/harmony/test/reliability/vm/stack/Method1Class.Test3()V (??:-1)
738: org/apache/harmony/test/reliability/vm/stack/StackUnwindTest.intersectMethodCall()V (??:-1)
739: org/apache/harmony/test/reliability/vm/stack/Method1Class.TestHotInline()V (??:-1)
740: org/apache/harmony/test/reliability/vm/stack/StackUnwindTest.intersectMethodCall()V (??:-1)
741: org/apache/harmony/test/reliability/vm/stack/Method1Class.Test1()V (??:-1)
742: org/apache/harmony/test/reliability/vm/stack/StackUnwindTest.intersectMethodCall()V (??:-1)
743: org/apache/harmony/test/reliability/vm/stack/Method1Class.Test2()V (??:-1)
744: org/apache/harmony/test/reliability/vm/stack/StackUnwindTest.intersectMethodCall()V (??:-1)
745: org/apache/harmony/test/reliability/vm/stack/Method3Class.TestHotInline()V (??:-1)
746: org/apache/harmony/test/reliability/vm/stack/StackUnwindTest.intersectMethodCall()V (??:-1)
747: org/apache/harmony/test/reliability/vm/stack/Method3Class.TestHotInline()V (??:-1)
748: org/apache/harmony/test/reliability/vm/stack/StackUnwindTest.intersectMethodCall()V (??:-1)
749: org/apache/harmony/test/reliability/vm/stack/Method1Class.Test3()V (??:-1)
750: org/apache/harmony/test/reliability/vm/stack/StackUnwindTest.intersectMethodCall()V (??:-1)
751: org/apache/harmony/test/reliability/vm/stack/Method2Class.Test1()V (??:-1)
752: org/apache/harmony/test/reliability/vm/stack/StackUnwindTest.intersectMethodCall()V (??:-1)
753: org/apache/harmony/test/reliability/vm/stack/Method3Class.Test3()V (??:-1)
754: org/apache/harmony/test/reliability/vm/stack/StackUnwindTest.intersectMethodCall()V (??:-1)
755: org/apache/harmony/test/reliability/vm/stack/Method3Class.Test3()V (??:-1)
756: org/apache/harmony/test/reliability/vm/stack/Method3Class.Test2()V (??:-1)
757: org/apache/harmony/test/reliability/vm/stack/StackUnwindTest.intersectMethodCall()V (??:-1)
758: org/apache/harmony/test/reliability/vm/stack/Method1Class.TestHotInline()V (??:-1)
759: org/apache/harmony/test/reliability/vm/stack/StackUnwindTest.intersectMethodCall()V (??:-1)
760: org/apache/harmony/test/reliability/vm/stack/Method2Class.Test1()V (??:-1)
761: org/apache/harmony/test/reliability/vm/stack/StackUnwindTest.intersectMethodCall()V (??:-1)
762: org/apache/harmony/test/reliability/vm/stack/Method2Class.Test3()V (??:-1)
763: org/apache/harmony/test/reliability/vm/stack/StackUnwindTest.intersectMethodCall()V (??:-1)
764: org/apache/harmony/test/reliability/vm/stack/Method3Class.Test3()V (??:-1)
765: org/apache/harmony/test/reliability/vm/stack/StackUnwindTest.intersectMethodCall()V (??:-1)
766: org/apache/harmony/test/reliability/vm/stack/Method1Class.Test2()V (??:-1)
767: org/apache/harmony/test/reliability/vm/stack/StackUnwindTest.intersectMethodCall()V (??:-1)
768: org/apache/harmony/test/reliability/vm/stack/Method2Class.Test2()V (??:-1)
769: org/apache/harmony/test/reliability/vm/stack/StackUnwindTest.intersectMethodCall()V (??:-1)
770: org/apache/harmony/test/reliability/vm/stack/Method1Class.Test1()V (??:-1)
771: org/apache/harmony/test/reliability/vm/stack/StackUnwindTest.intersectMethodCall()V (??:-1)
772: org/apache/harmony/test/reliability/vm/stack/Method3Class.Test3()V (??:-1)
773: org/apache/harmony/test/reliability/vm/stack/StackUnwindTest.intersectMethodCall()V (??:-1)
774: org/apache/harmony/test/reliability/vm/stack/Method3Class.Test3()V (??:-1)
775: org/apache/harmony/test/reliability/vm/stack/Method3Class.Test2()V (??:-1)
776: org/apache/harmony/test/reliability/vm/stack/Method3Class.Test1()V (??:-1)
777: org/apache/harmony/test/reliability/vm/stack/StackUnwindTest.intersectMethodCall()V (??:-1)
778: org/apache/harmony/test/reliability/vm/stack/Method2Class.Test2()V (??:-1)
779: org/apache/harmony/test/reliability/vm/stack/StackUnwindTest.intersectMethodCall()V (??:-1)
780: org/apache/harmony/test/reliability/vm/stack/Method1Class.Test2()V (??:-1)
781: org/apache/harmony/test/reliability/vm/stack/StackUnwindTest.intersectMethodCall()V (??:-1)
782: org/apache/harmony/test/reliability/vm/stack/Method1Class.Test2()V (??:-1)
783: org/apache/harmony/test/reliability/vm/stack/StackUnwindTest.intersectMethodCall()V (??:-1)
784: org/apache/harmony/test/reliability/vm/stack/Method3Class.TestHotInline()V (??:-1)
785: org/apache/harmony/test/reliability/vm/stack/StackUnwindTest.intersectMethodCall()V (??:-1)
786: org/apache/harmony/test/reliability/vm/stack/Method1Class.Test2()V (??:-1)
787: org/apache/harmony/test/reliability/vm/stack/StackUnwindTest.intersectMethodCall()V (??:-1)
788: org/apache/harmony/test/reliability/vm/stack/Method1Class.TestHotInline()V (??:-1)
789: org/apache/harmony/test/reliability/vm/stack/StackUnwindTest.intersectMethodCall()V (??:-1)
790: org/apache/harmony/test/reliability/vm/stack/Method3Class.Test3()V (??:-1)
791: org/apache/harmony/test/reliability/vm/stack/StackUnwindTest.intersectMethodCall()V (??:-1)
792: org/apache/harmony/test/reliability/vm/stack/Method1Class.Test1()V (??:-1)
793: org/apache/harmony/test/reliability/vm/stack/StackUnwindTest.intersectMethodCall()V (??:-1)
794: org/apache/harmony/test/reliability/vm/stack/Method3Class.Test3()V (??:-1)
795: org/apache/harmony/test/reliability/vm/stack/Method3Class.Test2()V (??:-1)
796: org/apache/harmony/test/reliability/vm/stack/Method3Class.Test1()V (??:-1)
797: org/apache/harmony/test/reliability/vm/stack/StackUnwindTest.intersectMethodCall()V (??:-1)
798: org/apache/harmony/test/reliability/vm/stack/Method1Class.Test2()V (??:-1)
799: org/apache/harmony/test/reliability/vm/stack/StackUnwindTest.intersectMethodCall()V (??:-1)
800: org/apache/harmony/test/reliability/vm/stack/Method3Class.Test3()V (??:-1)
801: org/apache/harmony/test/reliability/vm/stack/Method3Class.Test2()V (??:-1)
802: org/apache/harmony/test/reliability/vm/stack/Method3Class.Test1()V (??:-1)
803: org/apache/harmony/test/reliability/vm/stack/StackUnwindTest.intersectMethodCall()V (??:-1)
804: org/apache/harmony/test/reliability/vm/stack/Method2Class.Test1()V (??:-1)
805: org/apache/harmony/test/reliability/vm/stack/StackUnwindTest.intersectMethodCall()V (??:-1)
806: org/apache/harmony/test/reliability/vm/stack/Method1Class.Test2()V (??:-1)
807: org/apache/harmony/test/reliability/vm/stack/StackUnwindTest.intersectMethodCall()V (??:-1)
808: org/apache/harmony/test/reliability/vm/stack/Method3Class.Test3()V (??:-1)
809: org/apache/harmony/test/reliability/vm/stack/StackUnwindTest.intersectMethodCall()V (??:-1)
810: org/apache/harmony/test/reliability/vm/stack/Method1Class.Test2()V (??:-1)
811: org/apache/harmony/test/reliability/vm/stack/StackUnwindTest.intersectMethodCall()V (??:-1)
812: org/apache/harmony/test/reliability/vm/stack/Method1Class.Test1()V (??:-1)
813: org/apache/harmony/test/reliability/vm/stack/StackUnwindTest.intersectMethodCall()V (??:-1)
814: org/apache/harmony/test/reliability/vm/stack/Method2Class.TestHotInline()V (??:-1)
815: org/apache/harmony/test/reliability/vm/stack/StackUnwindTest.intersectMethodCall()V (??:-1)
816: org/apache/harmony/test/reliability/vm/stack/Method1Class.Test1()V (??:-1)
817: org/apache/harmony/test/reliability/vm/stack/StackUnwindTest.intersectMethodCall()V (??:-1)
818: org/apache/harmony/test/reliability/vm/stack/Method1Class.Test2()V (??:-1)
819: org/apache/harmony/test/reliability/vm/stack/StackUnwindTest.intersectMethodCall()V (??:-1)
820: org/apache/harmony/test/reliability/vm/stack/Method1Class.Test3()V (??:-1)
821: org/apache/harmony/test/reliability/vm/stack/StackUnwindTest.intersectMethodCall()V (??:-1)
822: org/apache/harmony/test/reliability/vm/stack/Method1Class.Test3()V (??:-1)
823: org/apache/harmony/test/reliability/vm/stack/StackUnwindTest.intersectMethodCall()V (??:-1)
824: org/apache/harmony/test/reliability/vm/stack/Method3Class.Test3()V (??:-1)
825: org/apache/harmony/test/reliability/vm/stack/StackUnwindTest.intersectMethodCall()V (??:-1)
826: org/apache/harmony/test/reliability/vm/stack/Method1Class.Test3()V (??:-1)
827: org/apache/harmony/test/reliability/vm/stack/StackUnwindTest.intersectMethodCall()V (??:-1)
828: org/apache/harmony/test/reliability/vm/stack/Method3Class.Test3()V (??:-1)
829: org/apache/harmony/test/reliability/vm/stack/Method3Class.Test2()V (??:-1)
830: org/apache/harmony/test/reliability/vm/stack/StackUnwindTest.intersectMethodCall()V (??:-1)
831: org/apache/harmony/test/reliability/vm/stack/Method1Class.Test3()V (??:-1)
832: org/apache/harmony/test/reliability/vm/stack/StackUnwindTest.intersectMethodCall()V (??:-1)
833: org/apache/harmony/test/reliability/vm/stack/Method2Class.TestHotInline()V (??:-1)
834: org/apache/harmony/test/reliability/vm/stack/StackUnwindTest.intersectMethodCall()V (??:-1)
835: org/apache/harmony/test/reliability/vm/stack/Method2Class.TestHotInline()V (??:-1)
836: org/apache/harmony/test/reliability/vm/stack/StackUnwindTest.intersectMethodCall()V (??:-1)
837: org/apache/harmony/test/reliability/vm/stack/Method3Class.Test3()V (??:-1)
838: org/apache/harmony/test/reliability/vm/stack/StackUnwindTest.intersectMethodCall()V (??:-1)
839: org/apache/harmony/test/reliability/vm/stack/Method1Class.Test1()V (??:-1)
840: org/apache/harmony/test/reliability/vm/stack/StackUnwindTest.intersectMethodCall()V (??:-1)
841: org/apache/harmony/test/reliability/vm/stack/Method1Class.TestHotInline()V (??:-1)
842: org/apache/harmony/test/reliability/vm/stack/StackUnwindTest.intersectMethodCall()V (??:-1)
843: org/apache/harmony/test/reliability/vm/stack/Method2Class.Test3()V (??:-1)
844: org/apache/harmony/test/reliability/vm/stack/StackUnwindTest.intersectMethodCall()V (??:-1)
845: org/apache/harmony/test/reliability/vm/stack/Method1Class.Test2()V (??:-1)
846: org/apache/harmony/test/reliability/vm/stack/StackUnwindTest.intersectMethodCall()V (??:-1)
847: org/apache/harmony/test/reliability/vm/stack/Method3Class.Test3()V (??:-1)
848: org/apache/harmony/test/reliability/vm/stack/Method3Class.Test2()V (??:-1)
849: org/apache/harmony/test/reliability/vm/stack/StackUnwindTest.intersectMethodCall()V (??:-1)
850: org/apache/harmony/test/reliability/vm/stack/Method2Class.Test1()V (??:-1)
851: org/apache/harmony/test/reliability/vm/stack/StackUnwindTest.intersectMethodCall()V (??:-1)
852: org/apache/harmony/test/reliability/vm/stack/Method3Class.TestHotInline()V (??:-1)
853: org/apache/harmony/test/reliability/vm/stack/StackUnwindTest.intersectMethodCall()V (??:-1)
854: org/apache/harmony/test/reliability/vm/stack/Method2Class.Test1()V (??:-1)
855: org/apache/harmony/test/reliability/vm/stack/StackUnwindTest.intersectMethodCall()V (??:-1)
856: org/apache/harmony/test/reliability/vm/stack/Method1Class.TestHotInline()V (??:-1)
857: org/apache/harmony/test/reliability/vm/stack/StackUnwindTest.intersectMethodCall()V (??:-1)
858: org/apache/harmony/test/reliability/vm/stack/Method1Class.Test1()V (??:-1)
859: org/apache/harmony/test/reliability/vm/stack/StackUnwindTest.intersectMethodCall()V (??:-1)
860: org/apache/harmony/test/reliability/vm/stack/Method2Class.TestHotInline()V (??:-1)
861: org/apache/harmony/test/reliability/vm/stack/StackUnwindTest.intersectMethodCall()V (??:-1)
862: org/apache/harmony/test/reliability/vm/stack/Method1Class.TestHotInline()V (??:-1)
863: org/apache/harmony/test/reliability/vm/stack/StackUnwindTest.intersectMethodCall()V (??:-1)
864: org/apache/harmony/test/reliability/vm/stack/Method1Class.Test1()V (??:-1)
865: org/apache/harmony/test/reliability/vm/stack/StackUnwindTest.intersectMethodCall()V (??:-1)
866: org/apache/harmony/test/reliability/vm/stack/Method2Class.Test3()V (??:-1)
867: org/apache/harmony/test/reliability/vm/stack/StackUnwindTest.intersectMethodCall()V (??:-1)
868: org/apache/harmony/test/reliability/vm/stack/Method3Class.Test3()V (??:-1)
869: org/apache/harmony/test/reliability/vm/stack/Method3Class.Test2()V (??:-1)
870: org/apache/harmony/test/reliability/vm/stack/StackUnwindTest.intersectMethodCall()V (??:-1)
871: org/apache/harmony/test/reliability/vm/stack/Method2Class.Test3()V (??:-1)
872: org/apache/harmony/test/reliability/vm/stack/StackUnwindTest.intersectMethodCall()V (??:-1)
873: org/apache/harmony/test/reliability/vm/stack/Method1Class.Test1()V (??:-1)
874: org/apache/harmony/test/reliability/vm/stack/StackUnwindTest.intersectMethodCall()V (??:-1)
875: org/apache/harmony/test/reliability/vm/stack/Method2Class.Test1()V (??:-1)
876: org/apache/harmony/test/reliability/vm/stack/StackUnwindTest.intersectMethodCall()V (??:-1)
877: org/apache/harmony/test/reliability/vm/stack/Method2Class.Test3()V (??:-1)
878: org/apache/harmony/test/reliability/vm/stack/StackUnwindTest.intersectMethodCall()V (??:-1)
879: org/apache/harmony/test/reliability/vm/stack/Method2Class.Test3()V (??:-1)
880: org/apache/harmony/test/reliability/vm/stack/StackUnwindTest.intersectMethodCall()V (??:-1)
881: org/apache/harmony/test/reliability/vm/stack/Method3Class.Test3()V (??:-1)
882: org/apache/harmony/test/reliability/vm/stack/Method3Class.Test2()V (??:-1)
883: org/apache/harmony/test/reliability/vm/stack/StackUnwindTest.intersectMethodCall()V (??:-1)
884: org/apache/harmony/test/reliability/vm/stack/Method3Class.Test3()V (??:-1)
885: org/apache/harmony/test/reliability/vm/stack/Method3Class.Test2()V (??:-1)
886: org/apache/harmony/test/reliability/vm/stack/StackUnwindTest.intersectMethodCall()V (??:-1)
887: org/apache/harmony/test/reliability/vm/stack/Method2Class.Test1()V (??:-1)
888: org/apache/harmony/test/reliability/vm/stack/StackUnwindTest.intersectMethodCall()V (??:-1)
889: org/apache/harmony/test/reliability/vm/stack/Method2Class.Test1()V (??:-1)
890: org/apache/harmony/test/reliability/vm/stack/StackUnwindTest.intersectMethodCall()V (??:-1)
891: org/apache/harmony/test/reliability/vm/stack/Method3Class.Test3()V (??:-1)
892: org/apache/harmony/test/reliability/vm/stack/Method3Class.Test2()V (??:-1)
893: org/apache/harmony/test/reliability/vm/stack/Method3Class.Test1()V (??:-1)
894: org/apache/harmony/test/reliability/vm/stack/StackUnwindTest.intersectMethodCall()V (??:-1)
895: org/apache/harmony/test/reliability/vm/stack/Method1Class.Test1()V (??:-1)
896: org/apache/harmony/test/reliability/vm/stack/StackUnwindTest.intersectMethodCall()V (??:-1)
897: org/apache/harmony/test/reliability/vm/stack/Method1Class.Test2()V (??:-1)
898: org/apache/harmony/test/reliability/vm/stack/StackUnwindTest.intersectMethodCall()V (??:-1)
899: org/apache/harmony/test/reliability/vm/stack/Method1Class.Test2()V (??:-1)
900: org/apache/harmony/test/reliability/vm/stack/StackUnwindTest.intersectMethodCall()V (??:-1)
901: org/apache/harmony/test/reliability/vm/stack/Method3Class.Test3()V (??:-1)
902: org/apache/harmony/test/reliability/vm/stack/Method3Class.Test2()V (??:-1)
903: org/apache/harmony/test/reliability/vm/stack/StackUnwindTest.intersectMethodCall()V (??:-1)
904: org/apache/harmony/test/reliability/vm/stack/Method3Class.TestHotInline()V (??:-1)
905: org/apache/harmony/test/reliability/vm/stack/StackUnwindTest.intersectMethodCall()V (??:-1)
906: org/apache/harmony/test/reliability/vm/stack/Method3Class.TestHotInline()V (??:-1)
907: org/apache/harmony/test/reliability/vm/stack/StackUnwindTest.intersectMethodCall()V (??:-1)
908: org/apache/harmony/test/reliability/vm/stack/Method2Class.Test3()V (??:-1)
909: org/apache/harmony/test/reliability/vm/stack/StackUnwindTest.intersectMethodCall()V (??:-1)
910: org/apache/harmony/test/reliability/vm/stack/Method1Class.TestHotInline()V (??:-1)
911: org/apache/harmony/test/reliability/vm/stack/StackUnwindTest.intersectMethodCall()V (??:-1)
912: org/apache/harmony/test/reliability/vm/stack/Method3Class.Test3()V (??:-1)
913: org/apache/harmony/test/reliability/vm/stack/Method3Class.Test2()V (??:-1)
914: org/apache/harmony/test/reliability/vm/stack/Method3Class.Test1()V (??:-1)
915: org/apache/harmony/test/reliability/vm/stack/StackUnwindTest.intersectMethodCall()V (??:-1)
916: org/apache/harmony/test/reliability/vm/stack/Method1Class.TestHotInline()V (??:-1)
917: org/apache/harmony/test/reliability/vm/stack/StackUnwindTest.intersectMethodCall()V (??:-1)
918: org/apache/harmony/test/reliability/vm/stack/Method2Class.Test3()V (??:-1)
919: org/apache/harmony/test/reliability/vm/stack/StackUnwindTest.intersectMethodCall()V (??:-1)
920: org/apache/harmony/test/reliability/vm/stack/Method2Class.Test1()V (??:-1)
921: org/apache/harmony/test/reliability/vm/stack/StackUnwindTest.intersectMethodCall()V (??:-1)
922: org/apache/harmony/test/reliability/vm/stack/Method2Class.Test3()V (??:-1)
923: org/apache/harmony/test/reliability/vm/stack/StackUnwindTest.intersectMethodCall()V (??:-1)
924: org/apache/harmony/test/reliability/vm/stack/Method1Class.TestHotInline()V (??:-1)
925: org/apache/harmony/test/reliability/vm/stack/StackUnwindTest.intersectMethodCall()V (??:-1)
926: org/apache/harmony/test/reliability/vm/stack/Method2Class.TestHotInline()V (??:-1)
927: org/apache/harmony/test/reliability/vm/stack/StackUnwindTest.intersectMethodCall()V (??:-1)
928: org/apache/harmony/test/reliability/vm/stack/Method2Class.Test3()V (??:-1)
929: org/apache/harmony/test/reliability/vm/stack/StackUnwindTest.intersectMethodCall()V (??:-1)
930: org/apache/harmony/test/reliability/vm/stack/Method1Class.Test3()V (??:-1)
931: org/apache/harmony/test/reliability/vm/stack/StackUnwindTest.intersectMethodCall()V (??:-1)
932: org/apache/harmony/test/reliability/vm/stack/Method3Class.Test3()V (??:-1)
933: org/apache/harmony/test/reliability/vm/stack/Method3Class.Test2()V (??:-1)
934: org/apache/harmony/test/reliability/vm/stack/StackUnwindTest.intersectMethodCall()V (??:-1)
935: org/apache/harmony/test/reliability/vm/stack/Method3Class.Test3()V (??:-1)
936: org/apache/harmony/test/reliability/vm/stack/StackUnwindTest.intersectMethodCall()V (??:-1)
937: org/apache/harmony/test/reliability/vm/stack/Method1Class.Test1()V (??:-1)
938: org/apache/harmony/test/reliability/vm/stack/StackUnwindTest.intersectMethodCall()V (??:-1)
939: org/apache/harmony/test/reliability/vm/stack/Method3Class.Test3()V (??:-1)
940: org/apache/harmony/test/reliability/vm/stack/StackUnwindTest.intersectMethodCall()V (??:-1)
941: org/apache/harmony/test/reliability/vm/stack/Method1Class.Test1()V (??:-1)
942: org/apache/harmony/test/reliability/vm/stack/StackUnwindTest.intersectMethodCall()V (??:-1)
943: org/apache/harmony/test/reliability/vm/stack/Method2Class.Test3()V (??:-1)
944: org/apache/harmony/test/reliability/vm/stack/StackUnwindTest.intersectMethodCall()V (??:-1)
945: org/apache/harmony/test/reliability/vm/stack/Method2Class.Test3()V (??:-1)
946: org/apache/harmony/test/reliability/vm/stack/StackUnwindTest.intersectMethodCall()V (??:-1)
947: org/apache/harmony/test/reliability/vm/stack/Method1Class.Test2()V (??:-1)
948: org/apache/harmony/test/reliability/vm/stack/StackUnwindTest.intersectMethodCall()V (??:-1)
949: org/apache/harmony/test/reliability/vm/stack/Method1Class.TestHotInline()V (??:-1)
950: org/apache/harmony/test/reliability/vm/stack/StackUnwindTest.intersectMethodCall()V (??:-1)
951: org/apache/harmony/test/reliability/vm/stack/Method3Class.Test3()V (??:-1)
952: org/apache/harmony/test/reliability/vm/stack/Method3Class.Test2()V (??:-1)
953: org/apache/harmony/test/reliability/vm/stack/StackUnwindTest.intersectMethodCall()V (??:-1)
954: org/apache/harmony/test/reliability/vm/stack/Method1Class.TestHotInline()V (??:-1)
955: org/apache/harmony/test/reliability/vm/stack/StackUnwindTest.intersectMethodCall()V (??:-1)
956: org/apache/harmony/test/reliability/vm/stack/Method2Class.Test1()V (??:-1)
957: org/apache/harmony/test/reliability/vm/stack/StackUnwindTest.intersectMethodCall()V (??:-1)
958: org/apache/harmony/test/reliability/vm/stack/Method3Class.TestHotInline()V (??:-1)
959: org/apache/harmony/test/reliability/vm/stack/StackUnwindTest.intersectMethodCall()V (??:-1)
960: org/apache/harmony/test/reliability/vm/stack/Method3Class.Test3()V (??:-1)
961: org/apache/harmony/test/reliability/vm/stack/Method3Class.Test2()V (??:-1)
962: org/apache/harmony/test/reliability/vm/stack/StackUnwindTest.intersectMethodCall()V (??:-1)
963: org/apache/harmony/test/reliability/vm/stack/Method2Class.Test2()V (??:-1)
964: org/apache/harmony/test/reliability/vm/stack/StackUnwindTest.intersectMethodCall()V (??:-1)
965: org/apache/harmony/test/reliability/vm/stack/Method1Class.Test3()V (??:-1)
966: org/apache/harmony/test/reliability/vm/stack/StackUnwindTest.intersectMethodCall()V (??:-1)
967: org/apache/harmony/test/reliability/vm/stack/Method3Class.Test3()V (??:-1)
968: org/apache/harmony/test/reliability/vm/stack/Method3Class.Test2()V (??:-1)
969: org/apache/harmony/test/reliability/vm/stack/Method3Class.Test1()V (??:-1)
970: org/apache/harmony/test/reliability/vm/stack/StackUnwindTest.intersectMethodCall()V (??:-1)
971: org/apache/harmony/test/reliability/vm/stack/Method3Class.Test3()V (??:-1)
972: org/apache/harmony/test/reliability/vm/stack/Method3Class.Test2()V (??:-1)
973: org/apache/harmony/test/reliability/vm/stack/StackUnwindTest.intersectMethodCall()V (??:-1)
974: org/apache/harmony/test/reliability/vm/stack/Method3Class.TestHotInline()V (??:-1)
975: org/apache/harmony/test/reliability/vm/stack/StackUnwindTest.intersectMethodCall()V (??:-1)
976: org/apache/harmony/test/reliability/vm/stack/Method1Class.Test3()V (??:-1)
977: org/apache/harmony/test/reliability/vm/stack/StackUnwindTest.intersectMethodCall()V (??:-1)
978: org/apache/harmony/test/reliability/vm/stack/Method1Class.Test3()V (??:-1)
979: org/apache/harmony/test/reliability/vm/stack/StackUnwindTest.intersectMethodCall()V (??:-1)
980: org/apache/harmony/test/reliability/vm/stack/Method3Class.TestHotInline()V (??:-1)
981: org/apache/harmony/test/reliability/vm/stack/StackUnwindTest.intersectMethodCall()V (??:-1)
982: org/apache/harmony/test/reliability/vm/stack/Method2Class.TestHotInline()V (??:-1)
983: org/apache/harmony/test/reliability/vm/stack/StackUnwindTest.intersectMethodCall()V (??:-1)
984: org/apache/harmony/test/reliability/vm/stack/Method3Class.TestHotInline()V (??:-1)
985: org/apache/harmony/test/reliability/vm/stack/StackUnwindTest.intersectMethodCall()V (??:-1)
986: org/apache/harmony/test/reliability/vm/stack/Method2Class.Test2()V (??:-1)
987: org/apache/harmony/test/reliability/vm/stack/StackUnwindTest.intersectMethodCall()V (??:-1)
988: org/apache/harmony/test/reliability/vm/stack/Method1Class.Test1()V (??:-1)
989: org/apache/harmony/test/reliability/vm/stack/StackUnwindTest.intersectMethodCall()V (??:-1)
990: org/apache/harmony/test/reliability/vm/stack/Method2Class.Test1()V (??:-1)
991: org/apache/harmony/test/reliability/vm/stack/StackUnwindTest.intersectMethodCall()V (??:-1)
992: org/apache/harmony/test/reliability/vm/stack/Method2Class.Test1()V (??:-1)
993: org/apache/harmony/test/reliability/vm/stack/StackUnwindTest.intersectMethodCall()V (??:-1)
994: org/apache/harmony/test/reliability/vm/stack/Method2Class.Test1()V (??:-1)
995: org/apache/harmony/test/reliability/vm/stack/StackUnwindTest.intersectMethodCall()V (??:-1)
996: org/apache/harmony/test/reliability/vm/stack/Method3Class.Test3()V (??:-1)
997: org/apache/harmony/test/reliability/vm/stack/Method3Class.Test2()V (??:-1)
998: org/apache/harmony/test/reliability/vm/stack/StackUnwindTest.intersectMethodCall()V (??:-1)
999: org/apache/harmony/test/reliability/vm/stack/Method2Class.Test3()V (??:-1)
1000: org/apache/harmony/test/reliability/vm/stack/StackUnwindTest.intersectMethodCall()V (??:-1)
1001: org/apache/harmony/test/reliability/vm/stack/Method1Class.Test3()V (??:-1)
1002: org/apache/harmony/test/reliability/vm/stack/StackUnwindTest.intersectMethodCall()V (??:-1)
1003: org/apache/harmony/test/reliability/vm/stack/Method3Class.Test3()V (??:-1)
1004: org/apache/harmony/test/reliability/vm/stack/StackUnwindTest.intersectMethodCall()V (??:-1)
1005: org/apache/harmony/test/reliability/vm/stack/Method2Class.Test1()V (??:-1)
1006: org/apache/harmony/test/reliability/vm/stack/StackUnwindTest.intersectMethodCall()V (??:-1)
1007: org/apache/harmony/test/reliability/vm/stack/Method1Class.Test2()V (??:-1)
1008: org/apache/harmony/test/reliability/vm/stack/StackUnwindTest.intersectMethodCall()V (??:-1)
1009: org/apache/harmony/test/reliability/vm/stack/Method2Class.Test2()V (??:-1)
1010: org/apache/harmony/test/reliability/vm/stack/StackUnwindTest.intersectMethodCall()V (??:-1)
1011: org/apache/harmony/test/reliability/vm/stack/Method1Class.Test3()V (??:-1)
1012: org/apache/harmony/test/reliability/vm/stack/StackUnwindTest.intersectMethodCall()V (??:-1)
1013: org/apache/harmony/test/reliability/vm/stack/Method3Class.Test3()V (??:-1)
1014: org/apache/harmony/test/reliability/vm/stack/Method3Class.Test2()V (??:-1)
1015: org/apache/harmony/test/reliability/vm/stack/StackUnwindTest.intersectMethodCall()V (??:-1)
1016: org/apache/harmony/test/reliability/vm/stack/Method2Class.Test2()V (??:-1)
1017: org/apache/harmony/test/reliability/vm/stack/StackUnwindTest.intersectMethodCall()V (??:-1)
1018: org/apache/harmony/test/reliability/vm/stack/Method2Class.Test2()V (??:-1)
1019: org/apache/harmony/test/reliability/vm/stack/StackUnwindTest.intersectMethodCall()V (??:-1)
1020: org/apache/harmony/test/reliability/vm/stack/Method2Class.TestHotInline()V (??:-1)
1021: org/apache/harmony/test/reliability/vm/stack/StackUnwindTest.intersectMethodCall()V (??:-1)
1022: org/apache/harmony/test/reliability/vm/stack/Method2Class.Test1()V (??:-1)
1023: org/apache/harmony/test/reliability/vm/stack/StackUnwindTest.intersectMethodCall()V (??:-1)
1024: org/apache/harmony/test/reliability/vm/stack/Method2Class.TestHotInline()V (??:-1)
1025: org/apache/harmony/test/reliability/vm/stack/StackUnwindTest.intersectMethodCall()V (??:-1)
1026: org/apache/harmony/test/reliability/vm/stack/Method3Class.Test3()V (??:-1)
1027: org/apache/harmony/test/reliability/vm/stack/StackUnwindTest.intersectMethodCall()V (??:-1)
1028: org/apache/harmony/test/reliability/vm/stack/Method3Class.TestHotInline()V (??:-1)
1029: org/apache/harmony/test/reliability/vm/stack/StackUnwindTest.intersectMethodCall()V (??:-1)
1030: org/apache/harmony/test/reliability/vm/stack/Method3Class.TestHotInline()V (??:-1)
1031: org/apache/harmony/test/reliability/vm/stack/StackUnwindTest.intersectMethodCall()V (??:-1)
1032: org/apache/harmony/test/reliability/vm/stack/Method2Class.Test3()V (??:-1)
1033: org/apache/harmony/test/reliability/vm/stack/StackUnwindTest.intersectMethodCall()V (??:-1)
1034: org/apache/harmony/test/reliability/vm/stack/Method1Class.Test3()V (??:-1)
1035: org/apache/harmony/test/reliability/vm/stack/StackUnwindTest.intersectMethodCall()V (??:-1)
1036: org/apache/harmony/test/reliability/vm/stack/Method2Class.TestHotInline()V (??:-1)
1037: org/apache/harmony/test/reliability/vm/stack/StackUnwindTest.intersectMethodCall()V (??:-1)
1038: org/apache/harmony/test/reliability/vm/stack/Method3Class.Test3()V (??:-1)
1039: org/apache/harmony/test/reliability/vm/stack/Method3Class.Test2()V (??:-1)
1040: org/apache/harmony/test/reliability/vm/stack/Method3Class.Test1()V (??:-1)
1041: org/apache/harmony/test/reliability/vm/stack/StackUnwindTest.intersectMethodCall()V (??:-1)
1042: org/apache/harmony/test/reliability/vm/stack/Method2Class.Test2()V (??:-1)
1043: org/apache/harmony/test/reliability/vm/stack/StackUnwindTest.intersectMethodCall()V (??:-1)
1044: org/apache/harmony/test/reliability/vm/stack/Method2Class.Test3()V (??:-1)
1045: org/apache/harmony/test/reliability/vm/stack/StackUnwindTest.intersectMethodCall()V (??:-1)
1046: org/apache/harmony/test/reliability/vm/stack/Method1Class.Test3()V (??:-1)
1047: org/apache/harmony/test/reliability/vm/stack/StackUnwindTest.intersectMethodCall()V (??:-1)
1048: org/apache/harmony/test/reliability/vm/stack/Method1Class.Test1()V (??:-1)
1049: org/apache/harmony/test/reliability/vm/stack/StackUnwindTest.intersectMethodCall()V (??:-1)
1050: org/apache/harmony/test/reliability/vm/stack/Method3Class.Test3()V (??:-1)
1051: org/apache/harmony/test/reliability/vm/stack/Method3Class.Test2()V (??:-1)
1052: org/apache/harmony/test/reliability/vm/stack/StackUnwindTest.intersectMethodCall()V (??:-1)
1053: org/apache/harmony/test/reliability/vm/stack/Method3Class.Test3()V (??:-1)
1054: org/apache/harmony/test/reliability/vm/stack/Method3Class.Test2()V (??:-1)
1055: org/apache/harmony/test/reliability/vm/stack/StackUnwindTest.intersectMethodCall()V (??:-1)
1056: org/apache/harmony/test/reliability/vm/stack/Method1Class.Test1()V (??:-1)
1057: org/apache/harmony/test/reliability/vm/stack/StackUnwindTest.intersectMethodCall()V (??:-1)
1058: org/apache/harmony/test/reliability/vm/stack/Method3Class.Test3()V (??:-1)
1059: org/apache/harmony/test/reliability/vm/stack/StackUnwindTest.intersectMethodCall()V (??:-1)
1060: org/apache/harmony/test/reliability/vm/stack/Method3Class.Test3()V (??:-1)
1061: org/apache/harmony/test/reliability/vm/stack/Method3Class.Test2()V (??:-1)
1062: org/apache/harmony/test/reliability/vm/stack/StackUnwindTest.intersectMethodCall()V (??:-1)
1063: org/apache/harmony/test/reliability/vm/stack/Method2Class.TestHotInline()V (??:-1)
1064: org/apache/harmony/test/reliability/vm/stack/StackUnwindTest.intersectMethodCall()V (??:-1)
1065: org/apache/harmony/test/reliability/vm/stack/Method2Class.Test2()V (??:-1)
1066: org/apache/harmony/test/reliability/vm/stack/StackUnwindTest.intersectMethodCall()V (??:-1)
1067: org/apache/harmony/test/reliability/vm/stack/Method3Class.Test3()V (??:-1)
1068: org/apache/harmony/test/reliability/vm/stack/Method3Class.Test2()V (??:-1)
1069: org/apache/harmony/test/reliability/vm/stack/StackUnwindTest.intersectMethodCall()V (??:-1)
1070: org/apache/harmony/test/reliability/vm/stack/Method1Class.Test3()V (??:-1)
1071: org/apache/harmony/test/reliability/vm/stack/StackUnwindTest.intersectMethodCall()V (??:-1)
1072: org/apache/harmony/test/reliability/vm/stack/Method3Class.Test3()V (??:-1)
1073: org/apache/harmony/test/reliability/vm/stack/StackUnwindTest.intersectMethodCall()V (??:-1)
1074: org/apache/harmony/test/reliability/vm/stack/Method2Class.TestHotInline()V (??:-1)
1075: org/apache/harmony/test/reliability/vm/stack/StackUnwindTest.intersectMethodCall()V (??:-1)
1076: org/apache/harmony/test/reliability/vm/stack/Method2Class.Test2()V (??:-1)
1077: org/apache/harmony/test/reliability/vm/stack/StackUnwindTest.intersectMethodCall()V (??:-1)
1078: org/apache/harmony/test/reliability/vm/stack/Method1Class.Test2()V (??:-1)
1079: org/apache/harmony/test/reliability/vm/stack/StackUnwindTest.intersectMethodCall()V (??:-1)
1080: org/apache/harmony/test/reliability/vm/stack/Method3Class.TestHotInline()V (??:-1)
1081: org/apache/harmony/test/reliability/vm/stack/StackUnwindTest.intersectMethodCall()V (??:-1)
1082: org/apache/harmony/test/reliability/vm/stack/Method1Class.Test3()V (??:-1)
1083: org/apache/harmony/test/reliability/vm/stack/StackUnwindTest.intersectMethodCall()V (??:-1)
1084: org/apache/harmony/test/reliability/vm/stack/Method2Class.Test3()V (??:-1)
1085: org/apache/harmony/test/reliability/vm/stack/StackUnwindTest.intersectMethodCall()V (??:-1)
1086: org/apache/harmony/test/reliability/vm/stack/Method2Class.TestHotInline()V (??:-1)
1087: org/apache/harmony/test/reliability/vm/stack/StackUnwindTest.intersectMethodCall()V (??:-1)
1088: org/apache/harmony/test/reliability/vm/stack/Method2Class.Test2()V (??:-1)
1089: org/apache/harmony/test/reliability/vm/stack/StackUnwindTest.intersectMethodCall()V (??:-1)
1090: org/apache/harmony/test/reliability/vm/stack/Method3Class.Test3()V (??:-1)
1091: org/apache/harmony/test/reliability/vm/stack/Method3Class.Test2()V (??:-1)
1092: org/apache/harmony/test/reliability/vm/stack/Method3Class.Test1()V (??:-1)
1093: org/apache/harmony/test/reliability/vm/stack/StackUnwindTest.intersectMethodCall()V (??:-1)
1094: org/apache/harmony/test/reliability/vm/stack/Method2Class.Test1()V (??:-1)
1095: org/apache/harmony/test/reliability/vm/stack/StackUnwindTest.intersectMethodCall()V (??:-1)
1096: org/apache/harmony/test/reliability/vm/stack/Method1Class.Test1()V (??:-1)
1097: org/apache/harmony/test/reliability/vm/stack/StackUnwindTest.intersectMethodCall()V (??:-1)
1098: org/apache/harmony/test/reliability/vm/stack/Method3Class.Test3()V (??:-1)
1099: org/apache/harmony/test/reliability/vm/stack/Method3Class.Test2()V (??:-1)
1100: org/apache/harmony/test/reliability/vm/stack/StackUnwindTest.intersectMethodCall()V (??:-1)
1101: org/apache/harmony/test/reliability/vm/stack/Method1Class.Test3()V (??:-1)
1102: org/apache/harmony/test/reliability/vm/stack/StackUnwindTest.intersectMethodCall()V (??:-1)
1103: org/apache/harmony/test/reliability/vm/stack/Method2Class.Test2()V (??:-1)
1104: org/apache/harmony/test/reliability/vm/stack/StackUnwindTest.intersectMethodCall()V (??:-1)
1105: org/apache/harmony/test/reliability/vm/stack/Method3Class.Test3()V (??:-1)
1106: org/apache/harmony/test/reliability/vm/stack/StackUnwindTest.intersectMethodCall()V (??:-1)
1107: org/apache/harmony/test/reliability/vm/stack/Method3Class.Test3()V (??:-1)
1108: org/apache/harmony/test/reliability/vm/stack/Method3Class.Test2()V (??:-1)
1109: org/apache/harmony/test/reliability/vm/stack/StackUnwindTest.intersectMethodCall()V (??:-1)
1110: org/apache/harmony/test/reliability/vm/stack/Method3Class.Test3()V (??:-1)
1111: org/apache/harmony/test/reliability/vm/stack/Method3Class.Test2()V (??:-1)
1112: org/apache/harmony/test/reliability/vm/stack/Method3Class.Test1()V (??:-1)
1113: org/apache/harmony/test/reliability/vm/stack/StackUnwindTest.intersectMethodCall()V (??:-1)
1114: org/apache/harmony/test/reliability/vm/stack/Method2Class.TestHotInline()V (??:-1)
1115: org/apache/harmony/test/reliability/vm/stack/StackUnwindTest.intersectMethodCall()V (??:-1)
1116: org/apache/harmony/test/reliability/vm/stack/Method3Class.Test3()V (??:-1)
1117: org/apache/harmony/test/reliability/vm/stack/Method3Class.Test2()V (??:-1)
1118: org/apache/harmony/test/reliability/vm/stack/StackUnwindTest.intersectMethodCall()V (??:-1)
1119: org/apache/harmony/test/reliability/vm/stack/Method2Class.Test2()V (??:-1)
1120: org/apache/harmony/test/reliability/vm/stack/StackUnwindTest.intersectMethodCall()V (??:-1)
1121: org/apache/harmony/test/reliability/vm/stack/Method1Class.Test1()V (??:-1)
1122: org/apache/harmony/test/reliability/vm/stack/StackUnwindTest.intersectMethodCall()V (??:-1)
1123: org/apache/harmony/test/reliability/vm/stack/Method2Class.Test2()V (??:-1)
1124: org/apache/harmony/test/reliability/vm/stack/StackUnwindTest.intersectMethodCall()V (??:-1)
1125: org/apache/harmony/test/reliability/vm/stack/Method3Class.TestHotInline()V (??:-1)
1126: org/apache/harmony/test/reliability/vm/stack/StackUnwindTest.intersectMethodCall()V (??:-1)
1127: org/apache/harmony/test/reliability/vm/stack/Method1Class.Test2()V (??:-1)
1128: org/apache/harmony/test/reliability/vm/stack/StackUnwindTest.intersectMethodCall()V (??:-1)
1129: org/apache/harmony/test/reliability/vm/stack/Method2Class.Test3()V (??:-1)
1130: org/apache/harmony/test/reliability/vm/stack/StackUnwindTest.intersectMethodCall()V (??:-1)
1131: org/apache/harmony/test/reliability/vm/stack/Method3Class.Test3()V (??:-1)
1132: org/apache/harmony/test/reliability/vm/stack/Method3Class.Test2()V (??:-1)
1133: org/apache/harmony/test/reliability/vm/stack/StackUnwindTest.intersectMethodCall()V (??:-1)
1134: org/apache/harmony/test/reliability/vm/stack/Method2Class.Test2()V (??:-1)
1135: org/apache/harmony/test/reliability/vm/stack/StackUnwindTest.intersectMethodCall()V (??:-1)
1136: org/apache/harmony/test/reliability/vm/stack/Method2Class.Test3()V (??:-1)
1137: org/apache/harmony/test/reliability/vm/stack/StackUnwindTest.intersectMethodCall()V (??:-1)
1138: org/apache/harmony/test/reliability/vm/stack/Method2Class.Test3()V (??:-1)
1139: org/apache/harmony/test/reliability/vm/stack/StackUnwindTest.intersectMethodCall()V (??:-1)
1140: org/apache/harmony/test/reliability/vm/stack/Method1Class.Test2()V (??:-1)
1141: org/apache/harmony/test/reliability/vm/stack/StackUnwindTest.intersectMethodCall()V (??:-1)
1142: org/apache/harmony/test/reliability/vm/stack/Method1Class.TestHotInline()V (??:-1)
1143: org/apache/harmony/test/reliability/vm/stack/StackUnwindTest.intersectMethodCall()V (??:-1)
1144: org/apache/harmony/test/reliability/vm/stack/Method3Class.Test3()V (??:-1)
1145: org/apache/harmony/test/reliability/vm/stack/Method3Class.Test2()V (??:-1)
1146: org/apache/harmony/test/reliability/vm/stack/Method3Class.Test1()V (??:-1)
1147: org/apache/harmony/test/reliability/vm/stack/StackUnwindTest.intersectMethodCall()V (??:-1)
1148: org/apache/harmony/test/reliability/vm/stack/Method1Class.Test3()V (??:-1)
1149: org/apache/harmony/test/reliability/vm/stack/StackUnwindTest.intersectMethodCall()V (??:-1)
1150: org/apache/harmony/test/reliability/vm/stack/Method2Class.Test3()V (??:-1)
1151: org/apache/harmony/test/reliability/vm/stack/StackUnwindTest.intersectMethodCall()V (??:-1)
1152: org/apache/harmony/test/reliability/vm/stack/Method2Class.Test2()V (??:-1)
1153: org/apache/harmony/test/reliability/vm/stack/StackUnwindTest.intersectMethodCall()V (??:-1)
1154: org/apache/harmony/test/reliability/vm/stack/Method1Class.Test2()V (??:-1)
1155: org/apache/harmony/test/reliability/vm/stack/StackUnwindTest.intersectMethodCall()V (??:-1)
1156: org/apache/harmony/test/reliability/vm/stack/Method1Class.Test3()V (??:-1)
1157: org/apache/harmony/test/reliability/vm/stack/StackUnwindTest.intersectMethodCall()V (??:-1)
1158: org/apache/harmony/test/reliability/vm/stack/Method3Class.TestHotInline()V (??:-1)
1159: org/apache/harmony/test/reliability/vm/stack/StackUnwindTest.intersectMethodCall()V (??:-1)
1160: org/apache/harmony/test/reliability/vm/stack/Method3Class.TestHotInline()V (??:-1)
1161: org/apache/harmony/test/reliability/vm/stack/StackUnwindTest.intersectMethodCall()V (??:-1)
1162: org/apache/harmony/test/reliability/vm/stack/Method3Class.TestHotInline()V (??:-1)
1163: org/apache/harmony/test/reliability/vm/stack/StackUnwindTest.intersectMethodCall()V (??:-1)
1164: org/apache/harmony/test/reliability/vm/stack/Method3Class.Test3()V (??:-1)
1165: org/apache/harmony/test/reliability/vm/stack/StackUnwindTest.intersectMethodCall()V (??:-1)
1166: org/apache/harmony/test/reliability/vm/stack/Method2Class.Test2()V (??:-1)
1167: org/apache/harmony/test/reliability/vm/stack/StackUnwindTest.intersectMethodCall()V (??:-1)
1168: org/apache/harmony/test/reliability/vm/stack/Method2Class.Test1()V (??:-1)
1169: org/apache/harmony/test/reliability/vm/stack/StackUnwindTest.intersectMethodCall()V (??:-1)
1170: org/apache/harmony/test/reliability/vm/stack/Method1Class.TestHotInline()V (??:-1)
1171: org/apache/harmony/test/reliability/vm/stack/StackUnwindTest.intersectMethodCall()V (??:-1)
1172: org/apache/harmony/test/reliability/vm/stack/Method2Class.TestHotInline()V (??:-1)
1173: org/apache/harmony/test/reliability/vm/stack/StackUnwindTest.intersectMethodCall()V (??:-1)
1174: org/apache/harmony/test/reliability/vm/stack/Method2Class.TestHotInline()V (??:-1)
1175: org/apache/harmony/test/reliability/vm/stack/StackUnwindTest.intersectMethodCall()V (??:-1)
1176: org/apache/harmony/test/reliability/vm/stack/Method1Class.Test3()V (??:-1)
1177: org/apache/harmony/test/reliability/vm/stack/StackUnwindTest.intersectMethodCall()V (??:-1)
1178: org/apache/harmony/test/reliability/vm/stack/Method1Class.Test3()V (??:-1)
1179: org/apache/harmony/test/reliability/vm/stack/StackUnwindTest.intersectMethodCall()V (??:-1)
1180: org/apache/harmony/test/reliability/vm/stack/Method3Class.Test3()V (??:-1)
1181: org/apache/harmony/test/reliability/vm/stack/StackUnwindTest.intersectMethodCall()V (??:-1)
1182: org/apache/harmony/test/reliability/vm/stack/Method2Class.Test2()V (??:-1)
1183: org/apache/harmony/test/reliability/vm/stack/StackUnwindTest.intersectMethodCall()V (??:-1)
1184: org/apache/harmony/test/reliability/vm/stack/Method2Class.TestHotInline()V (??:-1)
1185: org/apache/harmony/test/reliability/vm/stack/StackUnwindTest.intersectMethodCall()V (??:-1)
1186: org/apache/harmony/test/reliability/vm/stack/Method1Class.Test3()V (??:-1)
1187: org/apache/harmony/test/reliability/vm/stack/StackUnwindTest.intersectMethodCall()V (??:-1)
1188: org/apache/harmony/test/reliability/vm/stack/Method2Class.TestHotInline()V (??:-1)
1189: org/apache/harmony/test/reliability/vm/stack/StackUnwindTest.intersectMethodCall()V (??:-1)
1190: org/apache/harmony/test/reliability/vm/stack/Method1Class.TestHotInline()V (??:-1)
1191: org/apache/harmony/test/reliability/vm/stack/StackUnwindTest.intersectMethodCall()V (??:-1)
1192: org/apache/harmony/test/reliability/vm/stack/Method3Class.Test3()V (??:-1)
1193: org/apache/harmony/test/reliability/vm/stack/Method3Class.Test2()V (??:-1)
1194: org/apache/harmony/test/reliability/vm/stack/StackUnwindTest.intersectMethodCall()V (??:-1)
1195: org/apache/harmony/test/reliability/vm/stack/Method1Class.Test3()V (??:-1)
1196: org/apache/harmony/test/reliability/vm/stack/StackUnwindTest.intersectMethodCall()V (??:-1)
1197: org/apache/harmony/test/reliability/vm/stack/Method3Class.Test3()V (??:-1)
1198: org/apache/harmony/test/reliability/vm/stack/Method3Class.Test2()V (??:-1)
1199: org/apache/harmony/test/reliability/vm/stack/StackUnwindTest.intersectMethodCall()V (??:-1)
1200: org/apache/harmony/test/reliability/vm/stack/Method3Class.TestHotInline()V (??:-1)
1201: org/apache/harmony/test/reliability/vm/stack/StackUnwindTest.intersectMethodCall()V (??:-1)
1202: org/apache/harmony/test/reliability/vm/stack/Method2Class.Test3()V (??:-1)
1203: org/apache/harmony/test/reliability/vm/stack/StackUnwindTest.intersectMethodCall()V (??:-1)
1204: org/apache/harmony/test/reliability/vm/stack/Method2Class.Test2()V (??:-1)
1205: org/apache/harmony/test/reliability/vm/stack/StackUnwindTest.intersectMethodCall()V (??:-1)
1206: org/apache/harmony/test/reliability/vm/stack/Method1Class.TestHotInline()V (??:-1)
1207: org/apache/harmony/test/reliability/vm/stack/StackUnwindTest.intersectMethodCall()V (??:-1)
1208: org/apache/harmony/test/reliability/vm/stack/Method3Class.Test3()V (??:-1)
1209: org/apache/harmony/test/reliability/vm/stack/StackUnwindTest.intersectMethodCall()V (??:-1)
1210: org/apache/harmony/test/reliability/vm/stack/Method2Class.Test1()V (??:-1)
1211: org/apache/harmony/test/reliability/vm/stack/StackUnwindTest.intersectMethodCall()V (??:-1)
1212: org/apache/harmony/test/reliability/vm/stack/Method2Class.Test3()V (??:-1)
1213: org/apache/harmony/test/reliability/vm/stack/StackUnwindTest.intersectMethodCall()V (??:-1)
1214: org/apache/harmony/test/reliability/vm/stack/Method2Class.Test1()V (??:-1)
1215: org/apache/harmony/test/reliability/vm/stack/StackUnwindTest.intersectMethodCall()V (??:-1)
1216: org/apache/harmony/test/reliability/vm/stack/Method1Class.Test1()V (??:-1)
1217: org/apache/harmony/test/reliability/vm/stack/StackUnwindTest.intersectMethodCall()V (??:-1)
1218: org/apache/harmony/test/reliability/vm/stack/Method3Class.TestHotInline()V (??:-1)
1219: org/apache/harmony/test/reliability/vm/stack/StackUnwindTest.intersectMethodCall()V (??:-1)
1220: org/apache/harmony/test/reliability/vm/stack/Method1Class.Test2()V (??:-1)
1221: org/apache/harmony/test/reliability/vm/stack/StackUnwindTest.intersectMethodCall()V (??:-1)
1222: org/apache/harmony/test/reliability/vm/stack/Method1Class.TestHotInline()V (??:-1)
1223: org/apache/harmony/test/reliability/vm/stack/StackUnwindTest.intersectMethodCall()V (??:-1)
1224: org/apache/harmony/test/reliability/vm/stack/Method2Class.Test3()V (??:-1)
1225: org/apache/harmony/test/reliability/vm/stack/StackUnwindTest.intersectMethodCall()V (??:-1)
1226: org/apache/harmony/test/reliability/vm/stack/Method2Class.Test2()V (??:-1)
1227: org/apache/harmony/test/reliability/vm/stack/StackUnwindTest.intersectMethodCall()V (??:-1)
1228: org/apache/harmony/test/reliability/vm/stack/Method3Class.TestHotInline()V (??:-1)
1229: org/apache/harmony/test/reliability/vm/stack/StackUnwindTest.intersectMethodCall()V (??:-1)
1230: org/apache/harmony/test/reliability/vm/stack/Method1Class.Test2()V (??:-1)
1231: org/apache/harmony/test/reliability/vm/stack/StackUnwindTest.intersectMethodCall()V (??:-1)
1232: org/apache/harmony/test/reliability/vm/stack/Method2Class.Test2()V (??:-1)
1233: org/apache/harmony/test/reliability/vm/stack/StackUnwindTest.intersectMethodCall()V (??:-1)
1234: org/apache/harmony/test/reliability/vm/stack/Method1Class.Test2()V (??:-1)
1235: org/apache/harmony/test/reliability/vm/stack/StackUnwindTest.intersectMethodCall()V (??:-1)
1236: org/apache/harmony/test/reliability/vm/stack/Method2Class.Test3()V (??:-1)
1237: org/apache/harmony/test/reliability/vm/stack/StackUnwindTest.intersectMethodCall()V (??:-1)
1238: org/apache/harmony/test/reliability/vm/stack/Method3Class.Test3()V (??:-1)
1239: org/apache/harmony/test/reliability/vm/stack/Method3Class.Test2()V (??:-1)
1240: org/apache/harmony/test/reliability/vm/stack/StackUnwindTest.intersectMethodCall()V (??:-1)
1241: org/apache/harmony/test/reliability/vm/stack/Method1Class.Test2()V (??:-1)
1242: org/apache/harmony/test/reliability/vm/stack/StackUnwindTest.intersectMethodCall()V (??:-1)
1243: org/apache/harmony/test/reliability/vm/stack/Method1Class.Test1()V (??:-1)
1244: org/apache/harmony/test/reliability/vm/stack/StackUnwindTest.intersectMethodCall()V (??:-1)
1245: org/apache/harmony/test/reliability/vm/stack/Method1Class.Test3()V (??:-1)
1246: org/apache/harmony/test/reliability/vm/stack/StackUnwindTest.intersectMethodCall()V (??:-1)
1247: org/apache/harmony/test/reliability/vm/stack/Method3Class.Test3()V (??:-1)
1248: org/apache/harmony/test/reliability/vm/stack/Method3Class.Test2()V (??:-1)
1249: org/apache/harmony/test/reliability/vm/stack/StackUnwindTest.intersectMethodCall()V (??:-1)
1250: org/apache/harmony/test/reliability/vm/stack/Method2Class.Test3()V (??:-1)
1251: org/apache/harmony/test/reliability/vm/stack/StackUnwindTest.intersectMethodCall()V (??:-1)
1252: org/apache/harmony/test/reliability/vm/stack/Method1Class.Test2()V (??:-1)
1253: org/apache/harmony/test/reliability/vm/stack/StackUnwindTest.intersectMethodCall()V (??:-1)
1254: org/apache/harmony/test/reliability/vm/stack/Method2Class.Test1()V (??:-1)
1255: org/apache/harmony/test/reliability/vm/stack/StackUnwindTest.intersectMethodCall()V (??:-1)
1256: org/apache/harmony/test/reliability/vm/stack/Method2Class.Test3()V (??:-1)
1257: org/apache/harmony/test/reliability/vm/stack/StackUnwindTest.intersectMethodCall()V (??:-1)
1258: org/apache/harmony/test/reliability/vm/stack/Method2Class.Test2()V (??:-1)
1259: org/apache/harmony/test/reliability/vm/stack/StackUnwindTest.intersectMethodCall()V (??:-1)
1260: org/apache/harmony/test/reliability/vm/stack/Method3Class.Test3()V (??:-1)
1261: org/apache/harmony/test/reliability/vm/stack/Method3Class.Test2()V (??:-1)
1262: org/apache/harmony/test/reliability/vm/stack/StackUnwindTest.intersectMethodCall()V (??:-1)
1263: org/apache/harmony/test/reliability/vm/stack/Method3Class.TestHotInline()V (??:-1)
1264: org/apache/harmony/test/reliability/vm/stack/StackUnwindTest.intersectMethodCall()V (??:-1)
1265: org/apache/harmony/test/reliability/vm/stack/Method2Class.Test2()V (??:-1)
1266: org/apache/harmony/test/reliability/vm/stack/StackUnwindTest.intersectMethodCall()V (??:-1)
1267: org/apache/harmony/test/reliability/vm/stack/Method3Class.Test3()V (??:-1)
1268: org/apache/harmony/test/reliability/vm/stack/Method3Class.Test2()V (??:-1)
1269: org/apache/harmony/test/reliability/vm/stack/StackUnwindTest.intersectMethodCall()V (??:-1)
1270: org/apache/harmony/test/reliability/vm/stack/Method2Class.Test1()V (??:-1)
1271: org/apache/harmony/test/reliability/vm/stack/StackUnwindTest.intersectMethodCall()V (??:-1)
1272: org/apache/harmony/test/reliability/vm/stack/Method3Class.Test3()V (??:-1)
1273: org/apache/harmony/test/reliability/vm/stack/Method3Class.Test2()V (??:-1)
1274: org/apache/harmony/test/reliability/vm/stack/Method3Class.Test1()V (??:-1)
1275: org/apache/harmony/test/reliability/vm/stack/StackUnwindTest.intersectMethodCall()V (??:-1)
1276: org/apache/harmony/test/reliability/vm/stack/Method2Class.TestHotInline()V (??:-1)
1277: org/apache/harmony/test/reliability/vm/stack/StackUnwindTest.intersectMethodCall()V (??:-1)
1278: org/apache/harmony/test/reliability/vm/stack/Method3Class.Test3()V (??:-1)
1279: org/apache/harmony/test/reliability/vm/stack/Method3Class.Test2()V (??:-1)
1280: org/apache/harmony/test/reliability/vm/stack/Method3Class.Test1()V (??:-1)
1281: org/apache/harmony/test/reliability/vm/stack/StackUnwindTest.intersectMethodCall()V (??:-1)
1282: org/apache/harmony/test/reliability/vm/stack/Method1Class.Test1()V (??:-1)
1283: org/apache/harmony/test/reliability/vm/stack/StackUnwindTest.intersectMethodCall()V (??:-1)
1284: org/apache/harmony/test/reliability/vm/stack/Method3Class.Test3()V (??:-1)
1285: org/apache/harmony/test/reliability/vm/stack/Method3Class.Test2()V (??:-1)
1286: org/apache/harmony/test/reliability/vm/stack/Method3Class.Test1()V (??:-1)
1287: org/apache/harmony/test/reliability/vm/stack/StackUnwindTest.intersectMethodCall()V (??:-1)
1288: org/apache/harmony/test/reliability/vm/stack/Method3Class.Test3()V (??:-1)
1289: org/apache/harmony/test/reliability/vm/stack/StackUnwindTest.intersectMethodCall()V (??:-1)
1290: org/apache/harmony/test/reliability/vm/stack/Method2Class.Test2()V (??:-1)
1291: org/apache/harmony/test/reliability/vm/stack/StackUnwindTest.intersectMethodCall()V (??:-1)
1292: org/apache/harmony/test/reliability/vm/stack/Method1Class.Test2()V (??:-1)
1293: org/apache/harmony/test/reliability/vm/stack/StackUnwindTest.intersectMethodCall()V (??:-1)
1294: org/apache/harmony/test/reliability/vm/stack/Method2Class.TestHotInline()V (??:-1)
1295: org/apache/harmony/test/reliability/vm/stack/StackUnwindTest.intersectMethodCall()V (??:-1)
1296: org/apache/harmony/test/reliability/vm/stack/Method2Class.Test2()V (??:-1)
1297: org/apache/harmony/test/reliability/vm/stack/StackUnwindTest.intersectMethodCall()V (??:-1)
1298: org/apache/harmony/test/reliability/vm/stack/Method1Class.TestHotInline()V (??:-1)
1299: org/apache/harmony/test/reliability/vm/stack/StackUnwindTest.intersectMethodCall()V (??:-1)
1300: org/apache/harmony/test/reliability/vm/stack/Method3Class.Test3()V (??:-1)
1301: org/apache/harmony/test/reliability/vm/stack/StackUnwindTest.intersectMethodCall()V (??:-1)
1302: org/apache/harmony/test/reliability/vm/stack/Method1Class.TestHotInline()V (??:-1)
1303: org/apache/harmony/test/reliability/vm/stack/StackUnwindTest.intersectMethodCall()V (??:-1)
1304: org/apache/harmony/test/reliability/vm/stack/Method1Class.Test2()V (??:-1)
1305: org/apache/harmony/test/reliability/vm/stack/StackUnwindTest.intersectMethodCall()V (??:-1)
1306: org/apache/harmony/test/reliability/vm/stack/Method1Class.Test3()V (??:-1)
1307: org/apache/harmony/test/reliability/vm/stack/StackUnwindTest.intersectMethodCall()V (??:-1)
1308: org/apache/harmony/test/reliability/vm/stack/Method1Class.Test2()V (??:-1)
1309: org/apache/harmony/test/reliability/vm/stack/StackUnwindTest.intersectMethodCall()V (??:-1)
1310: org/apache/harmony/test/reliability/vm/stack/Method2Class.Test1()V (??:-1)
1311: org/apache/harmony/test/reliability/vm/stack/StackUnwindTest.intersectMethodCall()V (??:-1)
1312: org/apache/harmony/test/reliability/vm/stack/Method2Class.TestHotInline()V (??:-1)
1313: org/apache/harmony/test/reliability/vm/stack/StackUnwindTest.intersectMethodCall()V (??:-1)
1314: org/apache/harmony/test/reliability/vm/stack/Method1Class.TestHotInline()V (??:-1)
1315: org/apache/harmony/test/reliability/vm/stack/StackUnwindTest.intersectMethodCall()V (??:-1)
1316: org/apache/harmony/test/reliability/vm/stack/Method1Class.Test3()V (??:-1)
1317: org/apache/harmony/test/reliability/vm/stack/StackUnwindTest.intersectMethodCall()V (??:-1)
1318: org/apache/harmony/test/reliability/vm/stack/Method2Class.Test2()V (??:-1)
1319: org/apache/harmony/test/reliability/vm/stack/StackUnwindTest.intersectMethodCall()V (??:-1)
1320: org/apache/harmony/test/reliability/vm/stack/Method2Class.TestHotInline()V (??:-1)
1321: org/apache/harmony/test/reliability/vm/stack/StackUnwindTest.intersectMethodCall()V (??:-1)
1322: org/apache/harmony/test/reliability/vm/stack/Method1Class.Test3()V (??:-1)
1323: org/apache/harmony/test/reliability/vm/stack/StackUnwindTest.intersectMethodCall()V (??:-1)
1324: org/apache/harmony/test/reliability/vm/stack/Method2Class.Test3()V (??:-1)
1325: org/apache/harmony/test/reliability/vm/stack/StackUnwindTest.intersectMethodCall()V (??:-1)
1326: org/apache/harmony/test/reliability/vm/stack/Method2Class.Test3()V (??:-1)
1327: org/apache/harmony/test/reliability/vm/stack/StackUnwindTest.intersectMethodCall()V (??:-1)
1328: org/apache/harmony/test/reliability/vm/stack/Method1Class.Test3()V (??:-1)
1329: org/apache/harmony/test/reliability/vm/stack/StackUnwindTest.intersectMethodCall()V (??:-1)
1330: org/apache/harmony/test/reliability/vm/stack/Method3Class.TestHotInline()V (??:-1)
1331: org/apache/harmony/test/reliability/vm/stack/StackUnwindTest.intersectMethodCall()V (??:-1)
1332: org/apache/harmony/test/reliability/vm/stack/Method1Class.Test1()V (??:-1)
1333: org/apache/harmony/test/reliability/vm/stack/StackUnwindTest.intersectMethodCall()V (??:-1)
1334: org/apache/harmony/test/reliability/vm/stack/Method3Class.Test3()V (??:-1)
1335: org/apache/harmony/test/reliability/vm/stack/Method3Class.Test2()V (??:-1)
1336: org/apache/harmony/test/reliability/vm/stack/Method3Class.Test1()V (??:-1)
1337: org/apache/harmony/test/reliability/vm/stack/StackUnwindTest.intersectMethodCall()V (??:-1)
1338: org/apache/harmony/test/reliability/vm/stack/Method2Class.Test3()V (??:-1)
1339: org/apache/harmony/test/reliability/vm/stack/StackUnwindTest.intersectMethodCall()V (??:-1)
1340: org/apache/harmony/test/reliability/vm/stack/Method3Class.Test3()V (??:-1)
1341: org/apache/harmony/test/reliability/vm/stack/Method3Class.Test2()V (??:-1)
1342: org/apache/harmony/test/reliability/vm/stack/Method3Class.Test1()V (??:-1)
1343: org/apache/harmony/test/reliability/vm/stack/StackUnwindTest.intersectMethodCall()V (??:-1)
1344: org/apache/harmony/test/reliability/vm/stack/Method3Class.Test3()V (??:-1)
1345: org/apache/harmony/test/reliability/vm/stack/Method3Class.Test2()V (??:-1)
1346: org/apache/harmony/test/reliability/vm/stack/StackUnwindTest.intersectMethodCall()V (??:-1)
1347: org/apache/harmony/test/reliability/vm/stack/Method1Class.Test2()V (??:-1)
1348: org/apache/harmony/test/reliability/vm/stack/StackUnwindTest.intersectMethodCall()V (??:-1)
1349: org/apache/harmony/test/reliability/vm/stack/Method2Class.TestHotInline()V (??:-1)
1350: org/apache/harmony/test/reliability/vm/stack/StackUnwindTest.intersectMethodCall()V (??:-1)
1351: org/apache/harmony/test/reliability/vm/stack/Method3Class.Test3()V (??:-1)
1352: org/apache/harmony/test/reliability/vm/stack/StackUnwindTest.intersectMethodCall()V (??:-1)
1353: org/apache/harmony/test/reliability/vm/stack/Method1Class.Test3()V (??:-1)
1354: org/apache/harmony/test/reliability/vm/stack/StackUnwindTest.intersectMethodCall()V (??:-1)
1355: org/apache/harmony/test/reliability/vm/stack/Method1Class.Test1()V (??:-1)
1356: org/apache/harmony/test/reliability/vm/stack/StackUnwindTest.intersectMethodCall()V (??:-1)
1357: org/apache/harmony/test/reliability/vm/stack/Method1Class.Test1()V (??:-1)
1358: org/apache/harmony/test/reliability/vm/stack/StackUnwindTest.intersectMethodCall()V (??:-1)
1359: org/apache/harmony/test/reliability/vm/stack/Method2Class.Test1()V (??:-1)
1360: org/apache/harmony/test/reliability/vm/stack/StackUnwindTest.intersectMethodCall()V (??:-1)
1361: org/apache/harmony/test/reliability/vm/stack/Method2Class.TestHotInline()V (??:-1)
1362: org/apache/harmony/test/reliability/vm/stack/StackUnwindTest.intersectMethodCall()V (??:-1)
1363: org/apache/harmony/test/reliability/vm/stack/Method3Class.Test3()V (??:-1)
1364: org/apache/harmony/test/reliability/vm/stack/StackUnwindTest.intersectMethodCall()V (??:-1)
1365: org/apache/harmony/test/reliability/vm/stack/Method3Class.Test3()V (??:-1)
1366: org/apache/harmony/test/reliability/vm/stack/Method3Class.Test2()V (??:-1)
1367: org/apache/harmony/test/reliability/vm/stack/StackUnwindTest.intersectMethodCall()V (??:-1)
1368: org/apache/harmony/test/reliability/vm/stack/Method3Class.TestHotInline()V (??:-1)
1369: org/apache/harmony/test/reliability/vm/stack/StackUnwindTest.intersectMethodCall()V (??:-1)
1370: org/apache/harmony/test/reliability/vm/stack/Method2Class.Test3()V (??:-1)
1371: org/apache/harmony/test/reliability/vm/stack/StackUnwindTest.intersectMethodCall()V (??:-1)
1372: org/apache/harmony/test/reliability/vm/stack/Method1Class.TestHotInline()V (??:-1)
1373: org/apache/harmony/test/reliability/vm/stack/StackUnwindTest.intersectMethodCall()V (??:-1)
1374: org/apache/harmony/test/reliability/vm/stack/Method1Class.Test1()V (??:-1)
1375: org/apache/harmony/test/reliability/vm/stack/StackUnwindTest.intersectMethodCall()V (??:-1)
1376: org/apache/harmony/test/reliability/vm/stack/Method2Class.Test3()V (??:-1)
1377: org/apache/harmony/test/reliability/vm/stack/StackUnwindTest.intersectMethodCall()V (??:-1)
1378: org/apache/harmony/test/reliability/vm/stack/Method2Class.Test1()V (??:-1)
1379: org/apache/harmony/test/reliability/vm/stack/StackUnwindTest.intersectMethodCall()V (??:-1)
1380: org/apache/harmony/test/reliability/vm/stack/Method1Class.TestHotInline()V (??:-1)
1381: org/apache/harmony/test/reliability/vm/stack/StackUnwindTest.intersectMethodCall()V (??:-1)
1382: org/apache/harmony/test/reliability/vm/stack/Method2Class.TestHotInline()V (??:-1)
1383: org/apache/harmony/test/reliability/vm/stack/StackUnwindTest.intersectMethodCall()V (??:-1)
1384: org/apache/harmony/test/reliability/vm/stack/Method3Class.Test3()V (??:-1)
1385: org/apache/harmony/test/reliability/vm/stack/Method3Class.Test2()V (??:-1)
1386: org/apache/harmony/test/reliability/vm/stack/Method3Class.Test1()V (??:-1)
1387: org/apache/harmony/test/reliability/vm/stack/StackUnwindTest.intersectMethodCall()V (??:-1)
1388: org/apache/harmony/test/reliability/vm/stack/Method2Class.TestHotInline()V (??:-1)
1389: org/apache/harmony/test/reliability/vm/stack/StackUnwindTest.intersectMethodCall()V (??:-1)
1390: org/apache/harmony/test/reliability/vm/stack/Method3Class.Test3()V (??:-1)
1391: org/apache/harmony/test/reliability/vm/stack/Method3Class.Test2()V (??:-1)
1392: org/apache/harmony/test/reliability/vm/stack/Method3Class.Test1()V (??:-1)
1393: org/apache/harmony/test/reliability/vm/stack/StackUnwindTest.intersectMethodCall()V (??:-1)
1394: org/apache/harmony/test/reliability/vm/stack/Method3Class.Test3()V (??:-1)
1395: org/apache/harmony/test/reliability/vm/stack/Method3Class.Test2()V (??:-1)
1396: org/apache/harmony/test/reliability/vm/stack/Method3Class.Test1()V (??:-1)
1397: org/apache/harmony/test/reliability/vm/stack/StackUnwindTest.intersectMethodCall()V (??:-1)
1398: org/apache/harmony/test/reliability/vm/stack/Method2Class.Test2()V (??:-1)
1399: org/apache/harmony/test/reliability/vm/stack/StackUnwindTest.intersectMethodCall()V (??:-1)
1400: org/apache/harmony/test/reliability/vm/stack/Method3Class.Test3()V (??:-1)
1401: org/apache/harmony/test/reliability/vm/stack/Method3Class.Test2()V (??:-1)
1402: org/apache/harmony/test/reliability/vm/stack/StackUnwindTest.intersectMethodCall()V (??:-1)
1403: org/apache/harmony/test/reliability/vm/stack/Method3Class.Test3()V (??:-1)
1404: org/apache/harmony/test/reliability/vm/stack/StackUnwindTest.intersectMethodCall()V (??:-1)
1405: org/apache/harmony/test/reliability/vm/stack/Method1Class.Test3()V (??:-1)
1406: org/apache/harmony/test/reliability/vm/stack/StackUnwindTest.intersectMethodCall()V (??:-1)
1407: org/apache/harmony/test/reliability/vm/stack/Method1Class.Test1()V (??:-1)
1408: org/apache/harmony/test/reliability/vm/stack/StackUnwindTest.intersectMethodCall()V (??:-1)
1409: org/apache/harmony/test/reliability/vm/stack/Method3Class.Test3()V (??:-1)
1410: org/apache/harmony/test/reliability/vm/stack/Method3Class.Test2()V (??:-1)
1411: org/apache/harmony/test/reliability/vm/stack/StackUnwindTest.intersectMethodCall()V (??:-1)
1412: org/apache/harmony/test/reliability/vm/stack/Method3Class.Test3()V (??:-1)
1413: org/apache/harmony/test/reliability/vm/stack/Method3Class.Test2()V (??:-1)
1414: org/apache/harmony/test/reliability/vm/stack/Method3Class.Test1()V (??:-1)
1415: org/apache/harmony/test/reliability/vm/stack/StackUnwindTest.intersectMethodCall()V (??:-1)
1416: org/apache/harmony/test/reliability/vm/stack/Method1Class.Test2()V (??:-1)
1417: org/apache/harmony/test/reliability/vm/stack/StackUnwindTest.intersectMethodCall()V (??:-1)
1418: org/apache/harmony/test/reliability/vm/stack/Method3Class.Test3()V (??:-1)
1419: org/apache/harmony/test/reliability/vm/stack/Method3Class.Test2()V (??:-1)
1420: org/apache/harmony/test/reliability/vm/stack/Method3Class.Test1()V (??:-1)
1421: org/apache/harmony/test/reliability/vm/stack/StackUnwindTest.intersectMethodCall()V (??:-1)
1422: org/apache/harmony/test/reliability/vm/stack/Method3Class.Test3()V (??:-1)
1423: org/apache/harmony/test/reliability/vm/stack/StackUnwindTest.intersectMethodCall()V (??:-1)
1424: org/apache/harmony/test/reliability/vm/stack/Method3Class.TestHotInline()V (??:-1)
1425: org/apache/harmony/test/reliability/vm/stack/StackUnwindTest.intersectMethodCall()V (??:-1)
1426: org/apache/harmony/test/reliability/vm/stack/Method3Class.TestHotInline()V (??:-1)
1427: org/apache/harmony/test/reliability/vm/stack/StackUnwindTest.intersectMethodCall()V (??:-1)
1428: org/apache/harmony/test/reliability/vm/stack/Method2Class.TestHotInline()V (??:-1)
1429: org/apache/harmony/test/reliability/vm/stack/StackUnwindTest.intersectMethodCall()V (??:-1)
1430: org/apache/harmony/test/reliability/vm/stack/Method3Class.Test3()V (??:-1)
1431: org/apache/harmony/test/reliability/vm/stack/Method3Class.Test2()V (??:-1)
1432: org/apache/harmony/test/reliability/vm/stack/StackUnwindTest.intersectMethodCall()V (??:-1)
1433: org/apache/harmony/test/reliability/vm/stack/Method3Class.Test3()V (??:-1)
1434: org/apache/harmony/test/reliability/vm/stack/Method3Class.Test2()V (??:-1)
1435: org/apache/harmony/test/reliability/vm/stack/Method3Class.Test1()V (??:-1)
1436: org/apache/harmony/test/reliability/vm/stack/StackUnwindTest.intersectMethodCall()V (??:-1)
1437: org/apache/harmony/test/reliability/vm/stack/Method1Class.Test1()V (??:-1)
1438: org/apache/harmony/test/reliability/vm/stack/StackUnwindTest.intersectMethodCall()V (??:-1)
1439: org/apache/harmony/test/reliability/vm/stack/Method1Class.Test3()V (??:-1)
1440: org/apache/harmony/test/reliability/vm/stack/StackUnwindTest.intersectMethodCall()V (??:-1)
1441: org/apache/harmony/test/reliability/vm/stack/Method1Class.TestHotInline()V (??:-1)
1442: org/apache/harmony/test/reliability/vm/stack/StackUnwindTest.intersectMethodCall()V (??:-1)
1443: org/apache/harmony/test/reliability/vm/stack/Method2Class.Test3()V (??:-1)
1444: org/apache/harmony/test/reliability/vm/stack/StackUnwindTest.intersectMethodCall()V (??:-1)
1445: org/apache/harmony/test/reliability/vm/stack/Method1Class.Test2()V (??:-1)
1446: org/apache/harmony/test/reliability/vm/stack/StackUnwindTest.intersectMethodCall()V (??:-1)
1447: org/apache/harmony/test/reliability/vm/stack/Method1Class.Test2()V (??:-1)
1448: org/apache/harmony/test/reliability/vm/stack/StackUnwindTest.intersectMethodCall()V (??:-1)
1449: org/apache/harmony/test/reliability/vm/stack/Method2Class.Test3()V (??:-1)
1450: org/apache/harmony/test/reliability/vm/stack/StackUnwindTest.intersectMethodCall()V (??:-1)
1451: org/apache/harmony/test/reliability/vm/stack/Method1Class.Test2()V (??:-1)
1452: org/apache/harmony/test/reliability/vm/stack/StackUnwindTest.intersectMethodCall()V (??:-1)
1453: org/apache/harmony/test/reliability/vm/stack/Method1Class.Test1()V (??:-1)
1454: org/apache/harmony/test/reliability/vm/stack/StackUnwindTest.intersectMethodCall()V (??:-1)
1455: org/apache/harmony/test/reliability/vm/stack/Method3Class.Test3()V (??:-1)
1456: org/apache/harmony/test/reliability/vm/stack/Method3Class.Test2()V (??:-1)
1457: org/apache/harmony/test/reliability/vm/stack/Method3Class.Test1()V (??:-1)
1458: org/apache/harmony/test/reliability/vm/stack/StackUnwindTest.intersectMethodCall()V (??:-1)
1459: org/apache/harmony/test/reliability/vm/stack/Method2Class.Test3()V (??:-1)
1460: org/apache/harmony/test/reliability/vm/stack/StackUnwindTest.intersectMethodCall()V (??:-1)
1461: org/apache/harmony/test/reliability/vm/stack/Method1Class.TestHotInline()V (??:-1)
1462: org/apache/harmony/test/reliability/vm/stack/StackUnwindTest.intersectMethodCall()V (??:-1)
1463: org/apache/harmony/test/reliability/vm/stack/Method2Class.TestHotInline()V (??:-1)
1464: org/apache/harmony/test/reliability/vm/stack/StackUnwindTest.intersectMethodCall()V (??:-1)
1465: org/apache/harmony/test/reliability/vm/stack/Method2Class.Test3()V (??:-1)
1466: org/apache/harmony/test/reliability/vm/stack/StackUnwindTest.intersectMethodCall()V (??:-1)
1467: org/apache/harmony/test/reliability/vm/stack/Method3Class.Test3()V (??:-1)
1468: org/apache/harmony/test/reliability/vm/stack/Method3Class.Test2()V (??:-1)
1469: org/apache/harmony/test/reliability/vm/stack/StackUnwindTest.intersectMethodCall()V (??:-1)
1470: org/apache/harmony/test/reliability/vm/stack/Method3Class.TestHotInline()V (??:-1)
1471: org/apache/harmony/test/reliability/vm/stack/StackUnwindTest.intersectMethodCall()V (??:-1)
1472: org/apache/harmony/test/reliability/vm/stack/Method1Class.Test2()V (??:-1)
1473: org/apache/harmony/test/reliability/vm/stack/StackUnwindTest.intersectMethodCall()V (??:-1)
1474: org/apache/harmony/test/reliability/vm/stack/Method3Class.TestHotInline()V (??:-1)
1475: org/apache/harmony/test/reliability/vm/stack/StackUnwindTest.intersectMethodCall()V (??:-1)
1476: org/apache/harmony/test/reliability/vm/stack/Method1Class.Test3()V (??:-1)
1477: org/apache/harmony/test/reliability/vm/stack/StackUnwindTest.intersectMethodCall()V (??:-1)
1478: org/apache/harmony/test/reliability/vm/stack/Method1Class.Test2()V (??:-1)
1479: org/apache/harmony/test/reliability/vm/stack/StackUnwindTest.intersectMethodCall()V (??:-1)
1480: org/apache/harmony/test/reliability/vm/stack/Method1Class.Test2()V (??:-1)
1481: org/apache/harmony/test/reliability/vm/stack/StackUnwindTest.intersectMethodCall()V (??:-1)
1482: org/apache/harmony/test/reliability/vm/stack/Method3Class.Test3()V (??:-1)
1483: org/apache/harmony/test/reliability/vm/stack/Method3Class.Test2()V (??:-1)
1484: org/apache/harmony/test/reliability/vm/stack/StackUnwindTest.intersectMethodCall()V (??:-1)
1485: org/apache/harmony/test/reliability/vm/stack/Method2Class.TestHotInline()V (??:-1)
1486: org/apache/harmony/test/reliability/vm/stack/StackUnwindTest.intersectMethodCall()V (??:-1)
1487: org/apache/harmony/test/reliability/vm/stack/Method1Class.TestHotInline()V (??:-1)
1488: org/apache/harmony/test/reliability/vm/stack/StackUnwindTest.intersectMethodCall()V (??:-1)
1489: org/apache/harmony/test/reliability/vm/stack/Method3Class.Test3()V (??:-1)
1490: org/apache/harmony/test/reliability/vm/stack/Method3Class.Test2()V (??:-1)
1491: org/apache/harmony/test/reliability/vm/stack/Method3Class.Test1()V (??:-1)
1492: org/apache/harmony/test/reliability/vm/stack/StackUnwindTest.intersectMethodCall()V (??:-1)
1493: org/apache/harmony/test/reliability/vm/stack/Method2Class.TestHotInline()V (??:-1)
1494: org/apache/harmony/test/reliability/vm/stack/StackUnwindTest.intersectMethodCall()V (??:-1)
1495: org/apache/harmony/test/reliability/vm/stack/Method3Class.Test3()V (??:-1)
1496: org/apache/harmony/test/reliability/vm/stack/Method3Class.Test2()V (??:-1)
1497: org/apache/harmony/test/reliability/vm/stack/Method3Class.Test1()V (??:-1)
1498: org/apache/harmony/test/reliability/vm/stack/StackUnwindTest.intersectMethodCall()V (??:-1)
1499: org/apache/harmony/test/reliability/vm/stack/Method2Class.Test2()V (??:-1)
1500: org/apache/harmony/test/reliability/vm/stack/StackUnwindTest.intersectMethodCall()V (??:-1)
1501: org/apache/harmony/test/reliability/vm/stack/Method1Class.Test1()V (??:-1)
1502: org/apache/harmony/test/reliability/vm/stack/StackUnwindTest.intersectMethodCall()V (??:-1)
1503: org/apache/harmony/test/reliability/vm/stack/Method2Class.Test2()V (??:-1)
1504: org/apache/harmony/test/reliability/vm/stack/StackUnwindTest.intersectMethodCall()V (??:-1)
1505: org/apache/harmony/test/reliability/vm/stack/Method1Class.Test2()V (??:-1)
1506: org/apache/harmony/test/reliability/vm/stack/StackUnwindTest.intersectMethodCall()V (??:-1)
1507: org/apache/harmony/test/reliability/vm/stack/Method1Class.TestHotInline()V (??:-1)
1508: org/apache/harmony/test/reliability/vm/stack/StackUnwindTest.intersectMethodCall()V (??:-1)
1509: org/apache/harmony/test/reliability/vm/stack/Method2Class.Test3()V (??:-1)
1510: org/apache/harmony/test/reliability/vm/stack/StackUnwindTest.intersectMethodCall()V (??:-1)
1511: org/apache/harmony/test/reliability/vm/stack/Method3Class.Test3()V (??:-1)
1512: org/apache/harmony/test/reliability/vm/stack/Method3Class.Test2()V (??:-1)
1513: org/apache/harmony/test/reliability/vm/stack/StackUnwindTest.intersectMethodCall()V (??:-1)
1514: org/apache/harmony/test/reliability/vm/stack/Method3Class.Test3()V (??:-1)
1515: org/apache/harmony/test/reliability/vm/stack/StackUnwindTest.intersectMethodCall()V (??:-1)
1516: org/apache/harmony/test/reliability/vm/stack/Method2Class.Test2()V (??:-1)
1517: org/apache/harmony/test/reliability/vm/stack/StackUnwindTest.intersectMethodCall()V (??:-1)
1518: org/apache/harmony/test/reliability/vm/stack/Method2Class.Test1()V (??:-1)
1519: org/apache/harmony/test/reliability/vm/stack/StackUnwindTest.intersectMethodCall()V (??:-1)
1520: org/apache/harmony/test/reliability/vm/stack/Method2Class.Test1()V (??:-1)
1521: org/apache/harmony/test/reliability/vm/stack/StackUnwindTest.intersectMethodCall()V (??:-1)
1522: org/apache/harmony/test/reliability/vm/stack/Method3Class.Test3()V (??:-1)
1523: org/apache/harmony/test/reliability/vm/stack/Method3Class.Test2()V (??:-1)
1524: org/apache/harmony/test/reliability/vm/stack/StackUnwindTest.intersectMethodCall()V (??:-1)
1525: org/apache/harmony/test/reliability/vm/stack/Method3Class.Test3()V (??:-1)
1526: org/apache/harmony/test/reliability/vm/stack/Method3Class.Test2()V (??:-1)
1527: org/apache/harmony/test/reliability/vm/stack/StackUnwindTest.intersectMethodCall()V (??:-1)
1528: org/apache/harmony/test/reliability/vm/stack/Method1Class.Test3()V (??:-1)
1529: org/apache/harmony/test/reliability/vm/stack/StackUnwindTest.intersectMethodCall()V (??:-1)
1530: org/apache/harmony/test/reliability/vm/stack/Method3Class.Test3()V (??:-1)
1531: org/apache/harmony/test/reliability/vm/stack/Method3Class.Test2()V (??:-1)
1532: org/apache/harmony/test/reliability/vm/stack/StackUnwindTest.intersectMethodCall()V (??:-1)
1533: org/apache/harmony/test/reliability/vm/stack/Method3Class.TestHotInline()V (??:-1)
1534: org/apache/harmony/test/reliability/vm/stack/StackUnwindTest.intersectMethodCall()V (??:-1)
1535: org/apache/harmony/test/reliability/vm/stack/Method3Class.Test3()V (??:-1)
1536: org/apache/harmony/test/reliability/vm/stack/Method3Class.Test2()V (??:-1)
1537: org/apache/harmony/test/reliability/vm/stack/StackUnwindTest.intersectMethodCall()V (??:-1)
1538: org/apache/harmony/test/reliability/vm/stack/Method3Class.Test3()V (??:-1)
1539: org/apache/harmony/test/reliability/vm/stack/Method3Class.Test2()V (??:-1)
1540: org/apache/harmony/test/reliability/vm/stack/Method3Class.Test1()V (??:-1)
1541: org/apache/harmony/test/reliability/vm/stack/StackUnwindTest.intersectMethodCall()V (??:-1)
1542: org/apache/harmony/test/reliability/vm/stack/Method2Class.Test1()V (??:-1)
1543: org/apache/harmony/test/reliability/vm/stack/StackUnwindTest.intersectMethodCall()V (??:-1)
1544: org/apache/harmony/test/reliability/vm/stack/Method3Class.Test3()V (??:-1)
1545: org/apache/harmony/test/reliability/vm/stack/Method3Class.Test2()V (??:-1)
1546: org/apache/harmony/test/reliability/vm/stack/Method3Class.Test1()V (??:-1)
1547: org/apache/harmony/test/reliability/vm/stack/StackUnwindTest.intersectMethodCall()V (??:-1)
1548: org/apache/harmony/test/reliability/vm/stack/Method3Class.Test3()V (??:-1)
1549: org/apache/harmony/test/reliability/vm/stack/Method3Class.Test2()V (??:-1)
1550: org/apache/harmony/test/reliability/vm/stack/StackUnwindTest.intersectMethodCall()V (??:-1)
1551: org/apache/harmony/test/reliability/vm/stack/Method3Class.Test3()V (??:-1)
1552: org/apache/harmony/test/reliability/vm/stack/Method3Class.Test2()V (??:-1)
1553: org/apache/harmony/test/reliability/vm/stack/StackUnwindTest.intersectMethodCall()V (??:-1)
1554: org/apache/harmony/test/reliability/vm/stack/Method3Class.Test3()V (??:-1)
1555: org/apache/harmony/test/reliability/vm/stack/StackUnwindTest.intersectMethodCall()V (??:-1)
1556: org/apache/harmony/test/reliability/vm/stack/Method1Class.TestHotInline()V (??:-1)
1557: org/apache/harmony/test/reliability/vm/stack/StackUnwindTest.intersectMethodCall()V (??:-1)
1558: org/apache/harmony/test/reliability/vm/stack/Method3Class.TestHotInline()V (??:-1)
1559: org/apache/harmony/test/reliability/vm/stack/StackUnwindTest.intersectMethodCall()V (??:-1)
1560: org/apache/harmony/test/reliability/vm/stack/Method1Class.TestHotInline()V (??:-1)
1561: org/apache/harmony/test/reliability/vm/stack/StackUnwindTest.intersectMethodCall()V (??:-1)
1562: org/apache/harmony/test/reliability/vm/stack/Method1Class.Test3()V (??:-1)
1563: org/apache/harmony/test/reliability/vm/stack/StackUnwindTest.intersectMethodCall()V (??:-1)
1564: org/apache/harmony/test/reliability/vm/stack/Method1Class.Test3()V (??:-1)
1565: org/apache/harmony/test/reliability/vm/stack/StackUnwindTest.intersectMethodCall()V (??:-1)
1566: org/apache/harmony/test/reliability/vm/stack/Method1Class.Test1()V (??:-1)
1567: org/apache/harmony/test/reliability/vm/stack/StackUnwindTest.intersectMethodCall()V (??:-1)
1568: org/apache/harmony/test/reliability/vm/stack/Method2Class.Test2()V (??:-1)
1569: org/apache/harmony/test/reliability/vm/stack/StackUnwindTest.intersectMethodCall()V (??:-1)
1570: org/apache/harmony/test/reliability/vm/stack/Method1Class.Test1()V (??:-1)
1571: org/apache/harmony/test/reliability/vm/stack/StackUnwindTest.intersectMethodCall()V (??:-1)
1572: org/apache/harmony/test/reliability/vm/stack/Method1Class.Test1()V (??:-1)
1573: org/apache/harmony/test/reliability/vm/stack/StackUnwindTest.intersectMethodCall()V (??:-1)
1574: org/apache/harmony/test/reliability/vm/stack/Method3Class.Test3()V (??:-1)
1575: org/apache/harmony/test/reliability/vm/stack/StackUnwindTest.intersectMethodCall()V (??:-1)
1576: org/apache/harmony/test/reliability/vm/stack/Method1Class.Test2()V (??:-1)
1577: org/apache/harmony/test/reliability/vm/stack/StackUnwindTest.intersectMethodCall()V (??:-1)
1578: org/apache/harmony/test/reliability/vm/stack/Method2Class.Test2()V (??:-1)
1579: org/apache/harmony/test/reliability/vm/stack/StackUnwindTest.intersectMethodCall()V (??:-1)
1580: org/apache/harmony/test/reliability/vm/stack/Method1Class.Test2()V (??:-1)
1581: org/apache/harmony/test/reliability/vm/stack/StackUnwindTest.intersectMethodCall()V (??:-1)
1582: org/apache/harmony/test/reliability/vm/stack/Method3Class.Test3()V (??:-1)
1583: org/apache/harmony/test/reliability/vm/stack/Method3Class.Test2()V (??:-1)
1584: org/apache/harmony/test/reliability/vm/stack/StackUnwindTest.intersectMethodCall()V (??:-1)
1585: org/apache/harmony/test/reliability/vm/stack/Method2Class.Test3()V (??:-1)
1586: org/apache/harmony/test/reliability/vm/stack/StackUnwindTest.intersectMethodCall()V (??:-1)
1587: org/apache/harmony/test/reliability/vm/stack/Method2Class.Test1()V (??:-1)
1588: org/apache/harmony/test/reliability/vm/stack/StackUnwindTest.intersectMethodCall()V (??:-1)
1589: org/apache/harmony/test/reliability/vm/stack/Method1Class.Test1()V (??:-1)
1590: org/apache/harmony/test/reliability/vm/stack/StackUnwindTest.intersectMethodCall()V (??:-1)
1591: org/apache/harmony/test/reliability/vm/stack/Method1Class.Test1()V (??:-1)
1592: org/apache/harmony/test/reliability/vm/stack/StackUnwindTest.intersectMethodCall()V (??:-1)
1593: org/apache/harmony/test/reliability/vm/stack/Method1Class.TestHotInline()V (??:-1)
1594: org/apache/harmony/test/reliability/vm/stack/StackUnwindTest.intersectMethodCall()V (??:-1)
1595: org/apache/harmony/test/reliability/vm/stack/Method2Class.Test3()V (??:-1)
1596: org/apache/harmony/test/reliability/vm/stack/StackUnwindTest.intersectMethodCall()V (??:-1)
1597: org/apache/harmony/test/reliability/vm/stack/Method1Class.TestHotInline()V (??:-1)
1598: org/apache/harmony/test/reliability/vm/stack/StackUnwindTest.intersectMethodCall()V (??:-1)
1599: org/apache/harmony/test/reliability/vm/stack/Method2Class.Test1()V (??:-1)
1600: org/apache/harmony/test/reliability/vm/stack/StackUnwindTest.intersectMethodCall()V (??:-1)
1601: org/apache/harmony/test/reliability/vm/stack/Method1Class.Test1()V (??:-1)
1602: org/apache/harmony/test/reliability/vm/stack/StackUnwindTest.intersectMethodCall()V (??:-1)
1603: org/apache/harmony/test/reliability/vm/stack/Method2Class.Test1()V (??:-1)
1604: org/apache/harmony/test/reliability/vm/stack/StackUnwindTest.intersectMethodCall()V (??:-1)
1605: org/apache/harmony/test/reliability/vm/stack/Method3Class.Test3()V (??:-1)
1606: org/apache/harmony/test/reliability/vm/stack/Method3Class.Test2()V (??:-1)
1607: org/apache/harmony/test/reliability/vm/stack/Method3Class.Test1()V (??:-1)
1608: org/apache/harmony/test/reliability/vm/stack/StackUnwindTest.intersectMethodCall()V (??:-1)
1609: org/apache/harmony/test/reliability/vm/stack/Method2Class.Test2()V (??:-1)
1610: org/apache/harmony/test/reliability/vm/stack/StackUnwindTest.intersectMethodCall()V (??:-1)
1611: org/apache/harmony/test/reliability/vm/stack/Method3Class.Test3()V (??:-1)
1612: org/apache/harmony/test/reliability/vm/stack/StackUnwindTest.intersectMethodCall()V (??:-1)
1613: org/apache/harmony/test/reliability/vm/stack/Method3Class.Test3()V (??:-1)
1614: org/apache/harmony/test/reliability/vm/stack/StackUnwindTest.intersectMethodCall()V (??:-1)
1615: org/apache/harmony/test/reliability/vm/stack/Method3Class.Test3()V (??:-1)
1616: org/apache/harmony/test/reliability/vm/stack/Method3Class.Test2()V (??:-1)
1617: org/apache/harmony/test/reliability/vm/stack/StackUnwindTest.intersectMethodCall()V (??:-1)
1618: org/apache/harmony/test/reliability/vm/stack/Method2Class.TestHotInline()V (??:-1)
1619: org/apache/harmony/test/reliability/vm/stack/StackUnwindTest.intersectMethodCall()V (??:-1)
1620: org/apache/harmony/test/reliability/vm/stack/Method1Class.Test1()V (??:-1)
1621: org/apache/harmony/test/reliability/vm/stack/StackUnwindTest.intersectMethodCall()V (??:-1)
1622: org/apache/harmony/test/reliability/vm/stack/Method2Class.TestHotInline()V (??:-1)
1623: org/apache/harmony/test/reliability/vm/stack/StackUnwindTest.intersectMethodCall()V (??:-1)
1624: org/apache/harmony/test/reliability/vm/stack/Method3Class.Test3()V (??:-1)
1625: org/apache/harmony/test/reliability/vm/stack/Method3Class.Test2()V (??:-1)
1626: org/apache/harmony/test/reliability/vm/stack/StackUnwindTest.intersectMethodCall()V (??:-1)
1627: org/apache/harmony/test/reliability/vm/stack/Method3Class.Test3()V (??:-1)
1628: org/apache/harmony/test/reliability/vm/stack/Method3Class.Test2()V (??:-1)
1629: org/apache/harmony/test/reliability/vm/stack/Method3Class.Test1()V (??:-1)
1630: org/apache/harmony/test/reliability/vm/stack/StackUnwindTest.intersectMethodCall()V (??:-1)
1631: org/apache/harmony/test/reliability/vm/stack/Method3Class.Test3()V (??:-1)
1632: org/apache/harmony/test/reliability/vm/stack/StackUnwindTest.intersectMethodCall()V (??:-1)
1633: org/apache/harmony/test/reliability/vm/stack/Method2Class.TestHotInline()V (??:-1)
1634: org/apache/harmony/test/reliability/vm/stack/StackUnwindTest.intersectMethodCall()V (??:-1)
1635: org/apache/harmony/test/reliability/vm/stack/Method2Class.TestHotInline()V (??:-1)
1636: org/apache/harmony/test/reliability/vm/stack/StackUnwindTest.intersectMethodCall()V (??:-1)
1637: org/apache/harmony/test/reliability/vm/stack/Method3Class.TestHotInline()V (??:-1)
1638: org/apache/harmony/test/reliability/vm/stack/StackUnwindTest.intersectMethodCall()V (??:-1)
1639: org/apache/harmony/test/reliability/vm/stack/Method1Class.TestHotInline()V (??:-1)
1640: org/apache/harmony/test/reliability/vm/stack/StackUnwindTest.intersectMethodCall()V (??:-1)
1641: org/apache/harmony/test/reliability/vm/stack/Method2Class.Test3()V (??:-1)
1642: org/apache/harmony/test/reliability/vm/stack/StackUnwindTest.intersectMethodCall()V (??:-1)
1643: org/apache/harmony/test/reliability/vm/stack/Method3Class.TestHotInline()V (??:-1)
1644: org/apache/harmony/test/reliability/vm/stack/StackUnwindTest.intersectMethodCall()V (??:-1)
1645: org/apache/harmony/test/reliability/vm/stack/Method1Class.TestHotInline()V (??:-1)
1646: org/apache/harmony/test/reliability/vm/stack/StackUnwindTest.intersectMethodCall()V (??:-1)
1647: org/apache/harmony/test/reliability/vm/stack/Method2Class.TestHotInline()V (??:-1)
1648: org/apache/harmony/test/reliability/vm/stack/StackUnwindTest.intersectMethodCall()V (??:-1)
1649: org/apache/harmony/test/reliability/vm/stack/Method2Class.Test1()V (??:-1)
1650: org/apache/harmony/test/reliability/vm/stack/StackUnwindTest.intersectMethodCall()V (??:-1)
1651: org/apache/harmony/test/reliability/vm/stack/Method1Class.TestHotInline()V (??:-1)
1652: org/apache/harmony/test/reliability/vm/stack/StackUnwindTest.intersectMethodCall()V (??:-1)
1653: org/apache/harmony/test/reliability/vm/stack/Method3Class.Test3()V (??:-1)
1654: org/apache/harmony/test/reliability/vm/stack/StackUnwindTest.intersectMethodCall()V (??:-1)
1655: org/apache/harmony/test/reliability/vm/stack/Method1Class.Test2()V (??:-1)
1656: org/apache/harmony/test/reliability/vm/stack/StackUnwindTest.intersectMethodCall()V (??:-1)
1657: org/apache/harmony/test/reliability/vm/stack/Method3Class.TestHotInline()V (??:-1)
1658: org/apache/harmony/test/reliability/vm/stack/StackUnwindTest.intersectMethodCall()V (??:-1)
1659: org/apache/harmony/test/reliability/vm/stack/Method1Class.Test1()V (??:-1)
1660: org/apache/harmony/test/reliability/vm/stack/StackUnwindTest.intersectMethodCall()V (??:-1)
1661: org/apache/harmony/test/reliability/vm/stack/Method2Class.Test2()V (??:-1)
1662: org/apache/harmony/test/reliability/vm/stack/StackUnwindTest.intersectMethodCall()V (??:-1)
1663: org/apache/harmony/test/reliability/vm/stack/Method2Class.TestHotInline()V (??:-1)
1664: org/apache/harmony/test/reliability/vm/stack/StackUnwindTest.intersectMethodCall()V (??:-1)
1665: org/apache/harmony/test/reliability/vm/stack/Method2Class.Test1()V (??:-1)
1666: org/apache/harmony/test/reliability/vm/stack/StackUnwindTest.intersectMethodCall()V (??:-1)
1667: org/apache/harmony/test/reliability/vm/stack/Method3Class.Test3()V (??:-1)
1668: org/apache/harmony/test/reliability/vm/stack/Method3Class.Test2()V (??:-1)
1669: org/apache/harmony/test/reliability/vm/stack/StackUnwindTest.intersectMethodCall()V (??:-1)
1670: org/apache/harmony/test/reliability/vm/stack/Method2Class.TestHotInline()V (??:-1)
1671: org/apache/harmony/test/reliability/vm/stack/StackUnwindTest.intersectMethodCall()V (??:-1)
1672: org/apache/harmony/test/reliability/vm/stack/Method3Class.Test3()V (??:-1)
1673: org/apache/harmony/test/reliability/vm/stack/Method3Class.Test2()V (??:-1)
1674: org/apache/harmony/test/reliability/vm/stack/StackUnwindTest.intersectMethodCall()V (??:-1)
1675: org/apache/harmony/test/reliability/vm/stack/Method3Class.TestHotInline()V (??:-1)
1676: org/apache/harmony/test/reliability/vm/stack/StackUnwindTest.intersectMethodCall()V (??:-1)
1677: org/apache/harmony/test/reliability/vm/stack/Method2Class.Test2()V (??:-1)
1678: org/apache/harmony/test/reliability/vm/stack/StackUnwindTest.intersectMethodCall()V (??:-1)
1679: org/apache/harmony/test/reliability/vm/stack/ThreadExecutor.run()V (??:-1)
1680: java/lang/Thread.runImpl()V (Thread.java:673)
LTend of stack traceGT

***********************************************************
Modifications since last successful build:	(8)
            
add cc-snapshot log20070806194122Lbuild.8 08/06/2007 19:41:22snapshot
add cc-snapshot log20070801154520Lbuild.7 08/01/2007 15:45:20snapshot
add cc-snapshot log20070730190526Lbuild.6 07/30/2007 19:05:26snapshot
add cc-snapshot log20070724161634Lbuild.5 07/24/2007 16:16:34snapshot
add cc-snapshot log20070720170220Lbuild.4 07/20/2007 17:02:20snapshot
add cc-snapshot log20070719185009Lbuild.3 07/19/2007 18:50:09snapshot
add cc-snapshot log20070712182841Lbuild.2 07/12/2007 18:28:41snapshot
add cc-snapshot log20070711124837Lbuild.1 07/11/2007 12:48:37snapshot

begin 644 execution_log.zip
M4$L#! H    ( .^@!C>3$-E270@   IQ   2    97AE8W5T:6]N7VQO9RYH
M=&UL[5W?4]LX$'X^_@J_W!SW@!-^TQS'#(1 TPE'AT [<QVFH]B;6(TL^209
M2/_Z6\E)FJ008B?.0U&G;2S;VF^U6DG?2K)]'.F8G1QW1#@X.4XDG!P33^D!
M@[__Z JNMQ3]#C7OJ/K[7W^<;,B4US8\\^?+-_) [KVSE+*P2QG>@M?\IYA-
M7;:'<3^D\MZK2R :0@\3-:\"3XF0NI(JD*H2!/AW2P*CI$,9U8-*Q\BM2% I
MTZHR>66G6CW<JAYM50^^5@_WMJ?@IA)&'Y)0_SM-:C\IY7V!(!+WWDW*.>4]
M3X/2-6]XN_\O31I<RT%3@T2=;R-4/<3;;O&N9T1EQQ_P?^_&:ESSMJM[.3%/
M0P:R?E/?W2D3Y1*+UN37J6YK+%-<)E23=]DY=-DE:!0"NDRL]97J7T8[IE3H
M%G(-.&BW<QIH*CB1@[+QC'RT(!:M-VC! _S<EE<,]HE(;-<,6L![.BJ&]FR;
M[X/DP'PB>RI/VY_(YI\FR:>K>NLCD>4YU"1>XPF"!G]8!Y0MEQ0)2$U!%4><
M9WK XA0PO<GFXU5CC=4K%0G1+^(0-A_VT.%-_,-N[\W)',9;"K8=Z?"1YX4L
MXB$9Z 1>7>!Y62<*RO$4T?D&@2Y0*UE&_]K^U)G@2RB8'_""<L*0&ZT3$X?2
M@!&EWA,5!2(LJ4*2H-^K+7RWTA(5+U!]64:D"0JXHIH^E&W*,2 .W7RM6 7X
M8V'(MOU9MI#S:ES;XA2H\2QC3XHT\1L\C3-R76Y%9)A^5@7M5"7 0R,PAN?.
MO:C(+8U!I"BZ3QG#($9'X*FTLY5($8!2+^;[C6A/R!Z:CP01^%H(IGS"M:^)
MZH?([WQ31+\K9'_3'IELM</]O3^7%6E&TE2#.9Z0O'VXO2K)$U*/BJA[Q_M<
M//(&@Q@P.9(Z<]K*WSG<+P!PBUK[.%BC<>--F[#"=@^6,FX;_DM1,4K86.6)
M4Q;A-0 .VE==(S; "%O2CL]$CP9^LVNU'(D=)K-Z>W<X7Z;"-BHQ+C&#Q25P
MV[3"*]"1"$\#XZ)"[ON4/XC^V,1>6Z0R@,7EG@.#'M'8SJ8%-^.$C63/O2>K
MS%?JTASYC&!7-L+-)(T0ABDK:_^HJ&.<AB3!+G)L[,ESF<5W=IU3YW#J7\D<
M5R20 HF))CR L=;39S.<PZ-?WBJW&#."GF@H-ID)W"LRF@PE#/4SZJEIJ0?O
M"DC%P,PRY:&>;2&Q \S$JLW1Q6'+WCY8'B 3/2-YNU!_% %#8V#WVB5(=!I6
MOI#30&IS]K)%W*NNJB2S1JH>%''M*T)QO$BYG1?>M*FL]R@N#=N;U*=<3TC;
M/GIE-'Q6&B,I#R*_97_0WJCFYCB1M;:](HXQ*S=&/6<$'SRK[V+4]08K22H3
M'MFTX<L3Y^:Q9T=:'6EUI-615N?4;\$<CK0ZTNI(JR.MQ>2NF+2V!RA("DZ_
M$[-X/4JO9[)W#OC.NJ::3Z4D=L%^-EW:_/\0_I-@6&H&H[5UJ\,Y]/OE[5=8
M0(&/@!Q%B;*7788J? ;2OX$N2,!!C_!P(G)Z^5(I"R7BT9B@V%I)EM=O:Q+T
M;R4)H/$4)+JD]?J8<-*S8W@!97]DQK:F-,2H@:7IUY+B22C)OH&($W0T64#C
M45;_ ]7UX7$I2BZPD*KA*9?1S?W^&;IM/]N?)N374\9:(B ,7@[JEVA<%A!'
MV],'0IG=KY-A?:T+5G"/T+.&X%3X042D@ESVF,B&'5T@S$KKE0A?V=GB)D?<
MY(B;''&3(\ZIWX(YW.2(FQQQDR-N<J28W*4G1R8I:H,'R%++"H1GD!P9+BK9
MD6%'AAT9=D[]"YK#D6%'AAT9=F2XF-R5DN'/4O!>/4O\0^)5/]$TA.(<6*[G
M_B;S^>;Q]F'"KV>_%\WK=LD,_AELD0PN,%W:$X O(AO48<FO2+)V>,1,(#P;
M:#A+NUV0%P)Y70F>TK'2<SO*,)O_0T'"F B0H9Y3B3U.F?9Z&7N]J&8-C:R[
MJ!]3G1VL ]9T4AE:F]%EW*\(Y&=)DLOR7J'P,N@Z$,]%VF&P]H)>,$'TVE&;
M?/V8+1QCUP[:CI"BK@CUI1Y[@<7UV9OF%P#U;UZO6L^<J]G(BCX0>2=97>#H
M9]_]45I](=9[K9,%D=PLH9LE=+.$;I;0.?5;,(>;)72SA&Z6T,T2%I.[_"RA
MV<U)-.F5^/XU@W&%^>B0 .? V7V7$Z>-IQCD!ZKNYP3Z!W2=F6W7*XIA'F+C
M?4%_T2!F='^V<?V./U*>9__W[NOJV'=@8?0>YGCQU$RV,8T3W.R.8&5XV"QD
MW23J1,VO?1=DN2#+!5DNR')._1;,X8(L%V2Y(,L%6<7D+A!D/<>?N]FK:RW[
MS<&?)[/YH]??KNY)S_S8M^89612'/KK*[0 (!T\!) 9KX<T 4YG\QOAPM7KU
M%GZGMKUY]+1S*3M&,H3+^DI+N,"*7JHIR[.@9N[W,>X.4BG115WPY8(O%WS-
MD^N"+^?4;\(<+OARP9<+OESP54QND>#+\%%EWMU*]2 /AQWEP1X\.[!K"3=@
M/D.UZI?K*) T=WCX4T;4=)CJ,+#:KO)+0W/"A+.[9NO<:]_5ZXUV^^*N-77Q
M5FC"/(TLO^;M['LQY=@PE+>[YZ&%!0\MP_\2(KG1<.\9DF,HCK>]7_7,AG3E
M=:6(E_AX'=IA9(% )(-[S^SIGT;08EGY&[<8M62-'BO"NSAMMAKGWB/5D8UG
MNH(Q\6A QP%KS6:9N""ED)X(;,@4>H\1:C:2:*H\HLICE$-MXS55B>%:0DYK
M.3QIOA98>W=80X(:@S=Q@_4IM#6A)@;#(BQF$&R'01^C-U51G"0J$KH2A?W*
M-_-/0J5#><5XP<9QA9P<5^RG#BO99P\K]AN(_P-02P$"% ,*    " #OH 8W
MDQ#94ET(   *<0  $@              I($     97AE8W5T:6]N7VQO9RYH
9=&UL4$L%!@     !  $ 0    (T(      $! 
end

Mime
View raw message