harmony-alerts mailing list archives

Site index · List index
Message view « Date » · « Thread »
Top « Date » · « Thread »
From nbe...@kc.rr.com
Subject [build-test alert] BUILD FAILED Windows 2000 x86: drlvm-test
Date Sat, 04 Aug 2007 00:59:29 GMT
BUILD FAILED:
	Ant Error Message:
C:\harmony\bt\scripts\cc-exec-adaptor.xml:101: The following error occurred while executing
this line: C:\harmony\bt\adaptors\drlvm-test\adaptor.xml:75: There were drlvm-test failures

Date of build:	06/27/2007 23:15:34
Time to build:	53,082 minutes 47 seconds
Last changed:	06/27/2007 22:45:26
Last log entry:	drlvm

***********************************************************
Errors/Warnings:	(26)
            
[exec] Result: 128
[exec] Result: 128
[exec] Result: 128
[exec] Result: 128
[exec] Result: 128
[exec] Result: 128
[exec] Result: 128
[exec] Result: 128
[exec] Result: 128
[exec] Result: 128
[exec] Result: 128
[exec] Result: 128
[exec] Result: 128
[exec] Result: 128
[exec] Result: 128
[exec] Result: 128
[exec] Result: 128
[exec] Result: 128
[exec] Result: 128
BUILD FAILED
C:\harmony\bt\build\checkouts\drlvm\build\make\build.xml:398: The following error occurred
while executing this line:
C:\harmony\bt\build\checkouts\drlvm\build\make\build_component.xml:73: The following error
occurred while executing this line:
C:\harmony\bt\build\checkouts\drlvm\build\win_ia32_msvc_debug\semis\build\targets\test.xml:6:
Some tests failed
Total time: 53,082 minutes 29 seconds
The execution FAILED with the following exception:
The following error occurred while executing this line:
C:\harmony\bt\adaptors\drlvm-test\adaptor.xml:75: There were drlvm-test failures

***********************************************************
Unit Tests: (386)
        
error: test test_java_attrs
error: test test_java_basic
error: test test_java_identify
error: test test_java_interrupt
error: test test_java_monitors
error: test test_java_park
error: test test_java_ptr_conv
error: test test_java_suspend
error: test test_native_basic
error: test test_native_fat_monitor
error: test test_native_suspend
error: test test_native_thin_monitor
error: test test_ti_instrum
error: test test_ti_local_storage
error: test test_ti_monitor_info
error: test test_ti_peak_count
error: test test_ti_raw_monitors
error: test test_ti_state
error: test test_ti_timing
error: test classloader.ClassTestGetDeclaringClass_int
error: test classloader.ClassTestGetDeclaringClass_jet
error: test classloader.ClassTestGetDeclaringClass_jit
error: test classloader.ClassTestGetDeclaringClass_opt
error: test classloader.ClassTestGetDeclaringClass_srv
error: test classloader.ExceptionInInitializerTest_int
error: test classloader.ExceptionInInitializerTest_jet
error: test classloader.ExceptionInInitializerTest_jit
error: test classloader.ExceptionInInitializerTest_opt
error: test classloader.ExceptionInInitializerTest_srv
error: test classloader.LogLoader_int
error: test classloader.LogLoader_jet
error: test classloader.LogLoader_jit
error: test classloader.LogLoader_opt
error: test classloader.LogLoader_srv
error: test classloader.NotFound_int
error: test classloader.NotFound_jet
error: test classloader.NotFound_jit
error: test classloader.NotFound_opt
error: test classloader.NotFound_srv
error: test classloader.StressLoader_int
error: test classloader.StressLoader_jet
error: test classloader.StressLoader_jit
error: test classloader.StressLoader_opt
error: test classloader.StressLoader_srv
error: test exception.ExceptionStackTest_int
error: test exception.ExceptionStackTest_jet
error: test exception.ExceptionStackTest_jit
error: test exception.ExceptionStackTest_opt
error: test exception.ExceptionStackTest_srv
error: test exception.FinalizeStackTest_int
error: test exception.FinalizeStackTest_jet
error: test exception.FinalizeStackTest_jit
error: test exception.FinalizeStackTest_opt
error: test exception.FinalizeStackTest_srv
error: test exception.NPE_int
error: test exception.NPE_jet
error: test exception.NPE_jit
error: test exception.NPE_opt
error: test exception.NPE_srv
error: test gc.Finalizer_int
error: test gc.Finalizer_jet
error: test gc.Finalizer_jit
error: test gc.Finalizer_opt
error: test gc.Finalizer_srv
error: test gc.FinAlloc_int
error: test gc.FinAlloc_jet
error: test gc.FinAlloc_jit
error: test gc.FinAlloc_opt
error: test gc.FinAlloc_srv
error: test gc.Force_int
error: test gc.Force_jet
error: test gc.Force_jit
error: test gc.Force_opt
error: test gc.Force_srv
error: test gc.Fragment_int
error: test gc.Fragment_jet
error: test gc.Fragment_jit
error: test gc.Fragment_opt
error: test gc.Fragment_srv
error: test gc.Free_int
error: test gc.Free_jet
error: test gc.Free_jit
error: test gc.Free_opt
error: test gc.Free_srv
error: test gc.List_int
error: test gc.List_jet
error: test gc.List_jit
error: test gc.List_opt
error: test gc.List_srv
error: test gc.LOS_int
error: test gc.LOS_jet
error: test gc.LOS_jit
error: test gc.LOS_opt
error: test gc.LOS_srv
error: test gc.Mark_jet
error: test gc.Mark_jit
error: test gc.Mark_opt
error: test gc.Mark_srv
error: test gc.MultiThreads_int
error: test gc.MultiThreads_jet
error: test gc.MultiThreads_jit
error: test gc.MultiThreads_opt
error: test gc.MultiThreads_srv
error: test gc.NPE_int
error: test gc.NPE_jet
error: test gc.NPE_jit
error: test gc.NPE_opt
error: test gc.NPE_srv
error: test gc.PhantomReferenceQueueTest_int
error: test gc.PhantomReferenceQueueTest_jet
error: test gc.PhantomReferenceQueueTest_jit
error: test gc.PhantomReferenceQueueTest_opt
error: test gc.PhantomReferenceQueueTest_srv
error: test gc.RefRemove_int
error: test gc.RefRemove_jet
error: test gc.RefRemove_jit
error: test gc.RefRemove_opt
error: test gc.RefRemove_srv
error: test gc.RunFinalizersOnExitTest_int
error: test gc.RunFinalizersOnExitTest_jet
error: test gc.RunFinalizersOnExitTest_jit
error: test gc.RunFinalizersOnExitTest_opt
error: test gc.RunFinalizersOnExitTest_srv
error: test gc.StressRef_int
error: test gc.StressRef_jet
error: test gc.StressRef_jit
error: test gc.StressRef_opt
error: test gc.StressRef_srv
error: test gc.SynchronizedFinalizersTest_int
error: test gc.SynchronizedFinalizersTest_jet
error: test gc.SynchronizedFinalizersTest_jit
error: test gc.SynchronizedFinalizersTest_opt
error: test gc.SynchronizedFinalizersTest_srv
error: test gc.ThreadSuspension_int
error: test gc.ThreadSuspension_jet
error: test gc.ThreadSuspension_jit
error: test gc.ThreadSuspension_opt
error: test gc.ThreadSuspension_srv
error: test Hi_int
error: test Hi_jet
error: test Hi_jit
error: test Hi_opt
error: test Hi_srv
error: test init.ErrorInInitializer_int
error: test init.ErrorInInitializer_jet
error: test init.ErrorInInitializer_jit
error: test init.ErrorInInitializer_opt
error: test init.ErrorInInitializer_srv
error: test init.Other_int
error: test init.Other_jet
error: test init.Other_jit
error: test init.Other_opt
error: test init.Other_srv
error: test io.ArrayList_int
error: test io.ArrayList_jet
error: test io.ArrayList_jit
error: test io.ArrayList_opt
error: test io.ArrayList_srv
error: test jni.LoadLibrary_int
error: test jni.LoadLibrary_jet
error: test jni.LoadLibrary_jit
error: test jni.LoadLibrary_opt
error: test jni.LoadLibrary_srv
error: test outofmemory.Double_int
error: test outofmemory.Double_jet
error: test outofmemory.Double_jit
error: test outofmemory.Double_opt
error: test outofmemory.Double_srv
error: test outofmemory.Int_int
error: test outofmemory.Int_jet
error: test outofmemory.Int_jit
error: test outofmemory.Int_opt
error: test outofmemory.Int_srv
error: test outofmemory.Plain_int
error: test outofmemory.Plain_jet
error: test outofmemory.Plain_jit
error: test outofmemory.Plain_opt
error: test outofmemory.Plain_srv
error: test outofmemory.Ref_int
error: test outofmemory.Ref_jet
error: test outofmemory.Ref_jit
error: test outofmemory.Ref_opt
error: test outofmemory.Ref_srv
error: test outofmemory.Throw_int
error: test outofmemory.Throw_jet
error: test outofmemory.Throw_jit
error: test outofmemory.Throw_opt
error: test outofmemory.Throw_srv
error: test outofmemory.Vector_int
error: test outofmemory.Vector_jet
error: test outofmemory.Vector_jit
error: test outofmemory.Vector_opt
error: test outofmemory.Vector_srv
error: test outofmemory.VectorDouble_int
error: test outofmemory.VectorDouble_jet
error: test outofmemory.VectorDouble_jit
error: test outofmemory.VectorDouble_opt
error: test outofmemory.VectorDouble_srv
error: test outofmemory.VectorInt_int
error: test outofmemory.VectorInt_jet
error: test outofmemory.VectorInt_jit
error: test outofmemory.VectorInt_opt
error: test outofmemory.VectorInt_srv
error: test outofmemory.VectorRef_int
error: test outofmemory.VectorRef_jet
error: test outofmemory.VectorRef_jit
error: test outofmemory.VectorRef_opt
error: test outofmemory.VectorRef_srv
error: test perf.CreateManyExceptions_depth_int
error: test perf.CreateManyExceptions_depth_jet
error: test perf.CreateManyExceptions_depth_jit
error: test perf.CreateManyExceptions_depth_opt
error: test perf.CreateManyExceptions_depth_srv
error: test perf.CreateManyExceptions_int
error: test perf.CreateManyExceptions_jet
error: test perf.CreateManyExceptions_jit
error: test perf.CreateManyExceptions_opt
error: test perf.CreateManyExceptions_srv
error: test perf.MultiThreadsSimple_int
error: test perf.MultiThreadsSimple_jet
error: test perf.MultiThreadsSimple_jit
error: test perf.MultiThreadsSimple_opt
error: test perf.MultiThreadsSimple_srv
error: test perf.SeveralThreads_int
error: test perf.SeveralThreads_jet
error: test perf.SeveralThreads_jit
error: test perf.SeveralThreads_opt
error: test perf.SeveralThreads_srv
error: test perf.StressCornerSize_a_int
error: test perf.StressCornerSize_a_jet
error: test perf.StressCornerSize_a_jit
error: test perf.StressCornerSize_a_opt
error: test perf.StressCornerSize_a_srv
error: test perf.StressCornerSize_int
error: test perf.StressCornerSize_jet
error: test perf.StressCornerSize_jit
error: test perf.StressCornerSize_opt
error: test perf.StressCornerSize_srv
error: test perf.ThrowMany_depth_int
error: test perf.ThrowMany_depth_jet
error: test perf.ThrowMany_depth_jit
error: test perf.ThrowMany_depth_opt
error: test perf.ThrowMany_depth_srv
error: test perf.ThrowMany_int
error: test perf.ThrowMany_jet
error: test perf.ThrowMany_jit
error: test perf.ThrowMany_opt
error: test perf.ThrowMany_srv
error: test perf.ThrowManyExceptions_depth_int
error: test perf.ThrowManyExceptions_depth_jet
error: test perf.ThrowManyExceptions_depth_jit
error: test perf.ThrowManyExceptions_depth_opt
error: test perf.ThrowManyExceptions_depth_srv
error: test perf.ThrowManyExceptions_int
error: test perf.ThrowManyExceptions_jet
error: test perf.ThrowManyExceptions_jit
error: test perf.ThrowManyExceptions_opt
error: test perf.ThrowManyExceptions_srv
error: test reflect.GetMethod_int
error: test reflect.GetMethod_jet
error: test reflect.GetMethod_jit
error: test reflect.GetMethod_opt
error: test reflect.GetMethod_srv
error: test shutdown.TestDaemonOnWait_int
error: test shutdown.TestDaemonOnWait_jet
error: test shutdown.TestDaemonOnWait_jit
error: test shutdown.TestDaemonOnWait_opt
error: test shutdown.TestDaemonOnWait_srv
error: test shutdown.TestFatalError_int
error: test shutdown.TestFatalError_jet
error: test shutdown.TestFatalError_jit
error: test shutdown.TestFatalError_opt
error: test shutdown.TestFatalError_srv
error: test shutdown.TestInterrupt_int
error: test shutdown.TestInterrupt_jet
error: test shutdown.TestInterrupt_jit
error: test shutdown.TestInterrupt_opt
error: test shutdown.TestInterrupt_srv
error: test shutdown.TestLock_int
error: test shutdown.TestLock_jet
error: test shutdown.TestLock_jit
error: test shutdown.TestLock_opt
error: test shutdown.TestLock_srv
error: test StackTest_int
error: test StackTest_jet
error: test StackTest_jit
error: test StackTest_opt
error: test stress.BigStringBuffer_int
error: test stress.BigStringBuffer_jet
error: test stress.BigStringBuffer_jit
error: test stress.BigStringBuffer_opt
error: test stress.BigStringBuffer_srv
error: test stress.Finalizer_int
error: test stress.Finalizer_jet
error: test stress.Finalizer_jit
error: test stress.Finalizer_opt
error: test stress.Finalizer_srv
error: test stress.Intern_jet
error: test stress.Intern_jit
error: test stress.Intern_opt
error: test stress.Intern_srv
error: test stress.Mix_int
error: test stress.Mix_jet
error: test stress.Mix_jit
error: test stress.Mix_opt
error: test stress.Mix_srv
error: test stress.Stack_int
error: test stress.Stack_jet
error: test stress.Stack_jit
error: test stress.Stack_opt
error: test stress.Stack_srv
error: test stress.Sync_int
error: test stress.Sync_jet
error: test stress.Sync_jit
error: test stress.Sync_opt
error: test stress.Sync_srv
error: test stress.Threads_int
error: test stress.Threads_jet
error: test stress.Threads_jit
error: test stress.Threads_opt
error: test stress.Threads_srv
error: test stress.Vector_int
error: test stress.Vector_jet
error: test stress.Vector_jit
error: test stress.Vector_opt
error: test stress.Vector_srv
error: test stress.WeakHashmapTest_int
error: test stress.WeakHashmapTest_jet
error: test stress.WeakHashmapTest_jit
error: test stress.WeakHashmapTest_opt
error: test stress.WeakHashmapTest_srv
error: test thread.ExitShutdownHook_int
error: test thread.ExitShutdownHook_jet
error: test thread.ExitShutdownHook_jit
error: test thread.ExitShutdownHook_opt
error: test thread.ExitShutdownHook_srv
error: test thread.InfiniteFinalizer_int
error: test thread.InfiniteFinalizer_jet
error: test thread.InfiniteFinalizer_jit
error: test thread.InfiniteFinalizer_opt
error: test thread.InfiniteFinalizer_srv
error: test thread.InterruptWait_int
error: test thread.InterruptWait_jet
error: test thread.InterruptWait_jit
error: test thread.InterruptWait_opt
error: test thread.InterruptWait_srv
error: test thread.ManyThreadsTest_int
error: test thread.ManyThreadsTest_jet
error: test thread.ManyThreadsTest_jit
error: test thread.ManyThreadsTest_opt
error: test thread.ManyThreadsTest_srv
error: test thread.Sleep_int
error: test thread.Sleep_jet
error: test thread.Sleep_jit
error: test thread.Sleep_opt
error: test thread.Sleep_srv
error: test thread.ThreadInterrupt_int
error: test thread.ThreadInterrupt_jet
error: test thread.ThreadInterrupt_jit
error: test thread.ThreadInterrupt_opt
error: test thread.ThreadInterrupt_srv
error: test thread.ThreadOOM_int
error: test thread.ThreadOOM_jet
error: test thread.ThreadOOM_jit
error: test thread.ThreadOOM_opt
error: test thread.ThreadOOM_srv
error: test util.Date_int
error: test util.Date_jet
error: test util.Date_jit
error: test util.Date_opt
error: test util.Date_srv
error: test util.DoPriveleged_int
error: test util.DoPriveleged_jet
error: test util.DoPriveleged_jit
error: test util.DoPriveleged_opt
error: test util.DoPriveleged_srv
error: test util.Prop_int
error: test util.Prop_jet
error: test util.Prop_jit
error: test util.Prop_opt
error: test util.Prop_srv
error: test util.StringIntern_int
error: test util.StringIntern_jet
error: test util.StringIntern_jit
error: test util.StringIntern_opt
error: test util.StringIntern_srv
Unit Test Error Details:	(386)
                
Test: testClass: test_java_attrs
Test: testClass: test_java_basic
Test: testClass: test_java_identify
Test: testClass: test_java_interrupt
Test: testClass: test_java_monitors
Test: testClass: test_java_park
Test: testClass: test_java_ptr_conv
Test: testClass: test_java_suspend
Test: testClass: test_native_basic
Test: testClass: test_native_fat_monitor
Test: testClass: test_native_suspend
Test: testClass: test_native_thin_monitor
Test: testClass: test_ti_instrum
Test: testClass: test_ti_local_storage
Test: testClass: test_ti_monitor_info
Test: testClass: test_ti_peak_count
Test: testClass: test_ti_raw_monitors
Test: testClass: test_ti_state
Test: testClass: test_ti_timing
Test: testClass: classloader.ClassTestGetDeclaringClass_int
Test: testClass: classloader.ClassTestGetDeclaringClass_jet
Test: testClass: classloader.ClassTestGetDeclaringClass_jit
Test: testClass: classloader.ClassTestGetDeclaringClass_opt
Test: testClass: classloader.ClassTestGetDeclaringClass_srv
Test: testClass: classloader.ExceptionInInitializerTest_int
Test: testClass: classloader.ExceptionInInitializerTest_jet
Test: testClass: classloader.ExceptionInInitializerTest_jit
Test: testClass: classloader.ExceptionInInitializerTest_opt
Test: testClass: classloader.ExceptionInInitializerTest_srv
Test: testClass: classloader.LogLoader_int
Test: testClass: classloader.LogLoader_jet
Test: testClass: classloader.LogLoader_jit
Test: testClass: classloader.LogLoader_opt
Test: testClass: classloader.LogLoader_srv
Test: testClass: classloader.NotFound_int
Test: testClass: classloader.NotFound_jet
Test: testClass: classloader.NotFound_jit
Test: testClass: classloader.NotFound_opt
Test: testClass: classloader.NotFound_srv
Test: testClass: classloader.StressLoader_int
Test: testClass: classloader.StressLoader_jet
Test: testClass: classloader.StressLoader_jit
Test: testClass: classloader.StressLoader_opt
Test: testClass: classloader.StressLoader_srv
Test: testClass: exception.ExceptionStackTest_int
Test: testClass: exception.ExceptionStackTest_jet
Test: testClass: exception.ExceptionStackTest_jit
Test: testClass: exception.ExceptionStackTest_opt
Test: testClass: exception.ExceptionStackTest_srv
Test: testClass: exception.FinalizeStackTest_int
Test: testClass: exception.FinalizeStackTest_jet
Test: testClass: exception.FinalizeStackTest_jit
Test: testClass: exception.FinalizeStackTest_opt
Test: testClass: exception.FinalizeStackTest_srv
Test: testClass: exception.NPE_int
Test: testClass: exception.NPE_jet
Test: testClass: exception.NPE_jit
Test: testClass: exception.NPE_opt
Test: testClass: exception.NPE_srv
Test: testClass: gc.Finalizer_int
Test: testClass: gc.Finalizer_jet
Test: testClass: gc.Finalizer_jit
Test: testClass: gc.Finalizer_opt
Test: testClass: gc.Finalizer_srv
Test: testClass: gc.FinAlloc_int
Test: testClass: gc.FinAlloc_jet
Test: testClass: gc.FinAlloc_jit
Test: testClass: gc.FinAlloc_opt
Test: testClass: gc.FinAlloc_srv
Test: testClass: gc.Force_int
Test: testClass: gc.Force_jet
Test: testClass: gc.Force_jit
Test: testClass: gc.Force_opt
Test: testClass: gc.Force_srv
Test: testClass: gc.Fragment_int
Test: testClass: gc.Fragment_jet
Test: testClass: gc.Fragment_jit
Test: testClass: gc.Fragment_opt
Test: testClass: gc.Fragment_srv
Test: testClass: gc.Free_int
Test: testClass: gc.Free_jet
Test: testClass: gc.Free_jit
Test: testClass: gc.Free_opt
Test: testClass: gc.Free_srv
Test: testClass: gc.List_int
Test: testClass: gc.List_jet
Test: testClass: gc.List_jit
Test: testClass: gc.List_opt
Test: testClass: gc.List_srv
Test: testClass: gc.LOS_int
Test: testClass: gc.LOS_jet
Test: testClass: gc.LOS_jit
Test: testClass: gc.LOS_opt
Test: testClass: gc.LOS_srv
Test: testClass: gc.Mark_jet
Test: testClass: gc.Mark_jit
Test: testClass: gc.Mark_opt
Test: testClass: gc.Mark_srv
Test: testClass: gc.MultiThreads_int
Test: testClass: gc.MultiThreads_jet
Test: testClass: gc.MultiThreads_jit
Test: testClass: gc.MultiThreads_opt
Test: testClass: gc.MultiThreads_srv
Test: testClass: gc.NPE_int
Test: testClass: gc.NPE_jet
Test: testClass: gc.NPE_jit
Test: testClass: gc.NPE_opt
Test: testClass: gc.NPE_srv
Test: testClass: gc.PhantomReferenceQueueTest_int
Test: testClass: gc.PhantomReferenceQueueTest_jet
Test: testClass: gc.PhantomReferenceQueueTest_jit
Test: testClass: gc.PhantomReferenceQueueTest_opt
Test: testClass: gc.PhantomReferenceQueueTest_srv
Test: testClass: gc.RefRemove_int
Test: testClass: gc.RefRemove_jet
Test: testClass: gc.RefRemove_jit
Test: testClass: gc.RefRemove_opt
Test: testClass: gc.RefRemove_srv
Test: testClass: gc.RunFinalizersOnExitTest_int
Test: testClass: gc.RunFinalizersOnExitTest_jet
Test: testClass: gc.RunFinalizersOnExitTest_jit
Test: testClass: gc.RunFinalizersOnExitTest_opt
Test: testClass: gc.RunFinalizersOnExitTest_srv
Test: testClass: gc.StressRef_int
Test: testClass: gc.StressRef_jet
Test: testClass: gc.StressRef_jit
Test: testClass: gc.StressRef_opt
Test: testClass: gc.StressRef_srv
Test: testClass: gc.SynchronizedFinalizersTest_int
Test: testClass: gc.SynchronizedFinalizersTest_jet
Test: testClass: gc.SynchronizedFinalizersTest_jit
Test: testClass: gc.SynchronizedFinalizersTest_opt
Test: testClass: gc.SynchronizedFinalizersTest_srv
Test: testClass: gc.ThreadSuspension_int
Test: testClass: gc.ThreadSuspension_jet
Test: testClass: gc.ThreadSuspension_jit
Test: testClass: gc.ThreadSuspension_opt
Test: testClass: gc.ThreadSuspension_srv
Test: testClass: Hi_int
Test: testClass: Hi_jet
Test: testClass: Hi_jit
Test: testClass: Hi_opt
Test: testClass: Hi_srv
Test: testClass: init.ErrorInInitializer_int
Test: testClass: init.ErrorInInitializer_jet
Test: testClass: init.ErrorInInitializer_jit
Test: testClass: init.ErrorInInitializer_opt
Test: testClass: init.ErrorInInitializer_srv
Test: testClass: init.Other_int
Test: testClass: init.Other_jet
Test: testClass: init.Other_jit
Test: testClass: init.Other_opt
Test: testClass: init.Other_srv
Test: testClass: io.ArrayList_int
Test: testClass: io.ArrayList_jet
Test: testClass: io.ArrayList_jit
Test: testClass: io.ArrayList_opt
Test: testClass: io.ArrayList_srv
Test: testClass: jni.LoadLibrary_int
Test: testClass: jni.LoadLibrary_jet
Test: testClass: jni.LoadLibrary_jit
Test: testClass: jni.LoadLibrary_opt
Test: testClass: jni.LoadLibrary_srv
Test: testClass: outofmemory.Double_int
Test: testClass: outofmemory.Double_jet
Test: testClass: outofmemory.Double_jit
Test: testClass: outofmemory.Double_opt
Test: testClass: outofmemory.Double_srv
Test: testClass: outofmemory.Int_int
Test: testClass: outofmemory.Int_jet
Test: testClass: outofmemory.Int_jit
Test: testClass: outofmemory.Int_opt
Test: testClass: outofmemory.Int_srv
Test: testClass: outofmemory.Plain_int
Test: testClass: outofmemory.Plain_jet
Test: testClass: outofmemory.Plain_jit
Test: testClass: outofmemory.Plain_opt
Test: testClass: outofmemory.Plain_srv
Test: testClass: outofmemory.Ref_int
Test: testClass: outofmemory.Ref_jet
Test: testClass: outofmemory.Ref_jit
Test: testClass: outofmemory.Ref_opt
Test: testClass: outofmemory.Ref_srv
Test: testClass: outofmemory.Throw_int
Test: testClass: outofmemory.Throw_jet
Test: testClass: outofmemory.Throw_jit
Test: testClass: outofmemory.Throw_opt
Test: testClass: outofmemory.Throw_srv
Test: testClass: outofmemory.Vector_int
Test: testClass: outofmemory.Vector_jet
Test: testClass: outofmemory.Vector_jit
Test: testClass: outofmemory.Vector_opt
Test: testClass: outofmemory.Vector_srv
Test: testClass: outofmemory.VectorDouble_int
Test: testClass: outofmemory.VectorDouble_jet
Test: testClass: outofmemory.VectorDouble_jit
Test: testClass: outofmemory.VectorDouble_opt
Test: testClass: outofmemory.VectorDouble_srv
Test: testClass: outofmemory.VectorInt_int
Test: testClass: outofmemory.VectorInt_jet
Test: testClass: outofmemory.VectorInt_jit
Test: testClass: outofmemory.VectorInt_opt
Test: testClass: outofmemory.VectorInt_srv
Test: testClass: outofmemory.VectorRef_int
Test: testClass: outofmemory.VectorRef_jet
Test: testClass: outofmemory.VectorRef_jit
Test: testClass: outofmemory.VectorRef_opt
Test: testClass: outofmemory.VectorRef_srv
Test: testClass: perf.CreateManyExceptions_depth_int
Test: testClass: perf.CreateManyExceptions_depth_jet
Test: testClass: perf.CreateManyExceptions_depth_jit
Test: testClass: perf.CreateManyExceptions_depth_opt
Test: testClass: perf.CreateManyExceptions_depth_srv
Test: testClass: perf.CreateManyExceptions_int
Test: testClass: perf.CreateManyExceptions_jet
Test: testClass: perf.CreateManyExceptions_jit
Test: testClass: perf.CreateManyExceptions_opt
Test: testClass: perf.CreateManyExceptions_srv
Test: testClass: perf.MultiThreadsSimple_int
Test: testClass: perf.MultiThreadsSimple_jet
Test: testClass: perf.MultiThreadsSimple_jit
Test: testClass: perf.MultiThreadsSimple_opt
Test: testClass: perf.MultiThreadsSimple_srv
Test: testClass: perf.SeveralThreads_int
Test: testClass: perf.SeveralThreads_jet
Test: testClass: perf.SeveralThreads_jit
Test: testClass: perf.SeveralThreads_opt
Test: testClass: perf.SeveralThreads_srv
Test: testClass: perf.StressCornerSize_a_int
Test: testClass: perf.StressCornerSize_a_jet
Test: testClass: perf.StressCornerSize_a_jit
Test: testClass: perf.StressCornerSize_a_opt
Test: testClass: perf.StressCornerSize_a_srv
Test: testClass: perf.StressCornerSize_int
Test: testClass: perf.StressCornerSize_jet
Test: testClass: perf.StressCornerSize_jit
Test: testClass: perf.StressCornerSize_opt
Test: testClass: perf.StressCornerSize_srv
Test: testClass: perf.ThrowMany_depth_int
Test: testClass: perf.ThrowMany_depth_jet
Test: testClass: perf.ThrowMany_depth_jit
Test: testClass: perf.ThrowMany_depth_opt
Test: testClass: perf.ThrowMany_depth_srv
Test: testClass: perf.ThrowMany_int
Test: testClass: perf.ThrowMany_jet
Test: testClass: perf.ThrowMany_jit
Test: testClass: perf.ThrowMany_opt
Test: testClass: perf.ThrowMany_srv
Test: testClass: perf.ThrowManyExceptions_depth_int
Test: testClass: perf.ThrowManyExceptions_depth_jet
Test: testClass: perf.ThrowManyExceptions_depth_jit
Test: testClass: perf.ThrowManyExceptions_depth_opt
Test: testClass: perf.ThrowManyExceptions_depth_srv
Test: testClass: perf.ThrowManyExceptions_int
Test: testClass: perf.ThrowManyExceptions_jet
Test: testClass: perf.ThrowManyExceptions_jit
Test: testClass: perf.ThrowManyExceptions_opt
Test: testClass: perf.ThrowManyExceptions_srv
Test: testClass: reflect.GetMethod_int
Test: testClass: reflect.GetMethod_jet
Test: testClass: reflect.GetMethod_jit
Test: testClass: reflect.GetMethod_opt
Test: testClass: reflect.GetMethod_srv
Test: testClass: shutdown.TestDaemonOnWait_int
Test: testClass: shutdown.TestDaemonOnWait_jet
Test: testClass: shutdown.TestDaemonOnWait_jit
Test: testClass: shutdown.TestDaemonOnWait_opt
Test: testClass: shutdown.TestDaemonOnWait_srv
Test: testClass: shutdown.TestFatalError_int
Test: testClass: shutdown.TestFatalError_jet
Test: testClass: shutdown.TestFatalError_jit
Test: testClass: shutdown.TestFatalError_opt
Test: testClass: shutdown.TestFatalError_srv
Test: testClass: shutdown.TestInterrupt_int
Test: testClass: shutdown.TestInterrupt_jet
Test: testClass: shutdown.TestInterrupt_jit
Test: testClass: shutdown.TestInterrupt_opt
Test: testClass: shutdown.TestInterrupt_srv
Test: testClass: shutdown.TestLock_int
Test: testClass: shutdown.TestLock_jet
Test: testClass: shutdown.TestLock_jit
Test: testClass: shutdown.TestLock_opt
Test: testClass: shutdown.TestLock_srv
Test: testClass: StackTest_int
Test: testClass: StackTest_jet
Test: testClass: StackTest_jit
Test: testClass: StackTest_opt
Test: testClass: stress.BigStringBuffer_int
Test: testClass: stress.BigStringBuffer_jet
Test: testClass: stress.BigStringBuffer_jit
Test: testClass: stress.BigStringBuffer_opt
Test: testClass: stress.BigStringBuffer_srv
Test: testClass: stress.Finalizer_int
Test: testClass: stress.Finalizer_jet
Test: testClass: stress.Finalizer_jit
Test: testClass: stress.Finalizer_opt
Test: testClass: stress.Finalizer_srv
Test: testClass: stress.Intern_jet
Test: testClass: stress.Intern_jit
Test: testClass: stress.Intern_opt
Test: testClass: stress.Intern_srv
Test: testClass: stress.Mix_int
Test: testClass: stress.Mix_jet
Test: testClass: stress.Mix_jit
Test: testClass: stress.Mix_opt
Test: testClass: stress.Mix_srv
Test: testClass: stress.Stack_int
Test: testClass: stress.Stack_jet
Test: testClass: stress.Stack_jit
Test: testClass: stress.Stack_opt
Test: testClass: stress.Stack_srv
Test: testClass: stress.Sync_int
Test: testClass: stress.Sync_jet
Test: testClass: stress.Sync_jit
Test: testClass: stress.Sync_opt
Test: testClass: stress.Sync_srv
Test: testClass: stress.Threads_int
Test: testClass: stress.Threads_jet
Test: testClass: stress.Threads_jit
Test: testClass: stress.Threads_opt
Test: testClass: stress.Threads_srv
Test: testClass: stress.Vector_int
Test: testClass: stress.Vector_jet
Test: testClass: stress.Vector_jit
Test: testClass: stress.Vector_opt
Test: testClass: stress.Vector_srv
Test: testClass: stress.WeakHashmapTest_int
Test: testClass: stress.WeakHashmapTest_jet
Test: testClass: stress.WeakHashmapTest_jit
Test: testClass: stress.WeakHashmapTest_opt
Test: testClass: stress.WeakHashmapTest_srv
Test: testClass: thread.ExitShutdownHook_int
Test: testClass: thread.ExitShutdownHook_jet
Test: testClass: thread.ExitShutdownHook_jit
Test: testClass: thread.ExitShutdownHook_opt
Test: testClass: thread.ExitShutdownHook_srv
Test: testClass: thread.InfiniteFinalizer_int
Test: testClass: thread.InfiniteFinalizer_jet
Test: testClass: thread.InfiniteFinalizer_jit
Test: testClass: thread.InfiniteFinalizer_opt
Test: testClass: thread.InfiniteFinalizer_srv
Test: testClass: thread.InterruptWait_int
Test: testClass: thread.InterruptWait_jet
Test: testClass: thread.InterruptWait_jit
Test: testClass: thread.InterruptWait_opt
Test: testClass: thread.InterruptWait_srv
Test: testClass: thread.ManyThreadsTest_int
Test: testClass: thread.ManyThreadsTest_jet
Test: testClass: thread.ManyThreadsTest_jit
Test: testClass: thread.ManyThreadsTest_opt
Test: testClass: thread.ManyThreadsTest_srv
Test: testClass: thread.Sleep_int
Test: testClass: thread.Sleep_jet
Test: testClass: thread.Sleep_jit
Test: testClass: thread.Sleep_opt
Test: testClass: thread.Sleep_srv
Test: testClass: thread.ThreadInterrupt_int
Test: testClass: thread.ThreadInterrupt_jet
Test: testClass: thread.ThreadInterrupt_jit
Test: testClass: thread.ThreadInterrupt_opt
Test: testClass: thread.ThreadInterrupt_srv
Test: testClass: thread.ThreadOOM_int
Test: testClass: thread.ThreadOOM_jet
Test: testClass: thread.ThreadOOM_jit
Test: testClass: thread.ThreadOOM_opt
Test: testClass: thread.ThreadOOM_srv
Test: testClass: util.Date_int
Test: testClass: util.Date_jet
Test: testClass: util.Date_jit
Test: testClass: util.Date_opt
Test: testClass: util.Date_srv
Test: testClass: util.DoPriveleged_int
Test: testClass: util.DoPriveleged_jet
Test: testClass: util.DoPriveleged_jit
Test: testClass: util.DoPriveleged_opt
Test: testClass: util.DoPriveleged_srv
Test: testClass: util.Prop_int
Test: testClass: util.Prop_jet
Test: testClass: util.Prop_jit
Test: testClass: util.Prop_opt
Test: testClass: util.Prop_srv
Test: testClass: util.StringIntern_int
Test: testClass: util.StringIntern_jet
Test: testClass: util.StringIntern_jit
Test: testClass: util.StringIntern_opt
Test: testClass: util.StringIntern_srv

***********************************************************
Modifications since last successful build:	(43)
            
add cc-drlvm log20070627224526Lbuild.3 06/27/2007 22:45:26drlvm
add cc-classlib log20070627220636Lbuild.4 06/27/2007 22:06:36classlib
modified smishura  /harmony/enhanced/classlib/trunk/modules/luni/src/main/native/fdlibm/unix/makefile
06/27/2007 01:45:48 Apply patch from HARMONY-4287:([classlib][build] failures in MathTest
and StrictMathTest if classlib is compiled in RELEASE mode)
modified smishura  /harmony/enhanced/classlib/trunk/modules/luni/src/main/native/fdlibm/unix/makefile
06/27/2007 01:45:48 Apply patch from HARMONY-4287:([classlib][build] failures in MathTest
and StrictMathTest if classlib is compiled in RELEASE mode)
modified smishura  /harmony/enhanced/classlib/trunk/modules/luni/src/main/native/fdlibm/unix/makefile
06/27/2007 01:45:48 Apply patch from HARMONY-4287:([classlib][build] failures in MathTest
and StrictMathTest if classlib is compiled in RELEASE mode)
modified smishura  /harmony/enhanced/classlib/trunk/modules/luni/src/main/native/fdlibm/unix/makefile
06/27/2007 01:45:48 Apply patch from HARMONY-4287:([classlib][build] failures in MathTest
and StrictMathTest if classlib is compiled in RELEASE mode)
modified smishura  /harmony/enhanced/classlib/trunk/modules/luni/src/main/native/fdlibm/unix/makefile
06/27/2007 01:45:48 Apply patch from HARMONY-4287:([classlib][build] failures in MathTest
and StrictMathTest if classlib is compiled in RELEASE mode)
modified smishura  /harmony/enhanced/classlib/trunk/modules/luni/src/main/native/fdlibm/unix/makefile
06/27/2007 01:45:48 Apply patch from HARMONY-4287:([classlib][build] failures in MathTest
and StrictMathTest if classlib is compiled in RELEASE mode)
add cc-classlib log20070627005355Lbuild.3 06/27/2007 00:53:55classlib
modified ivavladimir  /harmony/enhanced/classlib/trunk/modules/prefs/make/exclude.linux.x86.drl
06/27/2007 00:49:51 exclude test due to issue HARMONY-4289
modified ivavladimir  /harmony/enhanced/classlib/trunk/modules/prefs/make/exclude.linux.x86_64.drl
06/27/2007 00:49:51 exclude test due to issue HARMONY-4289
modified ivavladimir  /harmony/enhanced/classlib/trunk/modules/prefs/make/exclude.linux.x86.drl
06/27/2007 00:49:51 exclude test due to issue HARMONY-4289
modified ivavladimir  /harmony/enhanced/classlib/trunk/modules/prefs/make/exclude.linux.x86_64.drl
06/27/2007 00:49:51 exclude test due to issue HARMONY-4289
modified ivavladimir  /harmony/enhanced/classlib/trunk/modules/prefs/make/exclude.linux.x86.drl
06/27/2007 00:49:51 exclude test due to issue HARMONY-4289
modified ivavladimir  /harmony/enhanced/classlib/trunk/modules/prefs/make/exclude.linux.x86_64.drl
06/27/2007 00:49:51 exclude test due to issue HARMONY-4289
modified ivavladimir  /harmony/enhanced/classlib/trunk/modules/prefs/make/exclude.linux.x86.drl
06/27/2007 00:49:51 exclude test due to issue HARMONY-4289
modified ivavladimir  /harmony/enhanced/classlib/trunk/modules/prefs/make/exclude.linux.x86_64.drl
06/27/2007 00:49:51 exclude test due to issue HARMONY-4289
modified ivavladimir  /harmony/enhanced/classlib/trunk/modules/prefs/make/exclude.linux.x86.drl
06/27/2007 00:49:51 exclude test due to issue HARMONY-4289
modified ivavladimir  /harmony/enhanced/classlib/trunk/modules/prefs/make/exclude.linux.x86_64.drl
06/27/2007 00:49:51 exclude test due to issue HARMONY-4289
modified ivavladimir  /harmony/enhanced/classlib/trunk/modules/prefs/make/exclude.linux.x86.drl
06/27/2007 00:49:51 exclude test due to issue HARMONY-4289
modified ivavladimir  /harmony/enhanced/classlib/trunk/modules/prefs/make/exclude.linux.x86_64.drl
06/27/2007 00:49:51 exclude test due to issue HARMONY-4289
add cc-drlvm log20070626190855Lbuild.2 06/26/2007 19:08:55drlvm
add cc-classlib log20070626081054Lbuild.2 06/26/2007 08:10:54classlib
modified leoli  /harmony/enhanced/classlib/trunk/modules/beans/src/test/java/org/apache/harmony/beans/tests/java/beans/beancontext/BeanContextSupportTest.java
06/26/2007 08:07:27 Apply patch and unit test from HARMONY-4285([classlib][beans]java.beans.beancontext.BeanContextSupport.getResource
throws NullPointerException)
modified leoli  /harmony/enhanced/classlib/trunk/modules/beans/src/main/java/java/beans/beancontext/BeanContextSupport.java
06/26/2007 08:07:27 Apply patch and unit test from HARMONY-4285([classlib][beans]java.beans.beancontext.BeanContextSupport.getResource
throws NullPointerException)
modified leoli  /harmony/enhanced/classlib/trunk/modules/beans/src/test/java/org/apache/harmony/beans/tests/java/beans/beancontext/BeanContextSupportTest.java
06/26/2007 08:07:27 Apply patch and unit test from HARMONY-4285([classlib][beans]java.beans.beancontext.BeanContextSupport.getResource
throws NullPointerException)
modified leoli  /harmony/enhanced/classlib/trunk/modules/beans/src/main/java/java/beans/beancontext/BeanContextSupport.java
06/26/2007 08:07:27 Apply patch and unit test from HARMONY-4285([classlib][beans]java.beans.beancontext.BeanContextSupport.getResource
throws NullPointerException)
modified leoli  /harmony/enhanced/classlib/trunk/modules/beans/src/test/java/org/apache/harmony/beans/tests/java/beans/beancontext/BeanContextSupportTest.java
06/26/2007 08:07:27 Apply patch and unit test from HARMONY-4285([classlib][beans]java.beans.beancontext.BeanContextSupport.getResource
throws NullPointerException)
modified leoli  /harmony/enhanced/classlib/trunk/modules/beans/src/main/java/java/beans/beancontext/BeanContextSupport.java
06/26/2007 08:07:27 Apply patch and unit test from HARMONY-4285([classlib][beans]java.beans.beancontext.BeanContextSupport.getResource
throws NullPointerException)
modified leoli  /harmony/enhanced/classlib/trunk/modules/beans/src/test/java/org/apache/harmony/beans/tests/java/beans/beancontext/BeanContextSupportTest.java
06/26/2007 08:07:27 Apply patch and unit test from HARMONY-4285([classlib][beans]java.beans.beancontext.BeanContextSupport.getResource
throws NullPointerException)
modified leoli  /harmony/enhanced/classlib/trunk/modules/beans/src/main/java/java/beans/beancontext/BeanContextSupport.java
06/26/2007 08:07:27 Apply patch and unit test from HARMONY-4285([classlib][beans]java.beans.beancontext.BeanContextSupport.getResource
throws NullPointerException)
modified leoli  /harmony/enhanced/classlib/trunk/modules/beans/src/test/java/org/apache/harmony/beans/tests/java/beans/beancontext/BeanContextSupportTest.java
06/26/2007 08:07:27 Apply patch and unit test from HARMONY-4285([classlib][beans]java.beans.beancontext.BeanContextSupport.getResource
throws NullPointerException)
modified leoli  /harmony/enhanced/classlib/trunk/modules/beans/src/main/java/java/beans/beancontext/BeanContextSupport.java
06/26/2007 08:07:27 Apply patch and unit test from HARMONY-4285([classlib][beans]java.beans.beancontext.BeanContextSupport.getResource
throws NullPointerException)
modified leoli  /harmony/enhanced/classlib/trunk/modules/beans/src/test/java/org/apache/harmony/beans/tests/java/beans/beancontext/BeanContextSupportTest.java
06/26/2007 08:07:27 Apply patch and unit test from HARMONY-4285([classlib][beans]java.beans.beancontext.BeanContextSupport.getResource
throws NullPointerException)
modified leoli  /harmony/enhanced/classlib/trunk/modules/beans/src/main/java/java/beans/beancontext/BeanContextSupport.java
06/26/2007 08:07:27 Apply patch and unit test from HARMONY-4285([classlib][beans]java.beans.beancontext.BeanContextSupport.getResource
throws NullPointerException)
add cc-drlvm log20070625190205Lbuild.1 06/25/2007 19:02:05drlvm
add cc-classlib log20070625184403Lbuild.1 06/25/2007 18:44:03classlib
modified gshimansky  /harmony/enhanced/drlvm/trunk/vm/vmcore/src/class_support/Class_File_Loader.cpp
06/25/2007 10:57:23 Applied additional fix for HARMONY-4269[drlvm][classloader] VTSVM failed
due to incorrect change in class parsing.
modified gshimansky  /harmony/enhanced/drlvm/trunk/vm/vmcore/src/class_support/Class_File_Loader.cpp
06/25/2007 10:57:23 Applied additional fix for HARMONY-4269[drlvm][classloader] VTSVM failed
due to incorrect change in class parsing.
modified nadinem  /harmony/enhanced/drlvm/trunk/vm/doc/doc.properties 06/25/2007 07:05:40
removing wrong file in EM doc bundle
modified nadinem  /harmony/enhanced/drlvm/trunk/vm/doc/doc.properties 06/25/2007 07:05:40
removing wrong file in EM doc bundle
modified apetrenko  /harmony/enhanced/drlvm/trunk/build/make/build.xml 06/25/2007 06:45:11
doc directory has been removed from jdk/jre
modified apetrenko  /harmony/enhanced/drlvm/trunk/build/make/build.xml 06/25/2007 06:45:11
doc directory has been removed from jdk/jre



Mime
View raw message