harmony-alerts mailing list archives

Site index · List index
Message view « Date » · « Thread »
Top « Date » · « Thread »
From nom...@intel.com
Subject [build-test alert] BUILD FAILED Linux SUSE 9 gcc debug: drlvm test
Date Fri, 03 Aug 2007 12:24:13 GMT
BUILD FAILED:
	Ant Error Message:
/export/cruise/trunk/cc/projects/drlvm/trunk/build/make/build.xml:398: The following error occurred while executing this line: /export/cruise/trunk/cc/projects/drlvm/trunk/build/make/build_component.xml:73: The following error occurred while executing this line: /export/cruise/trunk/cc/projects/drlvm/trunk/build/lnx_ia32_gcc_debug/semis/build/targets/test.xml:6: Some tests failed

Date of build:	08/03/2007 15:54:48
Time to build:	208 minutes 51 seconds
Last changed:	08/03/2007 14:35:44
Last log entry:	ImageSurface.dispose method has been synchronized to avoid double freeing


***********************************************************
Execution log (errors/warnings messages):	
/usr/lib/gcc-lib/i586-suse-linux/3.3.3/../../../../i586-suse-linux/bin/ld: warning: libhysig.so, needed by /export/cruise/trunk/cc/projects/classlib/trunk/deploy/jdk/jre/bin/libhyzlib.so, not found (try using -rpath or -rpath-link)
/usr/lib/gcc-lib/i586-suse-linux/3.3.3/../../../../i586-suse-linux/bin/ld: warning: libhysig.so, needed by /export/cruise/trunk/cc/projects/classlib/trunk/deploy/jdk/jre/bin/libhyzlib.so, not found (try using -rpath or -rpath-link)
/usr/lib/gcc-lib/i586-suse-linux/3.3.3/../../../../i586-suse-linux/bin/ld: warning: libhysig.so, needed by /export/cruise/trunk/cc/projects/classlib/trunk/deploy/jdk/jre/bin/libhyzlib.so, not found (try using -rpath or -rpath-link)
/usr/lib/gcc-lib/i586-suse-linux/3.3.3/../../../../i586-suse-linux/bin/ld: warning: libhysig.so, needed by /export/cruise/trunk/cc/projects/classlib/trunk/deploy/jdk/jre/bin/libhyzlib.so, not found (try using -rpath or -rpath-link)
/usr/lib/gcc-lib/i586-suse-linux/3.3.3/../../../../i586-suse-linux/bin/ld: warning: libhysig.so, needed by /export/cruise/trunk/cc/projects/classlib/trunk/deploy/jdk/jre/bin/libhyzlib.so, not found (try using -rpath or -rpath-link)
/usr/lib/gcc-lib/i586-suse-linux/3.3.3/../../../../i586-suse-linux/bin/ld: warning: libhysig.so, needed by /export/cruise/trunk/cc/projects/classlib/trunk/deploy/jdk/jre/bin/libhyzlib.so, not found (try using -rpath or -rpath-link)
/usr/lib/gcc-lib/i586-suse-linux/3.3.3/../../../../i586-suse-linux/bin/ld: warning: libhysig.so, needed by /export/cruise/trunk/cc/projects/classlib/trunk/deploy/jdk/jre/bin/libhyzlib.so, not found (try using -rpath or -rpath-link)
/usr/lib/gcc-lib/i586-suse-linux/3.3.3/../../../../i586-suse-linux/bin/ld: warning: libhysig.so, needed by /export/cruise/trunk/cc/projects/classlib/trunk/deploy/jdk/jre/bin/libhyzlib.so, not found (try using -rpath or -rpath-link)
/usr/lib/gcc-lib/i586-suse-linux/3.3.3/../../../../i586-suse-linux/bin/ld: warning: libhysig.so, needed by /export/cruise/trunk/cc/projects/classlib/trunk/deploy/jdk/jre/bin/libhyzlib.so, not found (try using -rpath or -rpath-link)
/usr/lib/gcc-lib/i586-suse-linux/3.3.3/../../../../i586-suse-linux/bin/ld: warning: libhysig.so, needed by /export/cruise/trunk/cc/projects/classlib/trunk/deploy/jdk/jre/bin/libhyzlib.so, not found (try using -rpath or -rpath-link)
/usr/lib/gcc-lib/i586-suse-linux/3.3.3/../../../../i586-suse-linux/bin/ld: warning: libhysig.so, needed by /export/cruise/trunk/cc/projects/classlib/trunk/deploy/jdk/jre/bin/libhyzlib.so, not found (try using -rpath or -rpath-link)
/usr/lib/gcc-lib/i586-suse-linux/3.3.3/../../../../i586-suse-linux/bin/ld: warning: libhysig.so, needed by /export/cruise/trunk/cc/projects/classlib/trunk/deploy/jdk/jre/bin/libhyzlib.so, not found (try using -rpath or -rpath-link)
/usr/lib/gcc-lib/i586-suse-linux/3.3.3/../../../../i586-suse-linux/bin/ld: warning: libhysig.so, needed by /export/cruise/trunk/cc/projects/classlib/trunk/deploy/jdk/jre/bin/libhyzlib.so, not found (try using -rpath or -rpath-link)
/usr/lib/gcc-lib/i586-suse-linux/3.3.3/../../../../i586-suse-linux/bin/ld: warning: libhysig.so, needed by /export/cruise/trunk/cc/projects/classlib/trunk/deploy/jdk/jre/bin/libhyzlib.so, not found (try using -rpath or -rpath-link)
/usr/lib/gcc-lib/i586-suse-linux/3.3.3/../../../../i586-suse-linux/bin/ld: warning: libhysig.so, needed by /export/cruise/trunk/cc/projects/classlib/trunk/deploy/jdk/jre/bin/libhyzlib.so, not found (try using -rpath or -rpath-link)
/usr/lib/gcc-lib/i586-suse-linux/3.3.3/../../../../i586-suse-linux/bin/ld: warning: libhysig.so, needed by /export/cruise/trunk/cc/projects/classlib/trunk/deploy/jdk/jre/bin/libhyzlib.so, not found (try using -rpath or -rpath-link)
/usr/lib/gcc-lib/i586-suse-linux/3.3.3/../../../../i586-suse-linux/bin/ld: warning: libhysig.so, needed by /export/cruise/trunk/cc/projects/classlib/trunk/deploy/jdk/jre/bin/libhyzlib.so, not found (try using -rpath or -rpath-link)
/usr/lib/gcc-lib/i586-suse-linux/3.3.3/../../../../i586-suse-linux/bin/ld: warning: libhysig.so, needed by /export/cruise/trunk/cc/projects/classlib/trunk/deploy/jdk/jre/bin/libhyzlib.so, not found (try using -rpath or -rpath-link)
Java Result: 1
Java Result: 1
Java Result: 130
Java Result: 1
Java Result: 1
Java Result: 130
Java Result: 1
Java Result: 1
Java Result: 130
Java Result: 1
Java Result: 1
Java Result: 130
Java Result: 134
Java Result: 1
Java Result: 1
Java Result: 130
 Using CLASSLIB = /export/cruise/trunk/cc/projects/classlib/trunk
jars: true
using proxy settings: proxy.ims.intel.com port:911
Configuration:
     Hosting Java = 1.5.0_08 (Sun Microsystems Inc.)
    classlib root = /export/cruise/trunk/cc/projects/classlib/trunk
               os = Linux
             arch = ia32
              cxx = gcc
              cfg = debug
     svn revision = 562377
       components = deploy
## Compiling JVMTI natives in: /export/cruise/trunk/cc/projects/drlvm/trunk/vm/tests/jvmti/Breakpoint1
## Compiling JVMTI natives in: /export/cruise/trunk/cc/projects/drlvm/trunk/vm/tests/jvmti/PopFrame1
## Compiling JVMTI natives in: /export/cruise/trunk/cc/projects/drlvm/trunk/vm/tests/jvmti/SingleStep1
## Compiling JVMTI natives in: /export/cruise/trunk/cc/projects/drlvm/trunk/vm/tests/jvmti/VMInit1

        ==================================
        Run JVMTI tests using interpreter
        ==================================
        
Running Breakpoint1
Running PopFrame1
Running SingleStep1
Running VMInit1

        ==================================
        Run JVMTI tests using Client mode JIT (default)
        ==================================
        
Running Breakpoint1
Running PopFrame1
Running SingleStep1
Running VMInit1

        ==================================
        Run JVMTI tests using jitrino.JET
        ==================================
        
Running Breakpoint1
Running PopFrame1
Running SingleStep1
Running VMInit1

        ==================================
        Run JVMTI tests using jitrino.OPT
        ==================================
        

Using exclude file = /export/cruise/trunk/cc/projects/drlvm/trunk/build/make/excludes/exclude.drlvm_jvmti.linux.x86.opt   
        
Breakpoint1/Breakpoint1.java
SingleStep1/SingleStep1.java
VMInit1/VMInit1.java
PopFrame1/PopFrame1.java

                  
Running Breakpoint1
Running PopFrame1
Running SingleStep1
Running VMInit1

        ==================================
        Run JVMTI tests using Server mode JIT
        ==================================
        

Using exclude file = /export/cruise/trunk/cc/projects/drlvm/trunk/build/make/excludes/exclude.drlvm_jvmti.linux.x86.srv   
        
Breakpoint1/Breakpoint1.java
SingleStep1/SingleStep1.java
VMInit1/VMInit1.java
PopFrame1/PopFrame1.java

                  
Running Breakpoint1
Running PopFrame1
Running SingleStep1
Running VMInit1
## Compiling framework...
## Compiling C unit tests
## Linking C unit test: test_java_attrs
## Linking C unit test: test_java_basic
## Linking C unit test: test_java_identify
## Linking C unit test: test_java_interrupt
## Linking C unit test: test_java_monitors
## Linking C unit test: test_java_park
## Linking C unit test: test_java_ptr_conv
## Linking C unit test: test_java_suspend
## Linking C unit test: test_native_basic
## Linking C unit test: test_native_fat_monitor
## Linking C unit test: test_native_suspend
## Linking C unit test: test_native_thin_monitor
## Linking C unit test: test_ti_instrum
## Linking C unit test: test_ti_local_storage
## Linking C unit test: test_ti_monitor_info
## Linking C unit test: test_ti_peak_count
## Linking C unit test: test_ti_raw_monitors
## Linking C unit test: test_ti_state
## Linking C unit test: test_ti_timing
## Executing C unit test: test_java_attrs
INFO: TEST test_jthread_get_priority start
INFO: TEST test_jthread_get_priority: PASSED
INFO: TEST test_jthread_set_priority start
INFO: TEST test_jthread_set_priority: PASSED
## TEST PASSED
## Executing C unit test: test_java_basic
INFO: TEST test_jthread_attach start
INFO: TEST test_jthread_attach: PASSED
INFO: TEST test_jthread_detach start
INFO: TEST test_jthread_detach: PASSED
INFO: TEST test_hythread_create start
INFO: TEST test_hythread_create: PASSED
INFO: TEST test_hythread_create_with_function start
INFO: TEST test_hythread_create_with_function: PASSED
INFO: TEST test_jthread_get_JNI_env start
INFO: TEST test_jthread_get_JNI_env: PASSED
INFO: TEST test_jthread_join start
INFO: TEST test_jthread_join: PASSED
INFO: TEST test_jthread_timed_join start
-------- status = 00011177 (70007) 100
-------- status = 00000000 (0) 100
-------- status = 00000000 (0) 100
-------- status = 00000000 (0) 100
-------- status = 00000000 (0) 50000
-------- status = 00000000 (0) 50000
-------- status = 00000000 (0) 50000
-------- status = 00000000 (0) 50000
INFO: TEST test_jthread_timed_join: PASSED
INFO: TEST test_jthread_exception_stop start
INFO: TEST test_jthread_exception_stop: PASSED
INFO: TEST test_jthread_stop start
INFO: TEST test_jthread_stop: PASSED
INFO: TEST test_jthread_sleep start
INFO: TEST test_jthread_sleep: PASSED
INFO: TEST test_hythread_yield start
INFO: TEST test_hythread_yield: PASSED
## TEST PASSED
## Executing C unit test: test_java_identify
INFO: TEST test_jthread_self start
INFO: TEST test_jthread_self: PASSED
INFO: TEST test_jthread_get_id start
INFO: TEST test_jthread_get_id: PASSED
INFO: TEST test_jthread_get_thread start
INFO: TEST test_jthread_get_thread: PASSED
## TEST PASSED
## Executing C unit test: test_java_interrupt
INFO: TEST test_jthread_interrupt start
INFO: TEST test_jthread_interrupt: PASSED
INFO: TEST test_jthread_is_interrupted start
INFO: TEST test_jthread_is_interrupted: PASSED
INFO: TEST test_jthread_clear_interrupted start
INFO: TEST test_jthread_clear_interrupted: PASSED
## TEST PASSED
## Executing C unit test: test_java_monitors
INFO: TEST test_jthread_monitor_init start
INFO: TEST test_jthread_monitor_init: PASSED
INFO: TEST test_jthread_monitor_enter start
INFO: TEST test_jthread_monitor_enter: PASSED
INFO: TEST test_jthread_monitor_try_enter start
INFO: TEST test_jthread_monitor_try_enter: PASSED
INFO: TEST test_jthread_monitor_exit start
INFO: TEST test_jthread_monitor_exit: PASSED
INFO: TEST test_jthread_monitor_notify_all start
INFO: TEST test_jthread_monitor_notify_all: PASSED
INFO: TEST test_jthread_monitor_wait start
INFO: TEST test_jthread_monitor_wait: PASSED
INFO: TEST test_jthread_monitor_timed_wait start
INFO: TEST test_jthread_monitor_timed_wait: PASSED
INFO: TEST test_jthread_monitor_timed_wait_timeout start
INFO: TEST test_jthread_monitor_timed_wait_timeout: PASSED
## TEST PASSED
## Executing C unit test: test_java_park
INFO: TEST test_jthread_park_unpark start
INFO: TEST test_jthread_park_unpark: PASSED
INFO: TEST test_jthread_park_interrupt start
INFO: TEST test_jthread_park_interrupt: PASSED
INFO: TEST test_jthread_timed_park start
INFO: TEST test_jthread_timed_park: PASSED
## TEST PASSED
## Executing C unit test: test_java_ptr_conv
INFO: TEST test_jthread_get_java_thread start
INFO: TEST test_jthread_get_java_thread: PASSED
INFO: TEST test_jthread_get_native_thread start
INFO: TEST test_jthread_get_native_thread: PASSED
## TEST PASSED
## Executing C unit test: test_java_suspend
INFO: TEST test_jthread_suspend_resume start
INFO: TEST test_jthread_suspend_resume: PASSED
INFO: TEST test_jthread_suspend_all_resume_all start
INFO: TEST test_jthread_suspend_all_resume_all: PASSED
## TEST PASSED
## Executing C unit test: test_native_basic
INFO: TEST test_hythread_self_base start
INFO: TEST test_hythread_self_base: PASSED
INFO: TEST test_hythread_create start
INFO: TEST test_hythread_create: PASSED
INFO: TEST test_hythread_create_many start
INFO: TEST test_hythread_create_many: PASSED
INFO: TEST test_hythread_iterator start
iterator size: 100
INFO: TEST test_hythread_iterator: PASSED
INFO: TEST test_hythread_iterator_default start
default group iterator: 105
INFO: TEST test_hythread_iterator_default: PASSED
## TEST PASSED
## Executing C unit test: test_native_fat_monitor
INFO: TEST test_wait_signal start
INFO: TEST test_wait_signal: PASSED
## TEST PASSED
## Executing C unit test: test_native_suspend
INFO: TEST test_hythread_thread_suspend start
INFO: TEST test_hythread_thread_suspend: PASSED
INFO: TEST test_hythread_thread_suspend_all start
INFO: TEST test_hythread_thread_suspend_all: PASSED
## TEST PASSED
## Executing C unit test: test_native_thin_monitor
INFO: TEST test_hythread_thin_monitor_enter start
INFO: TEST test_hythread_thin_monitor_enter: PASSED
INFO: TEST test_hythread_thin_monitor_try_enter start
INFO: TEST test_hythread_thin_monitor_try_enter: PASSED
INFO: TEST test_hythread_thin_monitor_wait_timed_illegal start
INFO: TEST test_hythread_thin_monitor_wait_timed_illegal: PASSED
INFO: TEST test_hythread_thin_monitor_wait_timed start
INFO: TEST test_hythread_thin_monitor_wait_timed: PASSED
INFO: TEST test_hythread_thin_monitor_fat_unlock start
status: 70007
INFO: TEST test_hythread_thin_monitor_fat_unlock: PASSED
INFO: TEST test_hythread_thin_monitor_enter_contended start
INFO: TEST test_hythread_thin_monitor_enter_contended: PASSED
## TEST PASSED
## Executing C unit test: test_ti_instrum
INFO: TEST test_jthread_get_all_threads start
INFO: TEST test_jthread_get_all_threads: PASSED
INFO: TEST test_jthread_get_thread_count start
INFO: TEST test_jthread_get_thread_count: PASSED
INFO: TEST test_jthread_get_blocked_count start
INFO: TEST test_jthread_get_blocked_count: PASSED
## TEST PASSED
## Executing C unit test: test_ti_local_storage
INFO: TEST test_jthread_set_and_get_local_storage start
INFO: TEST test_jthread_set_and_get_local_storage: PASSED
## TEST PASSED
## Executing C unit test: test_ti_monitor_info
INFO: TEST test_jthread_get_contended_monitor start
INFO: TEST test_jthread_get_contended_monitor: PASSED
INFO: TEST test_jthread_holds_lock start
INFO: TEST test_jthread_holds_lock: PASSED
INFO: TEST test_jthread_get_lock_owner start
INFO: TEST test_jthread_get_lock_owner: PASSED
INFO: TEST test_jthread_get_owned_monitors start
INFO: TEST test_jthread_get_owned_monitors: PASSED
## TEST PASSED
## Executing C unit test: test_ti_peak_count
## TEST PASSED
## Executing C unit test: test_ti_raw_monitors
INFO: TEST test_jthread_raw_monitor_create start
INFO: TEST test_jthread_raw_monitor_create: PASSED
INFO: TEST test_jthread_raw_monitor_destroy start
INFO: TEST test_jthread_raw_monitor_destroy: PASSED
INFO: TEST test_jthread_raw_monitor_enter start
INFO: TEST test_jthread_raw_monitor_enter: PASSED
INFO: TEST test_jthread_raw_monitor_try_enter start
INFO: TEST test_jthread_raw_monitor_try_enter: PASSED
INFO: TEST test_jthread_raw_monitor_exit start
INFO: TEST test_jthread_raw_monitor_exit: PASSED
## TEST PASSED
## Executing C unit test: test_ti_state
INFO: TEST test_jthread_get_jvmti_state_6 start
state = 00000002 (00000002)
state = 00000002 (00000002)
state = 00000002 (00000002)
state = 00000002 (00000002)
state = 00000002 (00000002)
INFO: TEST test_jthread_get_jvmti_state_6: PASSED
## TEST PASSED
## Executing C unit test: test_ti_timing
## TEST PASSED
## Please find tests and results at /export/cruise/trunk/cc/projects/drlvm/trunk/build/lnx_ia32_gcc_debug/semis/vm/_cunit.tests/
Note: /export/cruise/trunk/cc/projects/drlvm/trunk/vm/tests/smoke/gc/RunFinalizersOnExitTest.java uses or overrides a deprecated API.
Note: Recompile with -Xlint:deprecation for details.
Note: Some input files use unchecked or unsafe operations.
Note: Recompile with -Xlint:unchecked for details.
Compiling /export/cruise/trunk/cc/projects/drlvm/trunk/build/lnx_ia32_gcc_debug/semis/vm/_smoke.tests/natives/shutdown/TestDaemonOnWait
Compiling /export/cruise/trunk/cc/projects/drlvm/trunk/build/lnx_ia32_gcc_debug/semis/vm/_smoke.tests/natives/shutdown/TestFatalError
Compiling /export/cruise/trunk/cc/projects/drlvm/trunk/build/lnx_ia32_gcc_debug/semis/vm/_smoke.tests/natives/shutdown/TestInterrupt

        ==================================
        Smoke tests on interpreter
        ==================================
        

Using exclude file = /export/cruise/trunk/cc/projects/drlvm/trunk/build/make/excludes/exclude.drlvm_smoke.linux.x86.int   
        
Check.java
PerfCheck.java

# slow
gc/Mark.java

# HARMONY-2977
io/Integers.java

# fails on ubuntu 6

stress/Threads.java

# HARMONY-3917
gc/PhantomReferenceTest.java
gc/WeakReferenceTest.java

# HARMONY-3639
thread/ManyThreadsTest.java

# This stress test is very slow on interpreter
stress/Intern.java


                  
Running test : Hi
 PASSED : Hi
Running test : StackTest
 PASSED : StackTest
Running test : classloader.ClassTestGetDeclaringClass
 PASSED : classloader.ClassTestGetDeclaringClass
Running test : classloader.ExceptionInInitializerTest
 PASSED : classloader.ExceptionInInitializerTest
Running test : classloader.LogLoader
 PASSED : classloader.LogLoader
Running test : classloader.NotFound
 PASSED : classloader.NotFound
Running test : classloader.StressLoader
 PASSED : classloader.StressLoader
Running test : exception.ExceptionStackTest
 PASSED : exception.ExceptionStackTest
Running test : exception.FinalizeStackTest
 PASSED : exception.FinalizeStackTest
Running test : exception.NPE
 PASSED : exception.NPE
Running test : gc.FinAlloc
 PASSED : gc.FinAlloc
Running test : gc.Finalizer
 PASSED : gc.Finalizer
Running test : gc.Force
 PASSED : gc.Force
Running test : gc.Fragment
 PASSED : gc.Fragment
Running test : gc.Free
 PASSED : gc.Free
Running test : gc.LOS
 PASSED : gc.LOS
Running test : gc.List
 PASSED : gc.List
Running test : gc.MultiThreads
 PASSED : gc.MultiThreads
Running test : gc.NPE
 PASSED : gc.NPE
Running test : gc.PhantomReferenceQueueTest
 PASSED : gc.PhantomReferenceQueueTest
Running test : gc.RefRemove
 PASSED : gc.RefRemove
Running test : gc.RunFinalizersOnExitTest
 PASSED : gc.RunFinalizersOnExitTest
Running test : gc.StressRef
 PASSED : gc.StressRef
Running test : gc.SynchronizedFinalizersTest
 PASSED : gc.SynchronizedFinalizersTest
Running test : gc.ThreadSuspension
 PASSED : gc.ThreadSuspension
Running test : init.ErrorInInitializer
 PASSED : init.ErrorInInitializer
Running test : init.Other
 PASSED : init.Other
Running test : io.ArrayList
 PASSED : io.ArrayList
Running test : jni.LoadLibrary
 PASSED : jni.LoadLibrary
Running test : outofmemory.Double
 PASSED : outofmemory.Double
Running test : outofmemory.Int
 PASSED : outofmemory.Int
Running test : outofmemory.Plain
 PASSED : outofmemory.Plain
Running test : outofmemory.Ref
 PASSED : outofmemory.Ref
Running test : outofmemory.Throw
 PASSED : outofmemory.Throw
Running test : outofmemory.Vector
 PASSED : outofmemory.Vector
Running test : outofmemory.VectorDouble
 PASSED : outofmemory.VectorDouble
Running test : outofmemory.VectorInt
 PASSED : outofmemory.VectorInt
Running test : outofmemory.VectorRef
 PASSED : outofmemory.VectorRef
Running test : perf.CreateManyExceptions
 PASSED : perf.CreateManyExceptions
Running test : perf.CreateManyExceptions_depth
 PASSED : perf.CreateManyExceptions_depth
Running test : perf.MultiThreadsSimple
 PASSED : perf.MultiThreadsSimple
Running test : perf.SeveralThreads
 PASSED : perf.SeveralThreads
Running test : perf.StressCornerSize
 PASSED : perf.StressCornerSize
Running test : perf.StressCornerSize_a
 PASSED : perf.StressCornerSize_a
Running test : perf.ThrowMany
 PASSED : perf.ThrowMany
Running test : perf.ThrowManyExceptions
 PASSED : perf.ThrowManyExceptions
Running test : perf.ThrowManyExceptions_depth
 PASSED : perf.ThrowManyExceptions_depth
Running test : perf.ThrowMany_depth
 PASSED : perf.ThrowMany_depth
Running test : reflect.GetMethod
 PASSED : reflect.GetMethod
Running test : shutdown.TestDaemonOnWait
 PASSED : shutdown.TestDaemonOnWait
Running test : shutdown.TestFatalError
 PASSED : shutdown.TestFatalError
Running test : shutdown.TestInterrupt
 PASSED : shutdown.TestInterrupt
Running test : shutdown.TestLock
 PASSED : shutdown.TestLock
Running test : stress.BigStringBuffer
 PASSED : stress.BigStringBuffer
Running test : stress.Finalizer
 PASSED : stress.Finalizer
Running test : stress.Mix
 PASSED : stress.Mix
Running test : stress.Stack
 PASSED : stress.Stack
Running test : stress.Sync
 PASSED : stress.Sync
Running test : stress.Vector
 PASSED : stress.Vector
Running test : stress.WeakHashmapTest
 PASSED : stress.WeakHashmapTest
Running test : thread.ExitShutdownHook
 PASSED : thread.ExitShutdownHook
Running test : thread.InfiniteFinalizer
 PASSED : thread.InfiniteFinalizer
Running test : thread.InterruptWait
 PASSED : thread.InterruptWait
Running test : thread.Sleep
 PASSED : thread.Sleep
Running test : thread.SmallStackThreadTest
 PASSED : thread.SmallStackThreadTest
Running test : thread.ThreadInterrupt
 PASSED : thread.ThreadInterrupt
Running test : thread.ThreadOOM
 PASSED : thread.ThreadOOM
Running test : util.Date
 PASSED : util.Date
Running test : util.DoPriveleged
 PASSED : util.DoPriveleged
Running test : util.Prop
 PASSED : util.Prop
Running test : util.StringIntern
 PASSED : util.StringIntern
Please find test classes and results at /export/cruise/trunk/cc/projects/drlvm/trunk/build/lnx_ia32_gcc_debug/semis/vm/_smoke.tests/

        ==================================
        Smoke tests on Client mode JIT (default)
        ==================================
        

Using exclude file = /export/cruise/trunk/cc/projects/drlvm/trunk/build/make/excludes/exclude.drlvm_smoke.linux.x86.jit   
        
Check.java
PerfCheck.java

# breaks on ubuntu 6 w/ OOME
stress/Threads.java

# HARMONY-3495 hangs intermittently
gc/NPE.java

# HARMONY-3917
gc/PhantomReferenceTest.java
gc/WeakReferenceTest.java

# HARMONY-3639
thread/ManyThreadsTest.java


                  
Running test : Hi
 PASSED : Hi
Running test : StackTest
 PASSED : StackTest
Running test : classloader.ClassTestGetDeclaringClass
 PASSED : classloader.ClassTestGetDeclaringClass
Running test : classloader.ExceptionInInitializerTest
 PASSED : classloader.ExceptionInInitializerTest
Running test : classloader.LogLoader
 PASSED : classloader.LogLoader
Running test : classloader.NotFound
 PASSED : classloader.NotFound
Running test : classloader.StressLoader
 PASSED : classloader.StressLoader
Running test : exception.ExceptionStackTest
 PASSED : exception.ExceptionStackTest
Running test : exception.FinalizeStackTest
 PASSED : exception.FinalizeStackTest
Running test : exception.NPE
 PASSED : exception.NPE
Running test : gc.FinAlloc
 PASSED : gc.FinAlloc
Running test : gc.Finalizer
 PASSED : gc.Finalizer
Running test : gc.Force
 PASSED : gc.Force
Running test : gc.Fragment
 PASSED : gc.Fragment
Running test : gc.Free
 PASSED : gc.Free
Running test : gc.LOS
 PASSED : gc.LOS
Running test : gc.List
 PASSED : gc.List
Running test : gc.Mark
 PASSED : gc.Mark
Running test : gc.MultiThreads
 PASSED : gc.MultiThreads
Running test : gc.PhantomReferenceQueueTest
 PASSED : gc.PhantomReferenceQueueTest
Running test : gc.RefRemove
 PASSED : gc.RefRemove
Running test : gc.RunFinalizersOnExitTest
 PASSED : gc.RunFinalizersOnExitTest
Running test : gc.StressRef
 PASSED : gc.StressRef
Running test : gc.SynchronizedFinalizersTest
 PASSED : gc.SynchronizedFinalizersTest
Running test : gc.ThreadSuspension
 PASSED : gc.ThreadSuspension
Running test : init.ErrorInInitializer
 PASSED : init.ErrorInInitializer
Running test : init.Other
 PASSED : init.Other
Running test : io.ArrayList
 PASSED : io.ArrayList
Running test : io.Integers
 PASSED : io.Integers
Running test : jni.LoadLibrary
 PASSED : jni.LoadLibrary
Running test : outofmemory.Double
 PASSED : outofmemory.Double
Running test : outofmemory.Int
 PASSED : outofmemory.Int
Running test : outofmemory.Plain
 PASSED : outofmemory.Plain
Running test : outofmemory.Ref
 PASSED : outofmemory.Ref
Running test : outofmemory.Throw
 PASSED : outofmemory.Throw
Running test : outofmemory.Vector
 PASSED : outofmemory.Vector
Running test : outofmemory.VectorDouble
 PASSED : outofmemory.VectorDouble
Running test : outofmemory.VectorInt
 PASSED : outofmemory.VectorInt
Running test : outofmemory.VectorRef
 PASSED : outofmemory.VectorRef
Running test : perf.CreateManyExceptions
 PASSED : perf.CreateManyExceptions
Running test : perf.CreateManyExceptions_depth
 PASSED : perf.CreateManyExceptions_depth
Running test : perf.MultiThreadsSimple
 PASSED : perf.MultiThreadsSimple
Running test : perf.SeveralThreads
 PASSED : perf.SeveralThreads
Running test : perf.StressCornerSize
 PASSED : perf.StressCornerSize
Running test : perf.StressCornerSize_a
 PASSED : perf.StressCornerSize_a
Running test : perf.ThrowMany
 PASSED : perf.ThrowMany
Running test : perf.ThrowManyExceptions
 PASSED : perf.ThrowManyExceptions
Running test : perf.ThrowManyExceptions_depth
 PASSED : perf.ThrowManyExceptions_depth
Running test : perf.ThrowMany_depth
 PASSED : perf.ThrowMany_depth
Running test : reflect.GetMethod
 PASSED : reflect.GetMethod
Running test : shutdown.TestDaemonOnWait
 PASSED : shutdown.TestDaemonOnWait
Running test : shutdown.TestFatalError
 PASSED : shutdown.TestFatalError
Running test : shutdown.TestInterrupt
 PASSED : shutdown.TestInterrupt
Running test : shutdown.TestLock
 PASSED : shutdown.TestLock
Running test : stress.BigStringBuffer
 PASSED : stress.BigStringBuffer
Running test : stress.Finalizer
 PASSED : stress.Finalizer
Running test : stress.Intern
 PASSED : stress.Intern
Running test : stress.Mix
 PASSED : stress.Mix
Running test : stress.Stack
 PASSED : stress.Stack
Running test : stress.Sync
 PASSED : stress.Sync
Running test : stress.Vector
 PASSED : stress.Vector
Running test : stress.WeakHashmapTest
 PASSED : stress.WeakHashmapTest
Running test : thread.ExitShutdownHook
 PASSED : thread.ExitShutdownHook
Running test : thread.InfiniteFinalizer
 PASSED : thread.InfiniteFinalizer
Running test : thread.InterruptWait
 PASSED : thread.InterruptWait
Running test : thread.Sleep
 PASSED : thread.Sleep
Running test : thread.SmallStackThreadTest
 PASSED : thread.SmallStackThreadTest
Running test : thread.ThreadInterrupt
 PASSED : thread.ThreadInterrupt
Running test : thread.ThreadOOM
 PASSED : thread.ThreadOOM
Running test : util.Date
 PASSED : util.Date
Running test : util.DoPriveleged
 PASSED : util.DoPriveleged
Running test : util.Prop
 PASSED : util.Prop
Running test : util.StringIntern
 PASSED : util.StringIntern
Please find test classes and results at /export/cruise/trunk/cc/projects/drlvm/trunk/build/lnx_ia32_gcc_debug/semis/vm/_smoke.tests/

        ==================================
        Smoke tests on jitrino.JET
        ==================================
        

Using exclude file = /export/cruise/trunk/cc/projects/drlvm/trunk/build/make/excludes/exclude.drlvm_smoke.linux.x86.jet   
        
Check.java
PerfCheck.java

# breaks on ubuntu 6 w/ OOME
stress/Threads.java

# HARMONY-3495 hangs intermittently
gc/NPE.java

# HARMONY-3917
gc/PhantomReferenceTest.java
gc/WeakReferenceTest.java

# HARMONY-3639
thread/ManyThreadsTest.java


                  
Running test : Hi
 PASSED : Hi
Running test : StackTest
 PASSED : StackTest
Running test : classloader.ClassTestGetDeclaringClass
 PASSED : classloader.ClassTestGetDeclaringClass
Running test : classloader.ExceptionInInitializerTest
 PASSED : classloader.ExceptionInInitializerTest
Running test : classloader.LogLoader
 PASSED : classloader.LogLoader
Running test : classloader.NotFound
 PASSED : classloader.NotFound
Running test : classloader.StressLoader
 PASSED : classloader.StressLoader
Running test : exception.ExceptionStackTest
 PASSED : exception.ExceptionStackTest
Running test : exception.FinalizeStackTest
 PASSED : exception.FinalizeStackTest
Running test : exception.NPE
 PASSED : exception.NPE
Running test : gc.FinAlloc
 PASSED : gc.FinAlloc
Running test : gc.Finalizer
 PASSED : gc.Finalizer
Running test : gc.Force
 PASSED : gc.Force
Running test : gc.Fragment
 PASSED : gc.Fragment
Running test : gc.Free
 PASSED : gc.Free
Running test : gc.LOS
 PASSED : gc.LOS
Running test : gc.List
 PASSED : gc.List
Running test : gc.Mark
 PASSED : gc.Mark
Running test : gc.MultiThreads
 PASSED : gc.MultiThreads
Running test : gc.PhantomReferenceQueueTest
 PASSED : gc.PhantomReferenceQueueTest
Running test : gc.RefRemove
 PASSED : gc.RefRemove
Running test : gc.RunFinalizersOnExitTest
 PASSED : gc.RunFinalizersOnExitTest
Running test : gc.StressRef
 PASSED : gc.StressRef
Running test : gc.SynchronizedFinalizersTest
 PASSED : gc.SynchronizedFinalizersTest
Running test : gc.ThreadSuspension
 PASSED : gc.ThreadSuspension
Running test : init.ErrorInInitializer
 PASSED : init.ErrorInInitializer
Running test : init.Other
 PASSED : init.Other
Running test : io.ArrayList
 PASSED : io.ArrayList
Running test : io.Integers
 PASSED : io.Integers
Running test : jni.LoadLibrary
 PASSED : jni.LoadLibrary
Running test : outofmemory.Double
 PASSED : outofmemory.Double
Running test : outofmemory.Int
 PASSED : outofmemory.Int
Running test : outofmemory.Plain
 PASSED : outofmemory.Plain
Running test : outofmemory.Ref
 PASSED : outofmemory.Ref
Running test : outofmemory.Throw
 PASSED : outofmemory.Throw
Running test : outofmemory.Vector
 PASSED : outofmemory.Vector
Running test : outofmemory.VectorDouble
 PASSED : outofmemory.VectorDouble
Running test : outofmemory.VectorInt
 PASSED : outofmemory.VectorInt
Running test : outofmemory.VectorRef
 PASSED : outofmemory.VectorRef
Running test : perf.CreateManyExceptions
 PASSED : perf.CreateManyExceptions
Running test : perf.CreateManyExceptions_depth
 PASSED : perf.CreateManyExceptions_depth
Running test : perf.MultiThreadsSimple
 PASSED : perf.MultiThreadsSimple
Running test : perf.SeveralThreads
 PASSED : perf.SeveralThreads
Running test : perf.StressCornerSize
 PASSED : perf.StressCornerSize
Running test : perf.StressCornerSize_a
 PASSED : perf.StressCornerSize_a
Running test : perf.ThrowMany
 PASSED : perf.ThrowMany
Running test : perf.ThrowManyExceptions
 PASSED : perf.ThrowManyExceptions
Running test : perf.ThrowManyExceptions_depth
 PASSED : perf.ThrowManyExceptions_depth
Running test : perf.ThrowMany_depth
 PASSED : perf.ThrowMany_depth
Running test : reflect.GetMethod
 PASSED : reflect.GetMethod
Running test : shutdown.TestDaemonOnWait
 PASSED : shutdown.TestDaemonOnWait
Running test : shutdown.TestFatalError
 PASSED : shutdown.TestFatalError
Running test : shutdown.TestInterrupt
 PASSED : shutdown.TestInterrupt
Running test : shutdown.TestLock
 PASSED : shutdown.TestLock
Running test : stress.BigStringBuffer
 PASSED : stress.BigStringBuffer
Running test : stress.Finalizer
 PASSED : stress.Finalizer
Running test : stress.Intern
 PASSED : stress.Intern
Running test : stress.Mix
 PASSED : stress.Mix
Running test : stress.Stack
 PASSED : stress.Stack
Running test : stress.Sync
 PASSED : stress.Sync
Running test : stress.Vector
 PASSED : stress.Vector
Running test : stress.WeakHashmapTest
 PASSED : stress.WeakHashmapTest
Running test : thread.ExitShutdownHook
 PASSED : thread.ExitShutdownHook
Running test : thread.InfiniteFinalizer
 PASSED : thread.InfiniteFinalizer
Running test : thread.InterruptWait
 PASSED : thread.InterruptWait
Running test : thread.Sleep
 PASSED : thread.Sleep
Running test : thread.SmallStackThreadTest
 PASSED : thread.SmallStackThreadTest
Running test : thread.ThreadInterrupt
 PASSED : thread.ThreadInterrupt
Running test : thread.ThreadOOM
 PASSED : thread.ThreadOOM
Running test : util.Date
 PASSED : util.Date
Running test : util.DoPriveleged
 PASSED : util.DoPriveleged
Running test : util.Prop
 PASSED : util.Prop
Running test : util.StringIntern
 PASSED : util.StringIntern
Please find test classes and results at /export/cruise/trunk/cc/projects/drlvm/trunk/build/lnx_ia32_gcc_debug/semis/vm/_smoke.tests/

        ==================================
        Smoke tests on jitrino.OPT
        ==================================
        

Using exclude file = /export/cruise/trunk/cc/projects/drlvm/trunk/build/make/excludes/exclude.drlvm_smoke.linux.x86.opt   
        
Check.java
PerfCheck.java

# breaks on ubuntu 6 w/ OOME
stress/Threads.java

# HARMONY-3495 hangs intermittently
gc/NPE.java

# HARMONY-3917
gc/PhantomReferenceTest.java
gc/WeakReferenceTest.java

# HARMONY-3639
thread/ManyThreadsTest.java


                  
Running test : Hi
 PASSED : Hi
Running test : StackTest
 PASSED : StackTest
Running test : classloader.ClassTestGetDeclaringClass
 PASSED : classloader.ClassTestGetDeclaringClass
Running test : classloader.ExceptionInInitializerTest
 PASSED : classloader.ExceptionInInitializerTest
Running test : classloader.LogLoader
 PASSED : classloader.LogLoader
Running test : classloader.NotFound
 PASSED : classloader.NotFound
Running test : classloader.StressLoader
 PASSED : classloader.StressLoader
Running test : exception.ExceptionStackTest
 PASSED : exception.ExceptionStackTest
Running test : exception.FinalizeStackTest
 PASSED : exception.FinalizeStackTest
Running test : exception.NPE
 PASSED : exception.NPE
Running test : gc.FinAlloc
 PASSED : gc.FinAlloc
Running test : gc.Finalizer
 PASSED : gc.Finalizer
Running test : gc.Force
 PASSED : gc.Force
Running test : gc.Fragment
 PASSED : gc.Fragment
Running test : gc.Free
 PASSED : gc.Free
Running test : gc.LOS
 PASSED : gc.LOS
Running test : gc.List
 PASSED : gc.List
Running test : gc.Mark
 PASSED : gc.Mark
Running test : gc.MultiThreads
 PASSED : gc.MultiThreads
Running test : gc.PhantomReferenceQueueTest
 PASSED : gc.PhantomReferenceQueueTest
Running test : gc.RefRemove
 PASSED : gc.RefRemove
Running test : gc.RunFinalizersOnExitTest
 PASSED : gc.RunFinalizersOnExitTest
Running test : gc.StressRef
 PASSED : gc.StressRef
Running test : gc.SynchronizedFinalizersTest
 PASSED : gc.SynchronizedFinalizersTest
Running test : gc.ThreadSuspension
 PASSED : gc.ThreadSuspension
Running test : init.ErrorInInitializer
 PASSED : init.ErrorInInitializer
Running test : init.Other
 PASSED : init.Other
Running test : io.ArrayList
 PASSED : io.ArrayList
Running test : io.Integers
 PASSED : io.Integers
Running test : jni.LoadLibrary
 PASSED : jni.LoadLibrary
Running test : outofmemory.Double
 PASSED : outofmemory.Double
Running test : outofmemory.Int
 PASSED : outofmemory.Int
Running test : outofmemory.Plain
 PASSED : outofmemory.Plain
Running test : outofmemory.Ref
 PASSED : outofmemory.Ref
Running test : outofmemory.Throw
 PASSED : outofmemory.Throw
Running test : outofmemory.Vector
 PASSED : outofmemory.Vector
Running test : outofmemory.VectorDouble
 PASSED : outofmemory.VectorDouble
Running test : outofmemory.VectorInt
 PASSED : outofmemory.VectorInt
Running test : outofmemory.VectorRef
 PASSED : outofmemory.VectorRef
Running test : perf.CreateManyExceptions
 PASSED : perf.CreateManyExceptions
Running test : perf.CreateManyExceptions_depth
 PASSED : perf.CreateManyExceptions_depth
Running test : perf.MultiThreadsSimple
 PASSED : perf.MultiThreadsSimple
Running test : perf.SeveralThreads
 PASSED : perf.SeveralThreads
Running test : perf.StressCornerSize
 PASSED : perf.StressCornerSize
Running test : perf.StressCornerSize_a
 PASSED : perf.StressCornerSize_a
Running test : perf.ThrowMany
 PASSED : perf.ThrowMany
Running test : perf.ThrowManyExceptions
 PASSED : perf.ThrowManyExceptions
Running test : perf.ThrowManyExceptions_depth
 PASSED : perf.ThrowManyExceptions_depth
Running test : perf.ThrowMany_depth
 PASSED : perf.ThrowMany_depth
Running test : reflect.GetMethod
 PASSED : reflect.GetMethod
Running test : shutdown.TestDaemonOnWait
 PASSED : shutdown.TestDaemonOnWait
Running test : shutdown.TestFatalError
 PASSED : shutdown.TestFatalError
Running test : shutdown.TestInterrupt
 PASSED : shutdown.TestInterrupt
Running test : shutdown.TestLock
 PASSED : shutdown.TestLock
Running test : stress.BigStringBuffer
 PASSED : stress.BigStringBuffer
Running test : stress.Finalizer
 PASSED : stress.Finalizer
Running test : stress.Intern
 PASSED : stress.Intern
Running test : stress.Mix
 PASSED : stress.Mix
Running test : stress.Stack
 PASSED : stress.Stack
Running test : stress.Sync
 PASSED : stress.Sync
Running test : stress.Vector
 PASSED : stress.Vector
Running test : stress.WeakHashmapTest
 PASSED : stress.WeakHashmapTest
Running test : thread.ExitShutdownHook
 PASSED : thread.ExitShutdownHook
Running test : thread.InfiniteFinalizer
 PASSED : thread.InfiniteFinalizer
Running test : thread.InterruptWait
 PASSED : thread.InterruptWait
Running test : thread.Sleep
 PASSED : thread.Sleep
Running test : thread.SmallStackThreadTest
*** FAILED **** : thread.SmallStackThreadTest (134 res code)
Running test : thread.ThreadInterrupt
 PASSED : thread.ThreadInterrupt
Running test : thread.ThreadOOM
 PASSED : thread.ThreadOOM
Running test : util.Date
 PASSED : util.Date
Running test : util.DoPriveleged
 PASSED : util.DoPriveleged
Running test : util.Prop
 PASSED : util.Prop
Running test : util.StringIntern
 PASSED : util.StringIntern
Please find test classes and results at /export/cruise/trunk/cc/projects/drlvm/trunk/build/lnx_ia32_gcc_debug/semis/vm/_smoke.tests/

        ==================================
        Smoke tests on Server mode JIT
        ==================================
        

Using exclude file = /export/cruise/trunk/cc/projects/drlvm/trunk/build/make/excludes/exclude.drlvm_smoke.linux.x86.srv   
        
Check.java
PerfCheck.java

# breaks on ubuntu 6 w/ OOME
stress/Threads.java

# HARMONY-3495 hangs intermittently
gc/NPE.java

# HARMONY-3731
StackTest.java

# HARMONY-3917
gc/PhantomReferenceTest.java
gc/WeakReferenceTest.java

# HARMONY-3639
thread/ManyThreadsTest.java


                  
Running test : Hi
 PASSED : Hi
Running test : classloader.ClassTestGetDeclaringClass
 PASSED : classloader.ClassTestGetDeclaringClass
Running test : classloader.ExceptionInInitializerTest
 PASSED : classloader.ExceptionInInitializerTest
Running test : classloader.LogLoader
 PASSED : classloader.LogLoader
Running test : classloader.NotFound
 PASSED : classloader.NotFound
Running test : classloader.StressLoader
 PASSED : classloader.StressLoader
Running test : exception.ExceptionStackTest
 PASSED : exception.ExceptionStackTest
Running test : exception.FinalizeStackTest
 PASSED : exception.FinalizeStackTest
Running test : exception.NPE
 PASSED : exception.NPE
Running test : gc.FinAlloc
 PASSED : gc.FinAlloc
Running test : gc.Finalizer
 PASSED : gc.Finalizer
Running test : gc.Force
 PASSED : gc.Force
Running test : gc.Fragment
 PASSED : gc.Fragment
Running test : gc.Free
 PASSED : gc.Free
Running test : gc.LOS
 PASSED : gc.LOS
Running test : gc.List
 PASSED : gc.List
Running test : gc.Mark
 PASSED : gc.Mark
Running test : gc.MultiThreads
 PASSED : gc.MultiThreads
Running test : gc.PhantomReferenceQueueTest
 PASSED : gc.PhantomReferenceQueueTest
Running test : gc.RefRemove
 PASSED : gc.RefRemove
Running test : gc.RunFinalizersOnExitTest
 PASSED : gc.RunFinalizersOnExitTest
Running test : gc.StressRef
 PASSED : gc.StressRef
Running test : gc.SynchronizedFinalizersTest
 PASSED : gc.SynchronizedFinalizersTest
Running test : gc.ThreadSuspension
 PASSED : gc.ThreadSuspension
Running test : init.ErrorInInitializer
 PASSED : init.ErrorInInitializer
Running test : init.Other
 PASSED : init.Other
Running test : io.ArrayList
 PASSED : io.ArrayList
Running test : io.Integers
 PASSED : io.Integers
Running test : jni.LoadLibrary
 PASSED : jni.LoadLibrary
Running test : outofmemory.Double
 PASSED : outofmemory.Double
Running test : outofmemory.Int
 PASSED : outofmemory.Int
Running test : outofmemory.Plain
 PASSED : outofmemory.Plain
Running test : outofmemory.Ref
 PASSED : outofmemory.Ref
Running test : outofmemory.Throw
 PASSED : outofmemory.Throw
Running test : outofmemory.Vector
 PASSED : outofmemory.Vector
Running test : outofmemory.VectorDouble
 PASSED : outofmemory.VectorDouble
Running test : outofmemory.VectorInt
 PASSED : outofmemory.VectorInt
Running test : outofmemory.VectorRef
 PASSED : outofmemory.VectorRef
Running test : perf.CreateManyExceptions
 PASSED : perf.CreateManyExceptions
Running test : perf.CreateManyExceptions_depth
 PASSED : perf.CreateManyExceptions_depth
Running test : perf.MultiThreadsSimple
 PASSED : perf.MultiThreadsSimple
Running test : perf.SeveralThreads
 PASSED : perf.SeveralThreads
Running test : perf.StressCornerSize
 PASSED : perf.StressCornerSize
Running test : perf.StressCornerSize_a
 PASSED : perf.StressCornerSize_a
Running test : perf.ThrowMany
 PASSED : perf.ThrowMany
Running test : perf.ThrowManyExceptions
 PASSED : perf.ThrowManyExceptions
Running test : perf.ThrowManyExceptions_depth
 PASSED : perf.ThrowManyExceptions_depth
Running test : perf.ThrowMany_depth
 PASSED : perf.ThrowMany_depth
Running test : reflect.GetMethod
 PASSED : reflect.GetMethod
Running test : shutdown.TestDaemonOnWait
 PASSED : shutdown.TestDaemonOnWait
Running test : shutdown.TestFatalError
 PASSED : shutdown.TestFatalError
Running test : shutdown.TestInterrupt
 PASSED : shutdown.TestInterrupt
Running test : shutdown.TestLock
 PASSED : shutdown.TestLock
Running test : stress.BigStringBuffer
 PASSED : stress.BigStringBuffer
Running test : stress.Finalizer
 PASSED : stress.Finalizer
Running test : stress.Intern
 PASSED : stress.Intern
Running test : stress.Mix
 PASSED : stress.Mix
Running test : stress.Stack
 PASSED : stress.Stack
Running test : stress.Sync
 PASSED : stress.Sync
Running test : stress.Vector
 PASSED : stress.Vector
Running test : stress.WeakHashmapTest
 PASSED : stress.WeakHashmapTest
Running test : thread.ExitShutdownHook
 PASSED : thread.ExitShutdownHook
Running test : thread.InfiniteFinalizer
 PASSED : thread.InfiniteFinalizer
Running test : thread.InterruptWait
 PASSED : thread.InterruptWait
Running test : thread.Sleep
 PASSED : thread.Sleep
Running test : thread.SmallStackThreadTest
 PASSED : thread.SmallStackThreadTest
Running test : thread.ThreadInterrupt
 PASSED : thread.ThreadInterrupt
Running test : thread.ThreadOOM
 PASSED : thread.ThreadOOM
Running test : util.Date
 PASSED : util.Date
Running test : util.DoPriveleged
 PASSED : util.DoPriveleged
Running test : util.Prop
 PASSED : util.Prop
Running test : util.StringIntern
 PASSED : util.StringIntern
Please find test classes and results at /export/cruise/trunk/cc/projects/drlvm/trunk/build/lnx_ia32_gcc_debug/semis/vm/_smoke.tests/
The test report is in /export/cruise/trunk/cc/projects/drlvm/trunk/build/lnx_ia32_gcc_debug/semis/vm/_smoke.tests/reports/html/index.html
Note: Some input files use or override a deprecated API.
Note: Recompile with -Xlint:deprecation for details.
Note: /export/cruise/trunk/cc/projects/drlvm/trunk/vm/tests/kernel/java/lang/ClassAnnotationsTest.java uses unchecked or unsafe operations.
Note: Recompile with -Xlint:unchecked for details.

        ==================================
        Run kernel tests using interpreter
        ==================================
        

Using exclude file = /export/cruise/trunk/cc/projects/drlvm/trunk/build/make/excludes/exclude.drlvm_kernel.linux.x86.int   
        
## These tests are too slow
java/lang/RuntimeAdditionalTest*.java

## Tese tests are unstable and hang often
java/lang/RuntimeAdditionalTest11.java
java/lang/RuntimeAdditionalTest34.java
java/lang/RuntimeAdditionalTest39.java
java/lang/RuntimeAdditionalTest40.java
java/lang/RuntimeAdditionalTest41.java
java/lang/RuntimeAdditionalTest42.java

                  
The GC did not provide gc_add_weak_root_set_entry()

        ==================================
        Run kernel tests using Client mode JIT (default)
        ==================================
        

Using exclude file = /export/cruise/trunk/cc/projects/drlvm/trunk/build/make/excludes/exclude.drlvm_kernel.linux.x86.jit   
        
## These tests are too slow
java/lang/RuntimeAdditionalTest*.java

## Tese tests are unstable and hang often
java/lang/RuntimeAdditionalTest11.java
java/lang/RuntimeAdditionalTest34.java
java/lang/RuntimeAdditionalTest39.java
java/lang/RuntimeAdditionalTest40.java
java/lang/RuntimeAdditionalTest41.java
java/lang/RuntimeAdditionalTest42.java


                  
The GC did not provide gc_add_weak_root_set_entry()

        ==================================
        Run kernel tests using jitrino.JET
        ==================================
        

Using exclude file = /export/cruise/trunk/cc/projects/drlvm/trunk/build/make/excludes/exclude.drlvm_kernel.linux.x86.jet   
        
## These tests are too slow
java/lang/RuntimeAdditionalTest*.java

## Tese tests are unstable and hang often
java/lang/RuntimeAdditionalTest11.java
java/lang/RuntimeAdditionalTest34.java
java/lang/RuntimeAdditionalTest39.java
java/lang/RuntimeAdditionalTest40.java
java/lang/RuntimeAdditionalTest41.java
java/lang/RuntimeAdditionalTest42.java


                  
The GC did not provide gc_add_weak_root_set_entry()

        ==================================
        Run kernel tests using jitrino.OPT
        ==================================
        

Using exclude file = /export/cruise/trunk/cc/projects/drlvm/trunk/build/make/excludes/exclude.drlvm_kernel.linux.x86.opt   
        
## These tests are too slow
java/lang/RuntimeAdditionalTest*.java

## Tese tests are unstable and hang often
java/lang/RuntimeAdditionalTest11.java
java/lang/RuntimeAdditionalTest34.java
java/lang/RuntimeAdditionalTest39.java
java/lang/RuntimeAdditionalTest40.java
java/lang/RuntimeAdditionalTest41.java
java/lang/RuntimeAdditionalTest42.java


                  
The GC did not provide gc_add_weak_root_set_entry()

        ==================================
        Run kernel tests using Server mode JIT
        ==================================
        

Using exclude file = /export/cruise/trunk/cc/projects/drlvm/trunk/build/make/excludes/exclude.drlvm_kernel.linux.x86.srv   
        
## These tests are too slow
java/lang/RuntimeAdditionalTest*.java

## Tese tests are unstable and hang often
java/lang/RuntimeAdditionalTest11.java
java/lang/RuntimeAdditionalTest34.java
java/lang/RuntimeAdditionalTest39.java
java/lang/RuntimeAdditionalTest40.java
java/lang/RuntimeAdditionalTest41.java
java/lang/RuntimeAdditionalTest42.java


                  
The GC did not provide gc_add_weak_root_set_entry()
  ***************************
  *** Kernel tests status ***
  ***************************
      interpreter PASSED
      Client mode JIT (default) PASSED
      jitrino.JET PASSED
      jitrino.OPT PASSED
      Server mode JIT PASSED
Please find detailed results under /export/cruise/trunk/cc/projects/drlvm/trunk/build/lnx_ia32_gcc_debug/semis/kernel.tests/reports directory.

***********************************************************
Unit Tests: (4343)
        
error: test thread.SmallStackThreadTest_opt
Unit Test Error Details:	(1)
                
Test: testClass: thread.SmallStackThreadTest_opt

***********************************************************
Modifications since last successful build:	(19)
            
modified apetrenko  /harmony/enhanced/classlib/trunk/modules/awt/src/main/java/common/org/apache/harmony/awt/gl/ImageSurface.java 08/03/2007 14:35:44 ImageSurface.dispose method has been synchronized to avoid double freeing
modified wjwashburn  /harmony/enhanced/drlvm/trunk/vm/thread/src/thread_native_thin_monitor.c 08/03/2007 12:37:45 harmony-4298 -- this patch fixes bugs in the fat lock table (need to alsoclose H-2742
modified wjwashburn  /harmony/enhanced/drlvm/trunk/vm/thread/src/thread_private.h 08/03/2007 12:37:45 harmony-4298 -- this patch fixes bugs in the fat lock table (need to alsoclose H-2742
modified wjwashburn  /harmony/enhanced/drlvm/trunk/vm/thread/src/thread_init.c 08/03/2007 12:37:45 harmony-4298 -- this patch fixes bugs in the fat lock table (need to alsoclose H-2742
modified gshimansky  /harmony/enhanced/drlvm/trunk/vm/vmcore/src/util/em64t/base/jit_lock_rt_support_em64t.cpp 08/03/2007 04:41:45 Fixed compilation on x86_64 linux with gcc 4.1.2
modified gshimansky  /harmony/enhanced/drlvm/trunk/vm/vmcore/src/util/em64t/base/compile_em64t.cpp 08/03/2007 04:41:45 Fixed compilation on x86_64 linux with gcc 4.1.2
modified gshimansky  /harmony/enhanced/drlvm/trunk/vm/vmcore/src/thread/helpers/thread_helpers_em64t.cpp 08/03/2007 04:41:45 Fixed compilation on x86_64 linux with gcc 4.1.2
modified gshimansky  /harmony/enhanced/drlvm/trunk/vm/vmcore/src/exception/exceptions_jit.cpp 08/03/2007 04:39:09 Applied patch from HARMONY-4515[drlvm][classloader] ClassCastException is thrown with low detail
modified gshimansky  /harmony/enhanced/drlvm/trunk/vm/vmcore/include/Class.h 08/03/2007 04:39:09 Applied patch from HARMONY-4515[drlvm][classloader] ClassCastException is thrown with low detail
modified gshimansky  /harmony/enhanced/drlvm/trunk/vm/interpreter/src/interpreter.cpp 08/03/2007 04:39:09 Applied patch from HARMONY-4515[drlvm][classloader] ClassCastException is thrown with low detail
modified gshimansky  /harmony/enhanced/drlvm/trunk/vm/vmcore/src/jit/jit_runtime_support.cpp 08/03/2007 04:39:09 Applied patch from HARMONY-4515[drlvm][classloader] ClassCastException is thrown with low detail
modified gshimansky  /harmony/enhanced/drlvm/trunk/vm/tests/smoke/thread/ManyThreadsTest.java 08/03/2007 03:42:28 Setting svn:eol-style native to the tests
modified gshimansky  /harmony/enhanced/drlvm/trunk/vm/tests/smoke/shutdown/TestInterrupt.java 08/03/2007 03:42:28 Setting svn:eol-style native to the tests
modified gshimansky  /harmony/enhanced/drlvm/trunk/vm/tests/smoke/thread/InterruptWait.java 08/03/2007 03:42:28 Setting svn:eol-style native to the tests
modified gshimansky  /harmony/enhanced/drlvm/trunk/vm/tests/smoke/thread/ThreadOOM.java 08/03/2007 03:42:28 Setting svn:eol-style native to the tests
modified gshimansky  /harmony/enhanced/drlvm/trunk/vm/tests/smoke/shutdown/TestFatalError.java 08/03/2007 03:42:28 Setting svn:eol-style native to the tests
modified gshimansky  /harmony/enhanced/drlvm/trunk/vm/tests/smoke/thread/SmallStackThreadTest.java 08/03/2007 03:42:28 Setting svn:eol-style native to the tests
modified gshimansky  /harmony/enhanced/drlvm/trunk/vm/tests/smoke/exception/ExceptionStackTest.java 08/03/2007 03:42:28 Setting svn:eol-style native to the tests
modified gshimansky  /harmony/enhanced/drlvm/trunk/vm/tests/smoke/shutdown/TestLock.java 08/03/2007 03:42:28 Setting svn:eol-style native to the tests

Mime
View raw message