harmony-alerts mailing list archives

Site index · List index
Message view « Date » · « Thread »
Top « Date » · « Thread »
From nom...@intel.com
Subject [build-test alert] BUILD FAILED Linux x86: stress
Date Thu, 02 Aug 2007 15:04:05 GMT
BUILD FAILED:
	Ant Error Message:
/export/users/cc/cc-suites/scripts/cc-exec-adaptor.xml:101: The following error occurred while executing this line: /export/users/cc/cc-suites/adaptors/stress/adaptor.xml:100: The following error occurred while executing this line: /export/users/cc/cc-suites/adaptors/stress/adaptor.xml:116: The following error occurred while executing this line: /export/users/cc/cc-suites/scripts/framework.xml:1069: Java returned: 1

Date of build:	08/02/2007 19:20:34
Time to build:	163 minutes 2 seconds
Last changed:	08/02/2007 03:37:30
Last log entry:	snapshot

***********************************************************
Errors/Warnings:	(4)
            
BUILD FAILED
/export/users/cc/cc-suites/tests/stress/qa/build.xml:169: Java returned: 255
Total time: 162 minutes 56 seconds
The execution FAILED with the following exception:
The following error occurred while executing this line:
/export/users/cc/cc-suites/adaptors/stress/adaptor.xml:100: The following error occurred while executing this line:
/export/users/cc/cc-suites/adaptors/stress/adaptor.xml:116: The following error occurred while executing this line:
/export/users/cc/cc-suites/scripts/framework.xml:1069: Java returned: 1

***********************************************************
Unit Tests: (193)
        
error: test stress.org.apache.harmony.test.stress.classloader.MixThreads.ConstantPool.testCPLmt1
error: test stress.org.apache.harmony.test.stress.classloader.MixThreads.ConstantPool.testCPLmt2
error: test stress.org.apache.harmony.test.stress.classloader.MixThreads.FieldsLmt.testFieldsLmt1
error: test stress.org.apache.harmony.test.stress.classloader.MixThreads.FieldsLmt.testFieldsLmt2
error: test stress.org.apache.harmony.test.stress.classloader.MixThreads.LargeClassName.testLargeClassName_W1
error: test stress.org.apache.harmony.test.stress.classloader.MixThreads.WrongClasses.testNECLoad1
error: test stress.org.apache.harmony.test.stress.classloader.MixThreads.WrongClasses.testNECLoad2
error: test stress.org.apache.harmony.test.stress.classloader.MixThreads.WrongClasses.testWCLoad1
error: test stress.org.apache.harmony.test.stress.classloader.MixThreads.WrongClasses.testWCLoad2
error: test stress.org.apache.harmony.test.stress.classloader.NotSynchThreads.ConstantPool.testCPLmt
error: test stress.org.apache.harmony.test.stress.classloader.NotSynchThreads.SupIntf.testManySupIntf1
error: test stress.org.apache.harmony.test.stress.classloader.NotSynchThreads.SupIntf.testManySupIntf2
error: test stress.org.apache.harmony.test.stress.classloader.NotSynchThreads.WrongClasses.testWCLoad
error: test stress.org.apache.harmony.test.stress.classloader.OneThread.MethodArgs.testMethodArgs
error: test stress.org.apache.harmony.test.stress.classloader.OneThread.MethodNameLmt.testMethodNameLmt
error: test stress.org.apache.harmony.test.stress.classloader.OneThread.SubClasses.testManySubClasses
error: test stress.org.apache.harmony.test.stress.classloader.OneThread.SupIntf.testManySupIntf1
error: test stress.org.apache.harmony.test.stress.classloader.OneThread.WrongClasses.testWCLoad
error: test stress.org.apache.harmony.test.stress.classloader.SynchThreads.ConstantPool.testCPLmt1
error: test stress.org.apache.harmony.test.stress.classloader.SynchThreads.ConstantPool.testCPLmt2
error: test stress.org.apache.harmony.test.stress.classloader.SynchThreads.FieldsLmt.testFieldsLmt1
error: test stress.org.apache.harmony.test.stress.classloader.SynchThreads.FieldsLmt.testFieldsLmt2
error: test stress.org.apache.harmony.test.stress.classloader.SynchThreads.LargeClassName.testLargeClassName_R1
error: test stress.org.apache.harmony.test.stress.classloader.SynchThreads.MethodArgs.testMethodArgs1
error: test stress.org.apache.harmony.test.stress.classloader.SynchThreads.SupIntf.testManySupIntf1
error: test stress.org.apache.harmony.test.stress.classloader.SynchThreads.SupIntf.testManySupIntf2
error: test stress.org.apache.harmony.test.stress.classloader.SynchThreads.SupIntf.testManySupIntf3
error: test stress.org.apache.harmony.test.stress.classloader.SynchThreads.SupIntf.testManySupIntf4
error: test stress.org.apache.harmony.test.stress.classloader.SynchThreads.WrongClasses.testNECLoad1
error: test stress.org.apache.harmony.test.stress.classloader.SynchThreads.WrongClasses.testWCLoad1
error: test stress.org.apache.harmony.test.stress.classloader.SynchThreads.WrongClasses.testWCLoad2
error: test stress.org.apache.harmony.test.stress.gc.frag.FragmentationGCFinalizeTest3.FragmentationGCFinalizeTest3
error: test stress.org.apache.harmony.test.stress.gc.frag.FragmentationSimpleTest2.FragmentationSimpleTest2
error: test stress.org.apache.harmony.test.stress.jni.stack.StackTest12
error: test stress.org.apache.harmony.test.stress.jni.stack.StackTest3
error: test stress.org.apache.harmony.test.stress.jni.stack.StackTest4
error: test stress.org.apache.harmony.test.stress.jni.strings.StringsTest1
error: test stress.org.apache.harmony.test.stress.jni.strings.StringsTest2
error: test stress.org.apache.harmony.test.stress.jni.strings.StringsTest3
error: test stress.org.apache.harmony.test.stress.jni.strings.StringsTest7
error: test stress.org.apache.harmony.test.stress.jpda.jdwp.scenario.MEMORY002.MemoryTest002
error: test stress.org.apache.harmony.test.stress.jpda.jdwp.scenario.MEMORY003.MemoryTest003
error: test stress.org.apache.harmony.test.stress.jpda.jdwp.scenario.MEMORY006.MemoryTest006
error: test stress.org.apache.harmony.test.stress.jpda.jdwp.scenario.THREAD002.ThreadTest002
error: test stress.org.apache.harmony.test.stress.jpda.jdwp.scenario.THREAD004.ThreadTest004
error: test stress.org.apache.harmony.test.stress.jpda.jdwp.scenario.THREAD007.ThreadTest007
error: test stress.org.apache.harmony.test.stress.jpda.jdwp.scenario.THREAD008.ThreadTest008
error: test stress.org.apache.harmony.test.stress.jpda.jdwp.scenario.THREAD009.ThreadTest009
error: test stress.org.apache.harmony.test.stress.jpda.jdwp.scenario.THREAD010.ThreadTest010
error: test stress.org.apache.harmony.test.stress.misc.WaitNotifyTest
Unit Test Error Details:	(50)
                
Test: testClass: stress.org.apache.harmony.test.stress.classloader.MixThreads.ConstantPool.testCPLmt1java version "1.5.0" 
pre-alpha : not complete or compatible
svn = r561336, (Aug  1 2007), Linux/ia32/gcc 3.3.3, release build
http://harmony.apache.org
The GC did not provide gc_add_weak_root_set_entry()

Apache Harmony Launcher : (c) Copyright 1991, 2006 The Apache Software Foundation or its licensors, as applicable.
[debug] started null(org.apache.harmony.test.share.stress.ReliabilityRunner)
[debug] timeToWork = 30, timeToAbort = 30
[debug] started null(org.apache.harmony.test.share.stress.generator.Thread)
[debug] Thread.setContext  { org.apache.harmony.test.stress.classloader.MixThreads.ConstantPool.testCPLmt {} }
[debug] Starting 1 threads
[debug] ThreadToRun.run()
[debug] completed null(org.apache.harmony.test.share.stress.generator.Thread)
[debug] Generator.execute()
[debug] class = org.apache.harmony.test.stress.classloader.MixThreads.ConstantPool.testCPLmt
[debug] org.apache.harmony.test.stress.classloader.MixThreads.ConstantPool.testCPLmt { }
[debug] started test(or...
Test: testClass: stress.org.apache.harmony.test.stress.classloader.MixThreads.ConstantPool.testCPLmt2java version "1.5.0" 
pre-alpha : not complete or compatible
svn = r561336, (Aug  1 2007), Linux/ia32/gcc 3.3.3, release build
http://harmony.apache.org
The GC did not provide gc_add_weak_root_set_entry()

Apache Harmony Launcher : (c) Copyright 1991, 2006 The Apache Software Foundation or its licensors, as applicable.
[debug] started null(org.apache.harmony.test.share.stress.ReliabilityRunner)
[debug] timeToWork = 30, timeToAbort = 30
[debug] started null(org.apache.harmony.test.share.stress.generator.Thread)
[debug] Thread.setContext  { org.apache.harmony.test.stress.classloader.MixThreads.ConstantPool.testCPLmt {} }
[debug] Starting 1 threads
[debug] ThreadToRun.run()
[debug] Generator.execute()
[debug] class = org.apache.harmony.test.stress.classloader.MixThreads.ConstantPool.testCPLmt
[debug] org.apache.harmony.test.stress.classloader.MixThreads.ConstantPool.testCPLmt { }
[debug] started test(org.apache.harmony.test.stress.classloader.MixThreads.ConstantPool.testCPLmt)
[d...
Test: testClass: stress.org.apache.harmony.test.stress.classloader.MixThreads.FieldsLmt.testFieldsLmt1java version "1.5.0" 
pre-alpha : not complete or compatible
svn = r561336, (Aug  1 2007), Linux/ia32/gcc 3.3.3, release build
http://harmony.apache.org
The GC did not provide gc_add_weak_root_set_entry()

Apache Harmony Launcher : (c) Copyright 1991, 2006 The Apache Software Foundation or its licensors, as applicable.
[debug] started null(org.apache.harmony.test.share.stress.ReliabilityRunner)
[debug] timeToWork = 30, timeToAbort = 30
[debug] started null(org.apache.harmony.test.share.stress.generator.Thread)
[debug] Thread.setContext  { org.apache.harmony.test.stress.classloader.MixThreads.FieldsLmt.testFieldsLmt {} }
[debug] Starting 1 threads
[debug] ThreadToRun.run()
[debug] completed null(org.apache.harmony.test.share.stress.generator.Thread)
[debug] Generator.execute()
[debug] class = org.apache.harmony.test.stress.classloader.MixThreads.FieldsLmt.testFieldsLmt
[debug] org.apache.harmony.test.stress.classloader.MixThreads.FieldsLmt.testFieldsLmt { }
[debug] started test...
Test: testClass: stress.org.apache.harmony.test.stress.classloader.MixThreads.FieldsLmt.testFieldsLmt2java version "1.5.0" 
pre-alpha : not complete or compatible
svn = r561336, (Aug  1 2007), Linux/ia32/gcc 3.3.3, release build
http://harmony.apache.org
The GC did not provide gc_add_weak_root_set_entry()

Apache Harmony Launcher : (c) Copyright 1991, 2006 The Apache Software Foundation or its licensors, as applicable.
[debug] started null(org.apache.harmony.test.share.stress.ReliabilityRunner)
[debug] timeToWork = 30, timeToAbort = 30
[debug] started null(org.apache.harmony.test.share.stress.generator.Thread)
[debug] Thread.setContext  { org.apache.harmony.test.stress.classloader.MixThreads.FieldsLmt.testFieldsLmt {} }
[debug] Starting 1 threads
[debug] ThreadToRun.run()
[debug] Generator.execute()
[debug] class = org.apache.harmony.test.stress.classloader.MixThreads.FieldsLmt.testFieldsLmt
[debug] org.apache.harmony.test.stress.classloader.MixThreads.FieldsLmt.testFieldsLmt { }
[debug] completed null(org.apache.harmony.test.share.stress.generator.Thread)
[debug] started test...
Test: testClass: stress.org.apache.harmony.test.stress.classloader.MixThreads.LargeClassName.testLargeClassName_W1java version "1.5.0" 
pre-alpha : not complete or compatible
svn = r561336, (Aug  1 2007), Linux/ia32/gcc 3.3.3, release build
http://harmony.apache.org
The GC did not provide gc_add_weak_root_set_entry()

Apache Harmony Launcher : (c) Copyright 1991, 2006 The Apache Software Foundation or its licensors, as applicable.
[debug] started null(org.apache.harmony.test.share.stress.ReliabilityRunner)
[debug] timeToWork = 30, timeToAbort = 30
[debug] started null(org.apache.harmony.test.share.stress.generator.Thread)
[debug] Thread.setContext  { org.apache.harmony.test.stress.classloader.MixThreads.LargeClassName.testLCN {} }
[debug] Starting 1 threads
[debug] ThreadToRun.run()
[debug] completed null(org.apache.harmony.test.share.stress.generator.Thread)
[debug] Generator.execute()
[debug] class = org.apache.harmony.test.stress.classloader.MixThreads.LargeClassName.testLCN
[debug] org.apache.harmony.test.stress.classloader.MixThreads.LargeClassName.testLCN { }
[debug] started test(or...
Test: testClass: stress.org.apache.harmony.test.stress.classloader.MixThreads.WrongClasses.testNECLoad1java version "1.5.0" 
pre-alpha : not complete or compatible
svn = r561336, (Aug  1 2007), Linux/ia32/gcc 3.3.3, release build
http://harmony.apache.org
The GC did not provide gc_add_weak_root_set_entry()

Apache Harmony Launcher : (c) Copyright 1991, 2006 The Apache Software Foundation or its licensors, as applicable.
[debug] started null(org.apache.harmony.test.share.stress.ReliabilityRunner)
[debug] timeToWork = 30, timeToAbort = 30
[debug] started null(org.apache.harmony.test.share.stress.generator.Thread)
[debug] Thread.setContext  { org.apache.harmony.test.stress.classloader.MixThreads.WrongClasses.testNECLoad_MT {} }
[debug] Starting 1 threads
[debug] ThreadToRun.run()
[debug] Generator.execute()
[debug] completed null(org.apache.harmony.test.share.stress.generator.Thread)
[debug] class = org.apache.harmony.test.stress.classloader.MixThreads.WrongClasses.testNECLoad_MT
[debug] org.apache.harmony.test.stress.classloader.MixThreads.WrongClasses.testNECLoad_MT { }
[debug] ...
Test: testClass: stress.org.apache.harmony.test.stress.classloader.MixThreads.WrongClasses.testNECLoad2java version "1.5.0" 
pre-alpha : not complete or compatible
svn = r561336, (Aug  1 2007), Linux/ia32/gcc 3.3.3, release build
http://harmony.apache.org
The GC did not provide gc_add_weak_root_set_entry()

Apache Harmony Launcher : (c) Copyright 1991, 2006 The Apache Software Foundation or its licensors, as applicable.
[debug] started null(org.apache.harmony.test.share.stress.ReliabilityRunner)
[debug] timeToWork = 30, timeToAbort = 30
[debug] started null(org.apache.harmony.test.share.stress.generator.Thread)
[debug] Thread.setContext  { org.apache.harmony.test.stress.classloader.MixThreads.WrongClasses.testNECLoad_MT {} }
[debug] Starting 1 threads
[debug] ThreadToRun.run()
[debug] Generator.execute()
[debug] class = org.apache.harmony.test.stress.classloader.MixThreads.WrongClasses.testNECLoad_MT
[debug] org.apache.harmony.test.stress.classloader.MixThreads.WrongClasses.testNECLoad_MT { }
[debug] started test(org.apache.harmony.test.stress.classloader.MixThreads.WrongClasse...
Test: testClass: stress.org.apache.harmony.test.stress.classloader.MixThreads.WrongClasses.testWCLoad1java version "1.5.0" 
pre-alpha : not complete or compatible
svn = r561336, (Aug  1 2007), Linux/ia32/gcc 3.3.3, release build
http://harmony.apache.org
The GC did not provide gc_add_weak_root_set_entry()

Apache Harmony Launcher : (c) Copyright 1991, 2006 The Apache Software Foundation or its licensors, as applicable.
[debug] started null(org.apache.harmony.test.share.stress.ReliabilityRunner)
[debug] timeToWork = 30, timeToAbort = 30
[debug] started null(org.apache.harmony.test.share.stress.generator.Thread)
[debug] Thread.setContext  { org.apache.harmony.test.stress.classloader.MixThreads.WrongClasses.testWCLoad_MT {} }
[debug] Starting 1 threads
[debug] ThreadToRun.run()
[debug] completed null(org.apache.harmony.test.share.stress.generator.Thread)
[debug] Generator.execute()
[debug] class = org.apache.harmony.test.stress.classloader.MixThreads.WrongClasses.testWCLoad_MT
[debug] org.apache.harmony.test.stress.classloader.MixThreads.WrongClasses.testWCLoad_MT { }
[debug] sta...
Test: testClass: stress.org.apache.harmony.test.stress.classloader.MixThreads.WrongClasses.testWCLoad2java version "1.5.0" 
pre-alpha : not complete or compatible
svn = r561336, (Aug  1 2007), Linux/ia32/gcc 3.3.3, release build
http://harmony.apache.org
The GC did not provide gc_add_weak_root_set_entry()

Apache Harmony Launcher : (c) Copyright 1991, 2006 The Apache Software Foundation or its licensors, as applicable.
[debug] started null(org.apache.harmony.test.share.stress.ReliabilityRunner)
[debug] timeToWork = 30, timeToAbort = 30
[debug] started null(org.apache.harmony.test.share.stress.generator.Thread)
[debug] Thread.setContext  { org.apache.harmony.test.stress.classloader.MixThreads.WrongClasses.testWCLoad_MT {} }
[debug] Starting 1 threads
[debug] ThreadToRun.run()
[debug] Generator.execute()
[debug] class = org.apache.harmony.test.stress.classloader.MixThreads.WrongClasses.testWCLoad_MT
[debug] org.apache.harmony.test.stress.classloader.MixThreads.WrongClasses.testWCLoad_MT { }
[debug] started test(org.apache.harmony.test.stress.classloader.MixThreads.WrongClasses.t...
Test: testClass: stress.org.apache.harmony.test.stress.classloader.NotSynchThreads.ConstantPool.testCPLmtjava version "1.5.0" 
pre-alpha : not complete or compatible
svn = r561336, (Aug  1 2007), Linux/ia32/gcc 3.3.3, release build
http://harmony.apache.org
The GC did not provide gc_add_weak_root_set_entry()

Apache Harmony Launcher : (c) Copyright 1991, 2006 The Apache Software Foundation or its licensors, as applicable.
[debug] started null(org.apache.harmony.test.share.stress.ReliabilityRunner)
[debug] timeToWork = 30, timeToAbort = 30
[debug] started null(org.apache.harmony.test.share.stress.generator.Thread)
[debug] Thread.setContext  { org.apache.harmony.test.stress.classloader.NotSynchThreads.ConstantPool.testCPLmt {} }
[debug] Starting 1 threads
[debug] ThreadToRun.run()
[debug] Generator.execute()
[debug] class = org.apache.harmony.test.stress.classloader.NotSynchThreads.ConstantPool.testCPLmt
[debug] completed null(org.apache.harmony.test.share.stress.generator.Thread)
[debug] org.apache.harmony.test.stress.classloader.NotSynchThreads.ConstantPool.testCPLmt { }
[debug] ...
Test: testClass: stress.org.apache.harmony.test.stress.classloader.NotSynchThreads.SupIntf.testManySupIntf1java version "1.5.0" 
pre-alpha : not complete or compatible
svn = r561336, (Aug  1 2007), Linux/ia32/gcc 3.3.3, release build
http://harmony.apache.org
The GC did not provide gc_add_weak_root_set_entry()

Apache Harmony Launcher : (c) Copyright 1991, 2006 The Apache Software Foundation or its licensors, as applicable.
[debug] started null(org.apache.harmony.test.share.stress.ReliabilityRunner)
[debug] timeToWork = 30, timeToAbort = 30
[debug] started null(org.apache.harmony.test.share.stress.generator.Thread)
[debug] Thread.setContext  { org.apache.harmony.test.stress.classloader.NotSynchThreads.SupIntf.testManySupIntf1 {} }
[debug] Starting 1 threads
[debug] ThreadToRun.run()
[debug] completed null(org.apache.harmony.test.share.stress.generator.Thread)
[debug] Generator.execute()
[debug] class = org.apache.harmony.test.stress.classloader.NotSynchThreads.SupIntf.testManySupIntf1
[debug] org.apache.harmony.test.stress.classloader.NotSynchThreads.SupIntf.testManySupIntf1 { }
[d...
Test: testClass: stress.org.apache.harmony.test.stress.classloader.NotSynchThreads.SupIntf.testManySupIntf2java version "1.5.0" 
pre-alpha : not complete or compatible
svn = r561336, (Aug  1 2007), Linux/ia32/gcc 3.3.3, release build
http://harmony.apache.org
The GC did not provide gc_add_weak_root_set_entry()

Apache Harmony Launcher : (c) Copyright 1991, 2006 The Apache Software Foundation or its licensors, as applicable.
[debug] started null(org.apache.harmony.test.share.stress.ReliabilityRunner)
[debug] timeToWork = 30, timeToAbort = 30
[debug] started null(org.apache.harmony.test.share.stress.generator.Thread)
[debug] Thread.setContext  { org.apache.harmony.test.stress.classloader.NotSynchThreads.SupIntf.testManySupIntf2 {} }
[debug] Starting 1 threads
[debug] ThreadToRun.run()
[debug] completed null(org.apache.harmony.test.share.stress.generator.Thread)
[debug] Generator.execute()
[debug] class = org.apache.harmony.test.stress.classloader.NotSynchThreads.SupIntf.testManySupIntf2
[debug] org.apache.harmony.test.stress.classloader.NotSynchThreads.SupIntf.testManySupIntf2 { }
[d...
Test: testClass: stress.org.apache.harmony.test.stress.classloader.NotSynchThreads.WrongClasses.testWCLoadjava version "1.5.0" 
pre-alpha : not complete or compatible
svn = r561336, (Aug  1 2007), Linux/ia32/gcc 3.3.3, release build
http://harmony.apache.org
The GC did not provide gc_add_weak_root_set_entry()

Apache Harmony Launcher : (c) Copyright 1991, 2006 The Apache Software Foundation or its licensors, as applicable.
[debug] started null(org.apache.harmony.test.share.stress.ReliabilityRunner)
[debug] timeToWork = 30, timeToAbort = 30
[debug] started null(org.apache.harmony.test.share.stress.generator.Thread)
[debug] Thread.setContext  { org.apache.harmony.test.stress.classloader.NotSynchThreads.WrongClasses.testWCLoad_NST {} }
[debug] Starting 1 threads
[debug] ThreadToRun.run()
[debug] Generator.execute()
[debug] class = org.apache.harmony.test.stress.classloader.NotSynchThreads.WrongClasses.testWCLoad_NST
[debug] completed null(org.apache.harmony.test.share.stress.generator.Thread)
[debug] org.apache.harmony.test.stress.classloader.NotSynchThreads.WrongClasses.testWCLoad_N...
Test: testClass: stress.org.apache.harmony.test.stress.classloader.OneThread.MethodArgs.testMethodArgsjava version "1.5.0" 
pre-alpha : not complete or compatible
svn = r561336, (Aug  1 2007), Linux/ia32/gcc 3.3.3, release build
http://harmony.apache.org
The GC did not provide gc_add_weak_root_set_entry()

Apache Harmony Launcher : (c) Copyright 1991, 2006 The Apache Software Foundation or its licensors, as applicable.
[debug] started null(org.apache.harmony.test.share.stress.ReliabilityRunner)
[debug] timeToWork = 30, timeToAbort = 30
[debug] started null(org.apache.harmony.test.share.stress.generator.Thread)
[debug] Thread.setContext  { org.apache.harmony.test.stress.classloader.share.MethodArgs.testMethodArgs_R {} }
[debug] Starting 1 threads
[debug] ThreadToRun.run()
[debug] completed null(org.apache.harmony.test.share.stress.generator.Thread)
[debug] Generator.execute()
[debug] class = org.apache.harmony.test.stress.classloader.share.MethodArgs.testMethodArgs_R
[debug] org.apache.harmony.test.stress.classloader.share.MethodArgs.testMethodArgs_R { }
[debug] started test(or...
Test: testClass: stress.org.apache.harmony.test.stress.classloader.OneThread.MethodNameLmt.testMethodNameLmtjava version "1.5.0" 
pre-alpha : not complete or compatible
svn = r561336, (Aug  1 2007), Linux/ia32/gcc 3.3.3, release build
http://harmony.apache.org
The GC did not provide gc_add_weak_root_set_entry()

Apache Harmony Launcher : (c) Copyright 1991, 2006 The Apache Software Foundation or its licensors, as applicable.
[debug] started null(org.apache.harmony.test.share.stress.ReliabilityRunner)
[debug] timeToWork = 30, timeToAbort = 30
[debug] started null(org.apache.harmony.test.share.stress.generator.Thread)
[debug] Thread.setContext  { org.apache.harmony.test.stress.classloader.OneThread.MethodNameLmt.testMethodNameLmt {} }
[debug] Starting 1 threads
[debug] ThreadToRun.run()
[debug] completed null(org.apache.harmony.test.share.stress.generator.Thread)
[debug] Generator.execute()
[debug] class = org.apache.harmony.test.stress.classloader.OneThread.MethodNameLmt.testMethodNameLmt
[debug] org.apache.harmony.test.stress.classloader.OneThread.MethodNameLmt.testMethodNameLmt { }...
Test: testClass: stress.org.apache.harmony.test.stress.classloader.OneThread.SubClasses.testManySubClassesjava version "1.5.0" 
pre-alpha : not complete or compatible
svn = r561336, (Aug  1 2007), Linux/ia32/gcc 3.3.3, release build
http://harmony.apache.org
The GC did not provide gc_add_weak_root_set_entry()

Apache Harmony Launcher : (c) Copyright 1991, 2006 The Apache Software Foundation or its licensors, as applicable.
[debug] started null(org.apache.harmony.test.share.stress.ReliabilityRunner)
[debug] timeToWork = 30, timeToAbort = 30
[debug] started null(org.apache.harmony.test.share.stress.generator.Thread)
[debug] Thread.setContext  { org.apache.harmony.test.stress.classloader.OneThread.SubClasses.testManySubClasses {} }
[debug] Starting 1 threads
[debug] completed null(org.apache.harmony.test.share.stress.generator.Thread)
[debug] ThreadToRun.run()
[debug] Generator.execute()
[debug] class = org.apache.harmony.test.stress.classloader.OneThread.SubClasses.testManySubClasses
[debug] org.apache.harmony.test.stress.classloader.OneThread.SubClasses.testManySubClasses { }
[debu...
Test: testClass: stress.org.apache.harmony.test.stress.classloader.OneThread.SupIntf.testManySupIntf1java version "1.5.0" 
pre-alpha : not complete or compatible
svn = r561336, (Aug  1 2007), Linux/ia32/gcc 3.3.3, release build
http://harmony.apache.org
The GC did not provide gc_add_weak_root_set_entry()

Apache Harmony Launcher : (c) Copyright 1991, 2006 The Apache Software Foundation or its licensors, as applicable.
[debug] started null(org.apache.harmony.test.share.stress.ReliabilityRunner)
[debug] timeToWork = 30, timeToAbort = 30
[debug] started null(org.apache.harmony.test.share.stress.generator.Thread)
[debug] Thread.setContext  { org.apache.harmony.test.stress.classloader.OneThread.SupIntf.testManySupIntf1 {} }
[debug] Starting 1 threads
[debug] completed null(org.apache.harmony.test.share.stress.generator.Thread)
[debug] ThreadToRun.run()
[debug] Generator.execute()
[debug] class = org.apache.harmony.test.stress.classloader.OneThread.SupIntf.testManySupIntf1
[debug] org.apache.harmony.test.stress.classloader.OneThread.SupIntf.testManySupIntf1 { }
[debug] started test...
Test: testClass: stress.org.apache.harmony.test.stress.classloader.OneThread.WrongClasses.testWCLoadjava version "1.5.0" 
pre-alpha : not complete or compatible
svn = r561336, (Aug  1 2007), Linux/ia32/gcc 3.3.3, release build
http://harmony.apache.org
The GC did not provide gc_add_weak_root_set_entry()

Apache Harmony Launcher : (c) Copyright 1991, 2006 The Apache Software Foundation or its licensors, as applicable.
[debug] started null(org.apache.harmony.test.share.stress.ReliabilityRunner)
[debug] timeToWork = 30, timeToAbort = 30
[debug] started null(org.apache.harmony.test.share.stress.generator.Thread)
[debug] Thread.setContext  { org.apache.harmony.test.stress.classloader.OneThread.WrongClasses.testWCLoad {} }
[debug] Starting 1 threads
[debug] completed null(org.apache.harmony.test.share.stress.generator.Thread)
[debug] ThreadToRun.run()
[debug] Generator.execute()
[debug] class = org.apache.harmony.test.stress.classloader.OneThread.WrongClasses.testWCLoad
[debug] org.apache.harmony.test.stress.classloader.OneThread.WrongClasses.testWCLoad { }
[debug] started test(or...
Test: testClass: stress.org.apache.harmony.test.stress.classloader.SynchThreads.ConstantPool.testCPLmt1java version "1.5.0" 
pre-alpha : not complete or compatible
svn = r561336, (Aug  1 2007), Linux/ia32/gcc 3.3.3, release build
http://harmony.apache.org
The GC did not provide gc_add_weak_root_set_entry()

Apache Harmony Launcher : (c) Copyright 1991, 2006 The Apache Software Foundation or its licensors, as applicable.
[debug] started null(org.apache.harmony.test.share.stress.ReliabilityRunner)
[debug] timeToWork = 30, timeToAbort = 30
[debug] started null(org.apache.harmony.test.share.stress.generator.Thread)
[debug] Thread.setContext  { org.apache.harmony.test.stress.classloader.SynchThreads.ConstantPool.testCPLmt {} }
[debug] Starting 1 threads
[debug] ThreadToRun.run()
[debug] completed null(org.apache.harmony.test.share.stress.generator.Thread)
[debug] Generator.execute()
[debug] class = org.apache.harmony.test.stress.classloader.SynchThreads.ConstantPool.testCPLmt
[debug] org.apache.harmony.test.stress.classloader.SynchThreads.ConstantPool.testCPLmt { }
[debug] started t...
Test: testClass: stress.org.apache.harmony.test.stress.classloader.SynchThreads.ConstantPool.testCPLmt2java version "1.5.0" 
pre-alpha : not complete or compatible
svn = r561336, (Aug  1 2007), Linux/ia32/gcc 3.3.3, release build
http://harmony.apache.org
The GC did not provide gc_add_weak_root_set_entry()

Apache Harmony Launcher : (c) Copyright 1991, 2006 The Apache Software Foundation or its licensors, as applicable.
[debug] started null(org.apache.harmony.test.share.stress.ReliabilityRunner)
[debug] timeToWork = 30, timeToAbort = 30
[debug] started null(org.apache.harmony.test.share.stress.generator.Thread)
[debug] Thread.setContext  { org.apache.harmony.test.stress.classloader.SynchThreads.ConstantPool.testCPLmt {} }
[debug] Starting 1 threads
[debug] ThreadToRun.run()
[debug] completed null(org.apache.harmony.test.share.stress.generator.Thread)
[debug] Generator.execute()
[debug] class = org.apache.harmony.test.stress.classloader.SynchThreads.ConstantPool.testCPLmt
[debug] org.apache.harmony.test.stress.classloader.SynchThreads.ConstantPool.testCPLmt { }
[debug] started t...
Test: testClass: stress.org.apache.harmony.test.stress.classloader.SynchThreads.FieldsLmt.testFieldsLmt1java version "1.5.0" 
pre-alpha : not complete or compatible
svn = r561336, (Aug  1 2007), Linux/ia32/gcc 3.3.3, release build
http://harmony.apache.org
The GC did not provide gc_add_weak_root_set_entry()

Apache Harmony Launcher : (c) Copyright 1991, 2006 The Apache Software Foundation or its licensors, as applicable.
[debug] started null(org.apache.harmony.test.share.stress.ReliabilityRunner)
[debug] timeToWork = 30, timeToAbort = 30
[debug] started null(org.apache.harmony.test.share.stress.generator.Thread)
[debug] Thread.setContext  { org.apache.harmony.test.stress.classloader.SynchThreads.FieldsLmt.testFieldsLmt {} }
[debug] Starting 1 threads
[debug] ThreadToRun.run()
[debug] completed null(org.apache.harmony.test.share.stress.generator.Thread)
[debug] Generator.execute()
[debug] class = org.apache.harmony.test.stress.classloader.SynchThreads.FieldsLmt.testFieldsLmt
[debug] org.apache.harmony.test.stress.classloader.SynchThreads.FieldsLmt.testFieldsLmt { }
[debug] starte...
Test: testClass: stress.org.apache.harmony.test.stress.classloader.SynchThreads.FieldsLmt.testFieldsLmt2java version "1.5.0" 
pre-alpha : not complete or compatible
svn = r561336, (Aug  1 2007), Linux/ia32/gcc 3.3.3, release build
http://harmony.apache.org
The GC did not provide gc_add_weak_root_set_entry()

Apache Harmony Launcher : (c) Copyright 1991, 2006 The Apache Software Foundation or its licensors, as applicable.
[debug] started null(org.apache.harmony.test.share.stress.ReliabilityRunner)
[debug] timeToWork = 30, timeToAbort = 30
[debug] started null(org.apache.harmony.test.share.stress.generator.Thread)
[debug] Thread.setContext  { org.apache.harmony.test.stress.classloader.SynchThreads.FieldsLmt.testFieldsLmt {} }
[debug] Starting 1 threads
[debug] ThreadToRun.run()
[debug] completed null(org.apache.harmony.test.share.stress.generator.Thread)
[debug] Generator.execute()
[debug] class = org.apache.harmony.test.stress.classloader.SynchThreads.FieldsLmt.testFieldsLmt
[debug] org.apache.harmony.test.stress.classloader.SynchThreads.FieldsLmt.testFieldsLmt { }
[debug] starte...
Test: testClass: stress.org.apache.harmony.test.stress.classloader.SynchThreads.LargeClassName.testLargeClassName_R1java version "1.5.0" 
pre-alpha : not complete or compatible
svn = r561336, (Aug  1 2007), Linux/ia32/gcc 3.3.3, release build
http://harmony.apache.org
The GC did not provide gc_add_weak_root_set_entry()

Apache Harmony Launcher : (c) Copyright 1991, 2006 The Apache Software Foundation or its licensors, as applicable.
[debug] started null(org.apache.harmony.test.share.stress.ReliabilityRunner)
[debug] timeToWork = 30, timeToAbort = 30
[debug] started null(org.apache.harmony.test.share.stress.generator.Thread)
[debug] Thread.setContext  { org.apache.harmony.test.stress.classloader.SynchThreads.LargeClassName.testLCN {} }
[debug] Starting 1 threads
[debug] ThreadToRun.run()
[debug] completed null(org.apache.harmony.test.share.stress.generator.Thread)
[debug] Generator.execute()
[debug] class = org.apache.harmony.test.stress.classloader.SynchThreads.LargeClassName.testLCN
[debug] org.apache.harmony.test.stress.classloader.SynchThreads.LargeClassName.testLCN { }
[debug] started t...
Test: testClass: stress.org.apache.harmony.test.stress.classloader.SynchThreads.MethodArgs.testMethodArgs1java version "1.5.0" 
pre-alpha : not complete or compatible
svn = r561336, (Aug  1 2007), Linux/ia32/gcc 3.3.3, release build
http://harmony.apache.org
The GC did not provide gc_add_weak_root_set_entry()

Apache Harmony Launcher : (c) Copyright 1991, 2006 The Apache Software Foundation or its licensors, as applicable.
[debug] started null(org.apache.harmony.test.share.stress.ReliabilityRunner)
[debug] timeToWork = 30, timeToAbort = 30
[debug] started null(org.apache.harmony.test.share.stress.generator.Thread)
[debug] Thread.setContext  { org.apache.harmony.test.stress.classloader.SynchThreads.MethodArgs.testMethodArgs {} }
[debug] Starting 1 threads
[debug] ThreadToRun.run()
[debug] completed null(org.apache.harmony.test.share.stress.generator.Thread)
[debug] Generator.execute()
[debug] class = org.apache.harmony.test.stress.classloader.SynchThreads.MethodArgs.testMethodArgs
[debug] org.apache.harmony.test.stress.classloader.SynchThreads.MethodArgs.testMethodArgs { }
[debug] ...
Test: testClass: stress.org.apache.harmony.test.stress.classloader.SynchThreads.SupIntf.testManySupIntf1java version "1.5.0" 
pre-alpha : not complete or compatible
svn = r561336, (Aug  1 2007), Linux/ia32/gcc 3.3.3, release build
http://harmony.apache.org
The GC did not provide gc_add_weak_root_set_entry()

Apache Harmony Launcher : (c) Copyright 1991, 2006 The Apache Software Foundation or its licensors, as applicable.
[debug] started null(org.apache.harmony.test.share.stress.ReliabilityRunner)
[debug] timeToWork = 30, timeToAbort = 30
[debug] started null(org.apache.harmony.test.share.stress.generator.Thread)
[debug] Thread.setContext  { org.apache.harmony.test.stress.classloader.SynchThreads.SupIntf.testManySupIntf1 {} }
[debug] Starting 1 threads
[debug] completed null(org.apache.harmony.test.share.stress.generator.Thread)
[debug] ThreadToRun.run()
[debug] Generator.execute()
[debug] class = org.apache.harmony.test.stress.classloader.SynchThreads.SupIntf.testManySupIntf1
[debug] org.apache.harmony.test.stress.classloader.SynchThreads.SupIntf.testManySupIntf1 { }
[debug] sta...
Test: testClass: stress.org.apache.harmony.test.stress.classloader.SynchThreads.SupIntf.testManySupIntf2java version "1.5.0" 
pre-alpha : not complete or compatible
svn = r561336, (Aug  1 2007), Linux/ia32/gcc 3.3.3, release build
http://harmony.apache.org
The GC did not provide gc_add_weak_root_set_entry()

Apache Harmony Launcher : (c) Copyright 1991, 2006 The Apache Software Foundation or its licensors, as applicable.
[debug] started null(org.apache.harmony.test.share.stress.ReliabilityRunner)
[debug] timeToWork = 30, timeToAbort = 30
[debug] started null(org.apache.harmony.test.share.stress.generator.Thread)
[debug] Thread.setContext  { org.apache.harmony.test.stress.classloader.SynchThreads.SupIntf.testManySupIntf1 {} }
[debug] Starting 1 threads
[debug] completed null(org.apache.harmony.test.share.stress.generator.Thread)
[debug] ThreadToRun.run()
[debug] Generator.execute()
[debug] class = org.apache.harmony.test.stress.classloader.SynchThreads.SupIntf.testManySupIntf1
[debug] org.apache.harmony.test.stress.classloader.SynchThreads.SupIntf.testManySupIntf1 { }
[debug] sta...
Test: testClass: stress.org.apache.harmony.test.stress.classloader.SynchThreads.SupIntf.testManySupIntf3java version "1.5.0" 
pre-alpha : not complete or compatible
svn = r561336, (Aug  1 2007), Linux/ia32/gcc 3.3.3, release build
http://harmony.apache.org
The GC did not provide gc_add_weak_root_set_entry()

Apache Harmony Launcher : (c) Copyright 1991, 2006 The Apache Software Foundation or its licensors, as applicable.
[debug] started null(org.apache.harmony.test.share.stress.ReliabilityRunner)
[debug] timeToWork = 30, timeToAbort = 30
[debug] started null(org.apache.harmony.test.share.stress.generator.Thread)
[debug] Thread.setContext  { org.apache.harmony.test.stress.classloader.SynchThreads.SupIntf.testManySupIntf2 {} }
[debug] Starting 1 threads
[debug] ThreadToRun.run()
[debug] completed null(org.apache.harmony.test.share.stress.generator.Thread)
[debug] Generator.execute()
[debug] class = org.apache.harmony.test.stress.classloader.SynchThreads.SupIntf.testManySupIntf2
[debug] org.apache.harmony.test.stress.classloader.SynchThreads.SupIntf.testManySupIntf2 { }
[debug] sta...
Test: testClass: stress.org.apache.harmony.test.stress.classloader.SynchThreads.SupIntf.testManySupIntf4java version "1.5.0" 
pre-alpha : not complete or compatible
svn = r561336, (Aug  1 2007), Linux/ia32/gcc 3.3.3, release build
http://harmony.apache.org
The GC did not provide gc_add_weak_root_set_entry()

Apache Harmony Launcher : (c) Copyright 1991, 2006 The Apache Software Foundation or its licensors, as applicable.
[debug] started null(org.apache.harmony.test.share.stress.ReliabilityRunner)
[debug] timeToWork = 30, timeToAbort = 30
[debug] started null(org.apache.harmony.test.share.stress.generator.Thread)
[debug] Thread.setContext  { org.apache.harmony.test.stress.classloader.SynchThreads.SupIntf.testManySupIntf2 {} }
[debug] Starting 1 threads
[debug] ThreadToRun.run()
[debug] completed null(org.apache.harmony.test.share.stress.generator.Thread)
[debug] Generator.execute()
[debug] class = org.apache.harmony.test.stress.classloader.SynchThreads.SupIntf.testManySupIntf2
[debug] org.apache.harmony.test.stress.classloader.SynchThreads.SupIntf.testManySupIntf2 { }
[debug] sta...
Test: testClass: stress.org.apache.harmony.test.stress.classloader.SynchThreads.WrongClasses.testNECLoad1java version "1.5.0" 
pre-alpha : not complete or compatible
svn = r561336, (Aug  1 2007), Linux/ia32/gcc 3.3.3, release build
http://harmony.apache.org
The GC did not provide gc_add_weak_root_set_entry()

Apache Harmony Launcher : (c) Copyright 1991, 2006 The Apache Software Foundation or its licensors, as applicable.
[debug] started null(org.apache.harmony.test.share.stress.ReliabilityRunner)
[debug] timeToWork = 30, timeToAbort = 30
[debug] started null(org.apache.harmony.test.share.stress.generator.Thread)
[debug] Thread.setContext  { org.apache.harmony.test.stress.classloader.SynchThreads.WrongClasses.testNECLoad_ST {} }
[debug] Starting 1 threads
[debug] ThreadToRun.run()
[debug] completed null(org.apache.harmony.test.share.stress.generator.Thread)
[debug] Generator.execute()
[debug] class = org.apache.harmony.test.stress.classloader.SynchThreads.WrongClasses.testNECLoad_ST
[debug] org.apache.harmony.test.stress.classloader.SynchThreads.WrongClasses.testNECLoad_ST { }
[d...
Test: testClass: stress.org.apache.harmony.test.stress.classloader.SynchThreads.WrongClasses.testWCLoad1java version "1.5.0" 
pre-alpha : not complete or compatible
svn = r561336, (Aug  1 2007), Linux/ia32/gcc 3.3.3, release build
http://harmony.apache.org
The GC did not provide gc_add_weak_root_set_entry()

Apache Harmony Launcher : (c) Copyright 1991, 2006 The Apache Software Foundation or its licensors, as applicable.
[debug] started null(org.apache.harmony.test.share.stress.ReliabilityRunner)
[debug] timeToWork = 30, timeToAbort = 30
[debug] started null(org.apache.harmony.test.share.stress.generator.Thread)
[debug] Thread.setContext  { org.apache.harmony.test.stress.classloader.SynchThreads.WrongClasses.testWCLoad_ST {} }
[debug] Starting 1 threads
[debug] ThreadToRun.run()
[debug] completed null(org.apache.harmony.test.share.stress.generator.Thread)
[debug] Generator.execute()
[debug] class = org.apache.harmony.test.stress.classloader.SynchThreads.WrongClasses.testWCLoad_ST
[debug] org.apache.harmony.test.stress.classloader.SynchThreads.WrongClasses.testWCLoad_ST { }
[debu...
Test: testClass: stress.org.apache.harmony.test.stress.classloader.SynchThreads.WrongClasses.testWCLoad2java version "1.5.0" 
pre-alpha : not complete or compatible
svn = r561336, (Aug  1 2007), Linux/ia32/gcc 3.3.3, release build
http://harmony.apache.org
The GC did not provide gc_add_weak_root_set_entry()

Apache Harmony Launcher : (c) Copyright 1991, 2006 The Apache Software Foundation or its licensors, as applicable.
[debug] started null(org.apache.harmony.test.share.stress.ReliabilityRunner)
[debug] timeToWork = 30, timeToAbort = 30
[debug] started null(org.apache.harmony.test.share.stress.generator.Thread)
[debug] Thread.setContext  { org.apache.harmony.test.stress.classloader.SynchThreads.WrongClasses.testWCLoad_ST {} }
[debug] Starting 1 threads
[debug] ThreadToRun.run()
[debug] completed null(org.apache.harmony.test.share.stress.generator.Thread)
[debug] Generator.execute()
[debug] class = org.apache.harmony.test.stress.classloader.SynchThreads.WrongClasses.testWCLoad_ST
[debug] org.apache.harmony.test.stress.classloader.SynchThreads.WrongClasses.testWCLoad_ST { }
[debu...
Test: testClass: stress.org.apache.harmony.test.stress.gc.frag.FragmentationGCFinalizeTest3.FragmentationGCFinalizeTest3java version "1.5.0" 
pre-alpha : not complete or compatible
svn = r561336, (Aug  1 2007), Linux/ia32/gcc 3.3.3, release build
http://harmony.apache.org
The GC did not provide gc_add_weak_root_set_entry()

Apache Harmony Launcher : (c) Copyright 1991, 2006 The Apache Software Foundation or its licensors, as applicable.
[debug] started null(org.apache.harmony.test.share.stress.ReliabilityRunner)
[debug] timeToWork = 30, timeToAbort = 30
[debug] started null(org.apache.harmony.test.share.stress.generator.Thread)
[debug] Thread.setContext  { org.apache.harmony.test.stress.gc.frag.share.FragmentationGCFinalizeTest {} }
[debug] Starting 1 threads
[debug] ThreadToRun.run()
[debug] Generator.execute()
[debug] class = org.apache.harmony.test.stress.gc.frag.share.FragmentationGCFinalizeTest
[debug] org.apache.harmony.test.stress.gc.frag.share.FragmentationGCFinalizeTest { }
[debug] completed null(org.apache.harmony.test.share.stress.generator.Thread)
[debug] started test(org.apache.har...
Test: testClass: stress.org.apache.harmony.test.stress.gc.frag.FragmentationSimpleTest2.FragmentationSimpleTest2TestHarness:ExecUnit	runProc(): Timeout!!!. The test hung (not finished in 180 second).

java version "1.5.0" 
pre-alpha : not complete or compatible
svn = r561336, (Aug  1 2007), Linux/ia32/gcc 3.3.3, release build
http://harmony.apache.org
The GC did not provide gc_add_weak_root_set_entry()

Apache Harmony Launcher : (c) Copyright 1991, 2006 The Apache Software Foundation or its licensors, as applicable.
[debug] started null(org.apache.harmony.test.share.stress.ReliabilityRunner)
[debug] timeToWork = 30, timeToAbort = 30
[debug] started null(org.apache.harmony.test.share.stress.generator.Thread)
[debug] Thread.setContext  { org.apache.harmony.test.stress.gc.frag.share.FragmentationSimpleTest {} }
[debug] Starting 1 threads
[debug] ThreadToRun.run()
[debug] completed null(org.apache.harmony.test.share.stress.generator.Thread)
[debug] Generator.execute()
[debug] class = org.apache.harmony.test.stress.gc.frag.share.FragmentationSimpleTest
[debug] org.apache.harmony.test.stress....
Test: testClass: stress.org.apache.harmony.test.stress.jni.stack.StackTest12java version "1.5.0" 
pre-alpha : not complete or compatible
svn = r561336, (Aug  1 2007), Linux/ia32/gcc 3.3.3, release build
http://harmony.apache.org
The GC did not provide gc_add_weak_root_set_entry()

Apache Harmony Launcher : (c) Copyright 1991, 2006 The Apache Software Foundation or its licensors, as applicable.
[debug] started null(org.apache.harmony.test.share.stress.ReliabilityRunner)
[debug] timeToWork = 30, timeToAbort = 30
[debug] started null(org.apache.harmony.test.share.stress.generator.Thread)
[debug] Thread.setContext  { org.apache.harmony.test.stress.jni.stack.StackTest12 {} }
[debug] Starting 1 threads
[debug] ThreadToRun.run()
[debug] Generator.execute()
[debug] class = org.apache.harmony.test.stress.jni.stack.StackTest12
[debug] completed null(org.apache.harmony.test.share.stress.generator.Thread)
[debug] org.apache.harmony.test.stress.jni.stack.StackTest12 { }
[debug] started test(org.apache.harmony.test.stress.jni.stack.StackTest12)
[debug] Main thread:...
Test: testClass: stress.org.apache.harmony.test.stress.jni.stack.StackTest3java version "1.5.0" 
pre-alpha : not complete or compatible
svn = r561336, (Aug  1 2007), Linux/ia32/gcc 3.3.3, release build
http://harmony.apache.org
The GC did not provide gc_add_weak_root_set_entry()

Apache Harmony Launcher : (c) Copyright 1991, 2006 The Apache Software Foundation or its licensors, as applicable.
[debug] started null(org.apache.harmony.test.share.stress.ReliabilityRunner)
[debug] timeToWork = 30, timeToAbort = 30
[debug] started null(org.apache.harmony.test.share.stress.generator.Thread)
[debug] Thread.setContext  { org.apache.harmony.test.stress.jni.stack.StackTest3 {} }
[debug] Starting 1 threads
[debug] ThreadToRun.run()
[debug] completed null(org.apache.harmony.test.share.stress.generator.Thread)
[debug] Generator.execute()
[debug] class = org.apache.harmony.test.stress.jni.stack.StackTest3
[debug] org.apache.harmony.test.stress.jni.stack.StackTest3 { }
[debug] started test(org.apache.harmony.test.stress.jni.stack.StackTest3)
Native code: Cannot get ...
Test: testClass: stress.org.apache.harmony.test.stress.jni.stack.StackTest4TestHarness:ExecUnit	runProc(): Timeout!!!. The test hung (not finished in 540 second).

java version "1.5.0" 
pre-alpha : not complete or compatible
svn = r561336, (Aug  1 2007), Linux/ia32/gcc 3.3.3, release build
http://harmony.apache.org
The GC did not provide gc_add_weak_root_set_entry()

Apache Harmony Launcher : (c) Copyright 1991, 2006 The Apache Software Foundation or its licensors, as applicable.
[debug] started null(org.apache.harmony.test.share.stress.ReliabilityRunner)
[debug] timeToWork = 30, timeToAbort = 30
[debug] started null(org.apache.harmony.test.share.stress.generator.Thread)
[debug] Thread.setContext  { org.apache.harmony.test.stress.jni.stack.StackTest4 {} }
[debug] Starting 1 threads
[debug] ThreadToRun.run()
[debug] Generator.execute()
[debug] class = org.apache.harmony.test.stress.jni.stack.StackTest4
[debug] completed null(org.apache.harmony.test.share.stress.generator.Thread)
[debug] org.apache.harmony.test.stress.jni.stack.StackTest4 { }
[debug] s...
Test: testClass: stress.org.apache.harmony.test.stress.jni.strings.StringsTest1java version "1.5.0" 
pre-alpha : not complete or compatible
svn = r561336, (Aug  1 2007), Linux/ia32/gcc 3.3.3, release build
http://harmony.apache.org
The GC did not provide gc_add_weak_root_set_entry()

Apache Harmony Launcher : (c) Copyright 1991, 2006 The Apache Software Foundation or its licensors, as applicable.
[debug] started null(org.apache.harmony.test.share.stress.ReliabilityRunner)
[debug] timeToWork = 30, timeToAbort = 30
[debug] started null(org.apache.harmony.test.share.stress.generator.Thread)
[debug] Thread.setContext  { org.apache.harmony.test.stress.jni.strings.StringsTest1 {} }
[debug] Starting 1 threads
[debug] ThreadToRun.run()
[debug] completed null(org.apache.harmony.test.share.stress.generator.Thread)
[debug] Generator.execute()
[debug] class = org.apache.harmony.test.stress.jni.strings.StringsTest1
[debug] org.apache.harmony.test.stress.jni.strings.StringsTest1 { }
[debug] started test(org.apache.harmony.test.stress.jni.strings.StringsTest1)
Native c...
Test: testClass: stress.org.apache.harmony.test.stress.jni.strings.StringsTest2java version "1.5.0" 
pre-alpha : not complete or compatible
svn = r561336, (Aug  1 2007), Linux/ia32/gcc 3.3.3, release build
http://harmony.apache.org
The GC did not provide gc_add_weak_root_set_entry()

Apache Harmony Launcher : (c) Copyright 1991, 2006 The Apache Software Foundation or its licensors, as applicable.
[debug] started null(org.apache.harmony.test.share.stress.ReliabilityRunner)
[debug] timeToWork = 30, timeToAbort = 30
[debug] started null(org.apache.harmony.test.share.stress.generator.Thread)
[debug] Thread.setContext  { org.apache.harmony.test.stress.jni.strings.StringsTest2 {} }
[debug] Starting 1 threads
[debug] ThreadToRun.run()
[debug] Generator.execute()
[debug] class = org.apache.harmony.test.stress.jni.strings.StringsTest2
[debug] completed null(org.apache.harmony.test.share.stress.generator.Thread)
[debug] org.apache.harmony.test.stress.jni.strings.StringsTest2 { }
[debug] started test(org.apache.harmony.test.stress.jni.strings.StringsTest2)
Native c...
Test: testClass: stress.org.apache.harmony.test.stress.jni.strings.StringsTest3java version "1.5.0" 
pre-alpha : not complete or compatible
svn = r561336, (Aug  1 2007), Linux/ia32/gcc 3.3.3, release build
http://harmony.apache.org
The GC did not provide gc_add_weak_root_set_entry()

Apache Harmony Launcher : (c) Copyright 1991, 2006 The Apache Software Foundation or its licensors, as applicable.
[debug] started null(org.apache.harmony.test.share.stress.ReliabilityRunner)
[debug] timeToWork = 30, timeToAbort = 30
[debug] started null(org.apache.harmony.test.share.stress.generator.Thread)
[debug] Thread.setContext  { org.apache.harmony.test.stress.jni.strings.StringsTest3 {} }
[debug] Starting 1 threads
[debug] ThreadToRun.run()
[debug] completed null(org.apache.harmony.test.share.stress.generator.Thread)
[debug] Generator.execute()
[debug] class = org.apache.harmony.test.stress.jni.strings.StringsTest3
[debug] org.apache.harmony.test.stress.jni.strings.StringsTest3 { }
[debug] started test(org.apache.harmony.test.stress.jni.strings.StringsTest3)
[debug] ...
Test: testClass: stress.org.apache.harmony.test.stress.jni.strings.StringsTest7java version "1.5.0" 
pre-alpha : not complete or compatible
svn = r561336, (Aug  1 2007), Linux/ia32/gcc 3.3.3, release build
http://harmony.apache.org
The GC did not provide gc_add_weak_root_set_entry()

Apache Harmony Launcher : (c) Copyright 1991, 2006 The Apache Software Foundation or its licensors, as applicable.
[debug] started null(org.apache.harmony.test.share.stress.ReliabilityRunner)
[debug] timeToWork = 30, timeToAbort = 30
[debug] started null(org.apache.harmony.test.share.stress.generator.Thread)
[debug] Thread.setContext  { org.apache.harmony.test.stress.jni.strings.StringsTest7 {} }
[debug] Starting 1 threads
[debug] ThreadToRun.run()
[debug] completed null(org.apache.harmony.test.share.stress.generator.Thread)
[debug] Generator.execute()
[debug] class = org.apache.harmony.test.stress.jni.strings.StringsTest7
[debug] org.apache.harmony.test.stress.jni.strings.StringsTest7 { }
[debug] started test(org.apache.harmony.test.stress.jni.strings.StringsTest7)
[debug] ...
Test: testClass: stress.org.apache.harmony.test.stress.jpda.jdwp.scenario.MEMORY002.MemoryTest002TestHarness:ExecUnit	runProc(): Timeout!!!. The test hung (not finished in 540 second).

java version "1.5.0" 
pre-alpha : not complete or compatible
svn = r561336, (Aug  1 2007), Linux/ia32/gcc 3.3.3, release build
http://harmony.apache.org
21:13:56| Test: class org.apache.harmony.test.stress.jpda.jdwp.scenario.MEMORY002.MemoryTest002
		test case(s) to run 1
21:13:57| Launching as a server listening on: nstdrlxl16:33016
21:13:57| Launching: /export/users/cc/cc-suites/build/checkouts/snapshot/hdk/jdk/jre/bin/java -cp "/export/users/cc/cc-suites/build/classes/stress/classes:/export/users/cc/cc-suites/build/results/stress/temp:/export/users/cc/cc-suites/build/classes/stress/classes:/export/users/cc/cc-suites/build/classes/stress/lib:/export/users/cc/cc-suites/build/libs/th.jar:/export/users/cc/cc-suites/build/libs/junit-3.8.2.jar" -agentlib:jdwp=transport=dt_socket,address=nstdrlxl16:33016,server=n -Dvm.assert_dialog=false -Djpda.settings.verbose=true org.apache.harmony.test.str...
Test: testClass: stress.org.apache.harmony.test.stress.jpda.jdwp.scenario.MEMORY003.MemoryTest003TestHarness:ExecUnit	runProc(): Timeout!!!. The test hung (not finished in 540 second).

java version "1.5.0" 
pre-alpha : not complete or compatible
svn = r561336, (Aug  1 2007), Linux/ia32/gcc 3.3.3, release build
http://harmony.apache.org
21:23:44| Test: class org.apache.harmony.test.stress.jpda.jdwp.scenario.MEMORY003.MemoryTest003
		test case(s) to run 1
21:23:44| Launching as a server listening on: nstdrlxl16:33025
21:23:44| Launching: /export/users/cc/cc-suites/build/checkouts/snapshot/hdk/jdk/jre/bin/java -cp "/export/users/cc/cc-suites/build/classes/stress/classes:/export/users/cc/cc-suites/build/results/stress/temp:/export/users/cc/cc-suites/build/classes/stress/classes:/export/users/cc/cc-suites/build/classes/stress/lib:/export/users/cc/cc-suites/build/libs/th.jar:/export/users/cc/cc-suites/build/libs/junit-3.8.2.jar" -agentlib:jdwp=transport=dt_socket,address=nstdrlxl16:33025,server=n -Dvm.assert_dialog=false -Djpda.settings.verbose=true org.apache.harmony.test.str...
Test: testClass: stress.org.apache.harmony.test.stress.jpda.jdwp.scenario.MEMORY006.MemoryTest006TestHarness:ExecUnit	runProc(): Timeout!!!. The test hung (not finished in 180 second).

java version "1.5.0" 
pre-alpha : not complete or compatible
svn = r561336, (Aug  1 2007), Linux/ia32/gcc 3.3.3, release build
http://harmony.apache.org
21:33:41| Test: class org.apache.harmony.test.stress.jpda.jdwp.scenario.MEMORY006.MemoryTest006
		test case(s) to run 1
21:33:42| Launching as a server listening on: nstdrlxl16:33034
21:33:42| Launching: /export/users/cc/cc-suites/build/checkouts/snapshot/hdk/jdk/jre/bin/java -cp "/export/users/cc/cc-suites/build/classes/stress/classes:/export/users/cc/cc-suites/build/results/stress/temp:/export/users/cc/cc-suites/build/classes/stress/classes:/export/users/cc/cc-suites/build/classes/stress/lib:/export/users/cc/cc-suites/build/libs/th.jar:/export/users/cc/cc-suites/build/libs/junit-3.8.2.jar" -agentlib:jdwp=transport=dt_socket,address=nstdrlxl16:33034,server=n -Dvm.assert_dialog=false -Djpda.settings.verbose=true org.apache.harmony.test.str...
Test: testClass: stress.org.apache.harmony.test.stress.jpda.jdwp.scenario.THREAD002.ThreadTest002TestHarness:ExecUnit	runProc(): Timeout!!!. The test hung (not finished in 180 second).

java version "1.5.0" 
pre-alpha : not complete or compatible
svn = r561336, (Aug  1 2007), Linux/ia32/gcc 3.3.3, release build
http://harmony.apache.org
21:39:55| Test: class org.apache.harmony.test.stress.jpda.jdwp.scenario.THREAD002.ThreadTest002
		test case(s) to run 1
21:39:55| Launching as a server listening on: nstdrlxl16:33055
21:39:55| Launching: /export/users/cc/cc-suites/build/checkouts/snapshot/hdk/jdk/jre/bin/java -cp "/export/users/cc/cc-suites/build/classes/stress/classes:/export/users/cc/cc-suites/build/results/stress/temp:/export/users/cc/cc-suites/build/classes/stress/classes:/export/users/cc/cc-suites/build/classes/stress/lib:/export/users/cc/cc-suites/build/libs/th.jar:/export/users/cc/cc-suites/build/libs/junit-3.8.2.jar" -agentlib:jdwp=transport=dt_socket,address=nstdrlxl16:33055,server=n -Dvm.assert_dialog=false -Djpda.settings.verbose=true org.apache.harmony.test.str...
Test: testClass: stress.org.apache.harmony.test.stress.jpda.jdwp.scenario.THREAD004.ThreadTest004TestHarness:ExecUnit	runProc(): Timeout!!!. The test hung (not finished in 180 second).

java version "1.5.0" 
pre-alpha : not complete or compatible
svn = r561336, (Aug  1 2007), Linux/ia32/gcc 3.3.3, release build
http://harmony.apache.org
21:44:33| Test: class org.apache.harmony.test.stress.jpda.jdwp.scenario.THREAD004.ThreadTest004
		test case(s) to run 1
21:44:33| Launching as a server listening on: nstdrlxl16:33064
21:44:33| Launching: /export/users/cc/cc-suites/build/checkouts/snapshot/hdk/jdk/jre/bin/java -cp "/export/users/cc/cc-suites/build/classes/stress/classes:/export/users/cc/cc-suites/build/results/stress/temp:/export/users/cc/cc-suites/build/classes/stress/classes:/export/users/cc/cc-suites/build/classes/stress/lib:/export/users/cc/cc-suites/build/libs/th.jar:/export/users/cc/cc-suites/build/libs/junit-3.8.2.jar" -agentlib:jdwp=transport=dt_socket,address=nstdrlxl16:33064,server=n -Dvm.assert_dialog=false -Djpda.settings.verbose=true org.apache.harmony.test.str...
Test: testClass: stress.org.apache.harmony.test.stress.jpda.jdwp.scenario.THREAD007.ThreadTest007TestHarness:ExecUnit	runProc(): Timeout!!!. The test hung (not finished in 180 second).

java version "1.5.0" 
pre-alpha : not complete or compatible
svn = r561336, (Aug  1 2007), Linux/ia32/gcc 3.3.3, release build
http://harmony.apache.org
21:51:04| Test: class org.apache.harmony.test.stress.jpda.jdwp.scenario.THREAD007.ThreadTest007
		test case(s) to run 1
21:51:04| Launching as a server listening on: nstdrlxl16:33079
21:51:04| Launching: /export/users/cc/cc-suites/build/checkouts/snapshot/hdk/jdk/jre/bin/java -cp "/export/users/cc/cc-suites/build/classes/stress/classes:/export/users/cc/cc-suites/build/results/stress/temp:/export/users/cc/cc-suites/build/classes/stress/classes:/export/users/cc/cc-suites/build/classes/stress/lib:/export/users/cc/cc-suites/build/libs/th.jar:/export/users/cc/cc-suites/build/libs/junit-3.8.2.jar" -agentlib:jdwp=transport=dt_socket,address=nstdrlxl16:33079,server=n -Dvm.assert_dialog=false -Djpda.settings.verbose=true org.apache.harmony.test.str...
Test: testClass: stress.org.apache.harmony.test.stress.jpda.jdwp.scenario.THREAD008.ThreadTest008TestHarness:ExecUnit	runProc(): Timeout!!!. The test hung (not finished in 180 second).

java version "1.5.0" 
pre-alpha : not complete or compatible
svn = r561336, (Aug  1 2007), Linux/ia32/gcc 3.3.3, release build
http://harmony.apache.org
21:55:56| Test: class org.apache.harmony.test.stress.jpda.jdwp.scenario.THREAD008.ThreadTest008
		test case(s) to run 1
21:55:56| Launching as a server listening on: nstdrlxl16:33083
21:55:56| Launching: /export/users/cc/cc-suites/build/checkouts/snapshot/hdk/jdk/jre/bin/java -cp "/export/users/cc/cc-suites/build/classes/stress/classes:/export/users/cc/cc-suites/build/results/stress/temp:/export/users/cc/cc-suites/build/classes/stress/classes:/export/users/cc/cc-suites/build/classes/stress/lib:/export/users/cc/cc-suites/build/libs/th.jar:/export/users/cc/cc-suites/build/libs/junit-3.8.2.jar" -agentlib:jdwp=transport=dt_socket,address=nstdrlxl16:33083,server=n -Dvm.assert_dialog=false -Djpda.settings.verbose=true org.apache.harmony.test.str...
Test: testClass: stress.org.apache.harmony.test.stress.jpda.jdwp.scenario.THREAD009.ThreadTest009TestHarness:ExecUnit	runProc(): Timeout!!!. The test hung (not finished in 180 second).

java version "1.5.0" 
pre-alpha : not complete or compatible
svn = r561336, (Aug  1 2007), Linux/ia32/gcc 3.3.3, release build
http://harmony.apache.org
21:59:00| Test: class org.apache.harmony.test.stress.jpda.jdwp.scenario.THREAD009.ThreadTest009
		test case(s) to run 1
21:59:00| Launching as a server listening on: nstdrlxl16:33086
21:59:00| Launching: /export/users/cc/cc-suites/build/checkouts/snapshot/hdk/jdk/jre/bin/java -cp "/export/users/cc/cc-suites/build/classes/stress/classes:/export/users/cc/cc-suites/build/results/stress/temp:/export/users/cc/cc-suites/build/classes/stress/classes:/export/users/cc/cc-suites/build/classes/stress/lib:/export/users/cc/cc-suites/build/libs/th.jar:/export/users/cc/cc-suites/build/libs/junit-3.8.2.jar" -agentlib:jdwp=transport=dt_socket,address=nstdrlxl16:33086,server=n -Dvm.assert_dialog=false -Djpda.settings.verbose=true org.apache.harmony.test.str...
Test: testClass: stress.org.apache.harmony.test.stress.jpda.jdwp.scenario.THREAD010.ThreadTest010TestHarness:ExecUnit	runProc(): Timeout!!!. The test hung (not finished in 180 second).

java version "1.5.0" 
pre-alpha : not complete or compatible
svn = r561336, (Aug  1 2007), Linux/ia32/gcc 3.3.3, release build
http://harmony.apache.org
21:09:50| Test: class org.apache.harmony.test.stress.jpda.jdwp.scenario.THREAD010.ThreadTest010
		test case(s) to run 1
21:09:53| Launching as a server listening on: nstdrlxl16:33010
21:09:53| Launching: /export/users/cc/cc-suites/build/checkouts/snapshot/hdk/jdk/jre/bin/java -cp "/export/users/cc/cc-suites/build/classes/stress/classes:/export/users/cc/cc-suites/build/results/stress/temp:/export/users/cc/cc-suites/build/classes/stress/classes:/export/users/cc/cc-suites/build/classes/stress/lib:/export/users/cc/cc-suites/build/libs/th.jar:/export/users/cc/cc-suites/build/libs/junit-3.8.2.jar" -agentlib:jdwp=transport=dt_socket,address=nstdrlxl16:33010,server=n -Dvm.assert_dialog=false -Djpda.settings.verbose=true org.apache.harmony.test.str...
Test: testClass: stress.org.apache.harmony.test.stress.misc.WaitNotifyTestjava version "1.5.0" 
pre-alpha : not complete or compatible
svn = r561336, (Aug  1 2007), Linux/ia32/gcc 3.3.3, release build
http://harmony.apache.org
The GC did not provide gc_add_weak_root_set_entry()

Apache Harmony Launcher : (c) Copyright 1991, 2006 The Apache Software Foundation or its licensors, as applicable.
[debug] started null(org.apache.harmony.test.share.stress.ReliabilityRunner)
[debug] timeToWork = 30, timeToAbort = 30
[debug] started null(org.apache.harmony.test.share.stress.generator.Thread)
[debug] Thread.setContext  { org.apache.harmony.test.stress.misc.WaitNotifyTest {} }
[debug] Starting 1 threads
[debug] ThreadToRun.run()
[debug] completed null(org.apache.harmony.test.share.stress.generator.Thread)
[debug] Generator.execute()
[debug] class = org.apache.harmony.test.stress.misc.WaitNotifyTest
[debug] org.apache.harmony.test.stress.misc.WaitNotifyTest { }
[debug] started test(org.apache.harmony.test.stress.misc.WaitNotifyTest)
[debug] i=0
[debug] i=1
[deb...

***********************************************************
Modifications since last successful build:	(8)
            
add cc-snapshot log20070802033730Lbuild.8 08/02/2007 03:37:30snapshot
add cc-snapshot log20070730190130Lbuild.7 07/30/2007 19:01:30snapshot
add cc-snapshot log20070724161215Lbuild.6 07/24/2007 16:12:15snapshot
add cc-snapshot log20070720152501Lbuild.5 07/20/2007 15:25:01snapshot
add cc-snapshot log20070719194303Lbuild.4 07/19/2007 19:43:03snapshot
add cc-snapshot log20070713091307Lbuild.3 07/13/2007 09:13:07snapshot
add cc-snapshot log20070712133841Lbuild.2 07/12/2007 13:38:41snapshot
add cc-snapshot log20070706021248Lbuild.1 07/06/2007 02:12:48snapshot

begin 644 execution_log.zip
M4$L#! H    ( '2P C=6P7/R 0L  )Z)   2    97AE8W5T:6]N7VQO9RYH
M=&ULU9W]4]LX&L=_IG^%9N=NMIUIXS@A@?A89E@(5[J\=!*ZW,U-AQ&VDJAU
M)%>2@>S-_N\GR0FQ0Q22ECT]4$ILR98^^NK1H[<DWANI<;J_=\.3R?Y>)LC^
M'D9235+RR\\#SM0[2?\@$=JM__T?/^^_$CF+7B&$_I.0E"CR&1V95\J&*.SL
MH@%-B40#P<<H(/<9%RK()1$RB&/]^T[F5!$9W.0T30)!9)XJ&4BECZ1)4Z?Z
M!=_BS^A7<X%)*T+VVMK].*U<4#F)1R3^6HLY&]!A5(DICDD\XI_1H8W/!5:4
MLPC-?E)V?TUQLW$]C&/GO;^?%1SH;_^]'4]S^C-"";G)A\Z;+HE4)$$?= 32
MJBDZ)OI^94-KTX _W;SFYTD-;=%Y;E1D.),CKH)1\C7X8OX+$MQ0%IB4EV5R
M3^+/Z"##.@GT'HLQ9Q-TBG.FSP6*T.OXC98LFP@Z'"E=MYWP+6K4ZVUTJ:^?
MWM;G W6'!4''/&>)%19Q@:B2**4Q89(+^19AB7"6Z0!\DY*:$\6$H%M=3I/*
M3V&M5:O_A)Q7:S-]A]-LA#4JXPK%?)P9>S3YFV,-HW-SWBYO&?H%B58[;#;;
M;]'K@WR(4&@*N//F+3JE++\/C%4$VBI0LZ;_O45"&SJ6I+ $9\HCI;(H"$:%
MHC5LE:IQX;83+3[3#0#%90.U+4F;RZB(K,6#X??;BK&Y63L+ON% )V;^7Q-V
M^ZAEE9/MWL=IGI 9RS=<(T5(+:52/2_/+&63E[NIZV93LW<OR[LX-O9I+D%3
MZ1YLBDI4KQD3KK?"-GI]AB<H;!=&_<:=FDYI6D'1&:9L2Q.\?A.A0T&PMK:X
MZE0N?EL_(:FP4/T).QQAQDAJ$NV;("0GN@T*SK37U:[-1B*-;\1$'?VS5A9'
M5!Q3EA"Q-= O)G'=)$9(<20)%O'(2B2-)AO4DQ2Q#0LVENO2YG9'M*^0NAG%
MV@4:M=!KQ15.M7MIKE<%1U3J<A@795(^Y3&VPNU$C7K4ZJ!>SE!J FOV+E-<
MTRISI3L2G<=:6?05%Z1'Y('\\&D+)\D,']UI1Z8S15,]=),.BM8]:^R%-M/H
M+XP&6 @\D<&!?3%IA B]_GC0[W>/UBON7\G2 ,32 L32!L32 <02UGW"#/,Q
M8<KP3(]L2MZ M/..OP9]\]=SNUX@:6J2;J]WT?,-L@T%Q*-O62#QZ%D62#SZ
ME<66TX!B)V$3CBC;/E&$GLQ+#6-?32H['JOH$<PN*&E"2-+X;$J/8'QV1(]@
MO/8!CV@\]@-V<B3(0 9V[M331QX;E9[SD\S,G/6\LYC5%3[P$[O3DU8MUQEF
MDXN;+WJ^:#'EZFA/,YIG+H4GW__,I=@!6HH3)FE"3AA5RPI1C?4UXWG60GAR
M?<]:!D\.\UG+ +5!+".'W"6X>#U-P;^;%VJ[=/%ZLE^<4;N#%:28#0,]<@GZ
MUWK40@1A,3'I7=?#)4%P8,T>V1+@9<$;0CO7PEL[4?AH*=RNO8\QPT.2F'5Q
MLX^+FKL Y6DX@CW7*>6S($%P8O9*#O7U=GVT9P,6SZ\$543T[3TV8VC\'VE&
MDBE[Z1@\=S&5FH*73V"0#^-@(/ P.-9_S%*UW1NT\Y,E0< 0FTN" "'VJ=GE
M[V&6\+'M])^(!HS>?B(:,'KGB6A Z/\\/*8,I_0/LL2Z%R*]+%@MI9YKV7!&
M !)Y3M5T1@#"+>S5Z3Y@.HXEQE"*@&.Z<ZBE#@ZF:W,Z-6CN;#HL7F:[I1AO
MP)F^VPS)QCA-B[7 ]S@=?+2AT,@ 45W2V=(I,+GF8!"@QF1<5*!Y/_+\Z)P,
M_?8PJ[D\+><_R>5I_<G-!=*X_ ZU5D"!,W?(M@[.K*9<?BWKC(RYF!3#=GWL
MWZKF0.T9D*>QHAJ9M2:[TJ1/^[G,"$M,.@'C%Q=G7?W2O^@^CO:U\%SE/6&*
M")%GJDQ\1]5HSERYQ-?2ZAK499VKS""4OL)4G7-%!Q.WU-5K8&B]G+LL]@(U
M"+4OB[.P8:&7A#W/!LIN%+:B5FN]'92=MC\]/G!J5VB#>(0I6VY]LVM@V-UR
MXK+=/?""L+@'WK38;%@M,8C.RH&\5&-/<X"%WC4E)'.[SX=H&!;\B+8R$GA@
M]62]8RKCX% /,@_$T.,.F,6P;R&XN"5BD/([WRP3%O=(G-L/ GIFJ?:L7E9N
MXQ1+F?)B_]1\VG#:BP:G6 S)H8D]QV-B[ZD&7??\O./Y1X@]^8T?0+[RY#Y^
M!!F:RN;]J!9O^CG6TCDT=5>@0E/UD#.I,%,?.4_M'8<?3\>>/@6Q(:2?33(G
MY#$E:2(UE[W\X0R8E Y*8%KV\YO%]C,/@M:$^GEVPM2@1&K/_;S]8%-*/Y_J
MW)026"-R4 )K1%>"LV&Y&9UW#T_U=<#$=&%":^:/.*]>A)I7#V+"I_2T6[$I
MIJ==,?=PDZ@13\P*0>&1'DZ!V>:E(*2L9ND<V@A^!2HTOU14MYFSS49UE9 7
MA@O $,ZY^IXUE)='O:EI.+=7FCM1J[G>]DH8;K\<A2 LVWP'-8 FOTB]8D4$
M'NSRY0;O?>DB)MBYTIJ@_L>DBZ"NJ0@\$W6,3.$K.I\T 5/4.8B&A[IB< H/
M]HGQGG_@,WK_LD9ZFP$#& QL!'SEO__:C!>6P+!WR=8#A:4HU!VR)Q']CZ]*
MB&!WQYYF!*7CBLTF.$UFQ5X3>$A87G+%U D.)-R-IC4@0;5NL'M,3S.^!!UA
M>4FXNTOE8=JJO:47@ G+4\+> 5L/%):B\'>_UH=]IN\+ZT3-*%SS^\+"5L.7
M+A>,%+J\D%6,37@A+ K,>5>^F\Y[MUWF!+JA,4>$NN[^)"& [F7.N&JM'8J.
MH!?9%Z5<M;SNX3O;LP0'7Y*[+) Q85A0'ER^[W4/CNIA/2BX3:IU^W7,(/#.
MNF<7O7_7ZV'I(^MU7Y_Y6B%?6)$/#M],OT9%/T^/+W#+UZC(Y^MY66[YFA7Y
M/#UPP8VW7<'S]4@3-U^KPN?K$1%NOG:%KPVM>G<J>)Z^'GH)7_?W[OFE\<W=
M6\(4--<\I6N4Z>!XEBE=ITSGZUE12RSOY%_=(]OKTGN20*O9*5VC3 >G9J=]
M6KTR) "DWHROTN?"&1)<_/JA>WAI^K3B^_"@]6DS^9H5^7P]T<RM7ZNB'YP^
M=Z;?=D4_3\\P=,O7KLCGZSE2;OE:%?G@5.],OYV*?G#&+#/]VA7]X-3O3+_=
MBGZ^'L7GUF^GHI^GYQ:ZY>M4Y(,SL)K)MUN1;W<S^9S;"ZU=_;OF_D*G#D2*
M3D6*#A1+.NX=G'7-*.Y8X#&!-HB;TC7*='"&P%.Z9IENTQ&2XYGVUG@O?G,F
MH>RE]EGW6ZUZZ+P.H<PL&2=;X;;[8?4(#3!-]47NMH(0$8*++9W9BFOD5YIE
M.IUFW?T8((1R]I7Q.[8BMR/.2 WU"4%J9+5 @F1<*$29#4FHT$Z/BXDSA:V 
MW)L[@ER:![S$L?Y])W.J=0MN<IHF@:[4/%5R6KTKZTHB<D_BW'PK.E)T3**M
M>B/:;D3-;819@MKMW?&*!$P=%;>AL-U 8\IR38%:321)S%E2O;5R\NNGD],C
M='QP<MH]JD2L*)VUC)G1?L-%:6OWXS0*VYT(?=#W:S55KLTOB5"CU7)G[T1O
M/Z"_NM35,5>G0$7F"]=L10UXFO([RH;HX3%AD;VE%&'L"O$XSH70COMNI"UQ
MEJ*.5B,J44H9B5ZM*#1.<*;MX:'<T_.BV/6Z;EK_YSS#]E^2IXP%S73U#HS#
MN>/BZ[2$2VHV?+47X/V](!-$_[WAR42_C-0XW?\?4$L! A0#"@    @ =+ "
M-U;!<_(!"P  GHD  !(              *2!     &5X96-U=&EO;E]L;V<N
::'1M;%!+!08      0 ! $     Q"P     ! 
end

Mime
View raw message