harmony-alerts mailing list archives

Site index · List index
Message view « Date » · « Thread »
Top « Date » · « Thread »
From nom...@intel.com
Subject [build-test alert] BUILD FAILED Linux x86: classlib-test
Date Thu, 02 Aug 2007 14:18:06 GMT
BUILD FAILED:
	Ant Error Message:
/export/users/cc/cc-common/scripts/cc-exec-adaptor.xml:101: The following error occurred while executing this line: /export/users/cc/cc-common/adaptors/classlib-test/adaptor.xml:80: There were CLASSLIB Unit Test failures.

Date of build:	08/02/2007 20:43:00
Time to build:	33 minutes 58 seconds
Last changed:	08/02/2007 20:21:34
Last log entry:	hdk

***********************************************************
Errors/Warnings:	(10)
            
[junit] Tests FAILED
[junit] Tests FAILED
[junit] Tests FAILED
[junit] Tests FAILED
BUILD FAILED
/export/users/cc/cc-common/build/checkouts/hdk/working_classlib/build.xml:169: The following error occurred while executing this line:
/export/users/cc/cc-common/build/checkouts/hdk/working_classlib/make/build-test.xml:147: There were test errors.
Total time: 33 minutes 50 seconds
The execution FAILED with the following exception:
The following error occurred while executing this line:
/export/users/cc/cc-common/adaptors/classlib-test/adaptor.xml:80: There were CLASSLIB Unit Test failures.

***********************************************************
Unit Tests: (15400)
        
error: testInstantiate_Normal java.beans.ArrayPersistenceDelegateTest
error: testInstantiate_Normal java.beans.ClassPersistenceDelegateTest
error: testInstantiate_Primitive java.beans.ClassPersistenceDelegateTest
error: testInstantiate_Class java.beans.ClassPersistenceDelegateTest
error: testInstantiate_Normal java.beans.StringPersistenceDelegateTest
error: test_instantiate_with_applet org.apache.harmony.beans.tests.java.beans.BeansTest
error: testStringPD org.apache.harmony.beans.tests.java.beans.CustomizedPersistenceDelegateTest
error: testArrayPD org.apache.harmony.beans.tests.java.beans.CustomizedPersistenceDelegateTest
error: testClassPD org.apache.harmony.beans.tests.java.beans.CustomizedPersistenceDelegateTest
error: testProxyPD org.apache.harmony.beans.tests.java.beans.CustomizedPersistenceDelegateTest
error: testPrimitivePD org.apache.harmony.beans.tests.java.beans.CustomizedPersistenceDelegateTest
error: testMethodPD org.apache.harmony.beans.tests.java.beans.CustomizedPersistenceDelegateTest
error: testFieldPD org.apache.harmony.beans.tests.java.beans.CustomizedPersistenceDelegateTest
error: testInstantiate_Normal org.apache.harmony.beans.tests.java.beans.DefaultPersistenceDelegateTest
error: testInstantiate_NullInstance org.apache.harmony.beans.tests.java.beans.DefaultPersistenceDelegateTest
error: testInstantiate_NullProperty org.apache.harmony.beans.tests.java.beans.DefaultPersistenceDelegateTest
error: testInstantiate_NoProperty org.apache.harmony.beans.tests.java.beans.DefaultPersistenceDelegateTest
error: testInstantiate_NonExistingGetter org.apache.harmony.beans.tests.java.beans.DefaultPersistenceDelegateTest
error: testInstantiate_InvalidGetter org.apache.harmony.beans.tests.java.beans.DefaultPersistenceDelegateTest
error: testInstantiate_ExceptionalGetter org.apache.harmony.beans.tests.java.beans.DefaultPersistenceDelegateTest
error: testInstantiate_ErrorGetter org.apache.harmony.beans.tests.java.beans.DefaultPersistenceDelegateTest
error: testInstantiate_PrivateGetter org.apache.harmony.beans.tests.java.beans.DefaultPersistenceDelegateTest
error: testInstantiate_InitialUpperCasePropName org.apache.harmony.beans.tests.java.beans.DefaultPersistenceDelegateTest
error: testInstantiate_NoGetter org.apache.harmony.beans.tests.java.beans.DefaultPersistenceDelegateTest
error: testInstantiate_NotRegularGetter org.apache.harmony.beans.tests.java.beans.DefaultPersistenceDelegateTest
error: test_initialize org.apache.harmony.beans.tests.java.beans.DefaultPersistenceDelegateTest
error: testInitialize_Normal org.apache.harmony.beans.tests.java.beans.DefaultPersistenceDelegateTest
error: testInitialize_NormalBeanInfo org.apache.harmony.beans.tests.java.beans.DefaultPersistenceDelegateTest
error: testInitialize_TransientProperty org.apache.harmony.beans.tests.java.beans.DefaultPersistenceDelegateTest
error: testInitialize_NoSetter org.apache.harmony.beans.tests.java.beans.DefaultPersistenceDelegateTest
error: testInitialize_NoGetter org.apache.harmony.beans.tests.java.beans.DefaultPersistenceDelegateTest
error: testInitialize_NullClass org.apache.harmony.beans.tests.java.beans.DefaultPersistenceDelegateTest
error: testInitialize_NullInstances org.apache.harmony.beans.tests.java.beans.DefaultPersistenceDelegateTest
error: testArrayPD_Normal org.apache.harmony.beans.tests.java.beans.DefaultPersistenceDelegateTest
error: testGetExceptionListener org.apache.harmony.beans.tests.java.beans.EncoderTest
error: testSetExceptionListener_Null org.apache.harmony.beans.tests.java.beans.EncoderTest
error: testSetExceptionListener org.apache.harmony.beans.tests.java.beans.EncoderTest
error: testWriteExpression_Null org.apache.harmony.beans.tests.java.beans.EncoderTest
error: testWriteStatement_Null org.apache.harmony.beans.tests.java.beans.EncoderTest
error: testWriteObject_Null org.apache.harmony.beans.tests.java.beans.EncoderTest
error: testWriteObject org.apache.harmony.beans.tests.java.beans.EncoderTest
error: testGetPersistenceDelegate_Null org.apache.harmony.beans.tests.java.beans.EncoderTest
error: testGetPersistenceDelegate_ArrayClass org.apache.harmony.beans.tests.java.beans.EncoderTest
error: testGetPersistenceDelegate_ProxyClass org.apache.harmony.beans.tests.java.beans.EncoderTest
error: testGetPersistenceDelegate_BeanInfo org.apache.harmony.beans.tests.java.beans.EncoderTest
error: testGetPersistenceDelegate_Default org.apache.harmony.beans.tests.java.beans.EncoderTest
error: testSetPersistenceDelegate_Null org.apache.harmony.beans.tests.java.beans.EncoderTest
error: testSetPersistenceDelegate org.apache.harmony.beans.tests.java.beans.EncoderTest
error: testGet_NullParam org.apache.harmony.beans.tests.java.beans.EncoderTest
error: testGet_String org.apache.harmony.beans.tests.java.beans.EncoderTest
error: testGet_Integer org.apache.harmony.beans.tests.java.beans.EncoderTest
error: testRemove_Null org.apache.harmony.beans.tests.java.beans.EncoderTest
error: testRemove_String org.apache.harmony.beans.tests.java.beans.EncoderTest
error: testRemove_Integer org.apache.harmony.beans.tests.java.beans.EncoderTest
error: testWriteObject_NormalMutatesToTrue org.apache.harmony.beans.tests.java.beans.PersistenceDelegateTest
error: testWriteObject_NormalMutatesToFalse org.apache.harmony.beans.tests.java.beans.PersistenceDelegateTest
error: testWriteObject_NullObject org.apache.harmony.beans.tests.java.beans.PersistenceDelegateTest
error: testInitialize_Normal org.apache.harmony.beans.tests.java.beans.PersistenceDelegateTest
error: testInitialize_NullClass org.apache.harmony.beans.tests.java.beans.PersistenceDelegateTest
error: testInitialize_NullInstances org.apache.harmony.beans.tests.java.beans.PersistenceDelegateTest
error: testInitialize_circularRedundancy org.apache.harmony.beans.tests.java.beans.PersistenceDelegateTest
error: test_writeObject_Null_LXMLEncoder org.apache.harmony.beans.tests.java.beans.PersistenceDelegateTest
error: test_writeObject_java_lang_reflect_Field org.apache.harmony.beans.tests.java.beans.PersistenceDelegateTest
error: test_writeObject_java_lang_reflect_Method org.apache.harmony.beans.tests.java.beans.PersistenceDelegateTest
error: test_writeObject_java_util_Collection org.apache.harmony.beans.tests.java.beans.PersistenceDelegateTest
error: test_writeObject_java_awt_Choice org.apache.harmony.beans.tests.java.beans.PersistenceDelegateTest
error: test_writeObject_java_awt_SystemColor org.apache.harmony.beans.tests.java.beans.PersistenceDelegateTest
error: test_writeObject_java_awt_font_TextAttribute org.apache.harmony.beans.tests.java.beans.PersistenceDelegateTest
error: test_writeObject_java_awt_MenuShortcut org.apache.harmony.beans.tests.java.beans.PersistenceDelegateTest
error: test_writeObject_java_awt_Component org.apache.harmony.beans.tests.java.beans.PersistenceDelegateTest
error: test_writeObject_java_awt_Container org.apache.harmony.beans.tests.java.beans.PersistenceDelegateTest
error: test_writeObject_java_awt_Menu org.apache.harmony.beans.tests.java.beans.PersistenceDelegateTest
error: test_writeObject_java_awt_MenuBar org.apache.harmony.beans.tests.java.beans.PersistenceDelegateTest
error: test_writeObject_java_awt_List org.apache.harmony.beans.tests.java.beans.PersistenceDelegateTest
error: test_writeObject_java_awt_BorderLayout org.apache.harmony.beans.tests.java.beans.PersistenceDelegateTest
error: test_writeObject_java_awt_CardLayout org.apache.harmony.beans.tests.java.beans.PersistenceDelegateTest
error: test_writeObject_java_awt_GridBagLayout org.apache.harmony.beans.tests.java.beans.PersistenceDelegateTest
error: test_writeObject_java_awt_Cursor org.apache.harmony.beans.tests.java.beans.PersistenceDelegateTest
error: test_writeObject_java_awt_Insets org.apache.harmony.beans.tests.java.beans.PersistenceDelegateTest
error: test_writeObject_java_awt_point org.apache.harmony.beans.tests.java.beans.PersistenceDelegateTest
error: test_writeObject_java_awt_ScrollPane org.apache.harmony.beans.tests.java.beans.PersistenceDelegateTest
error: test_writeObject_java_util_Map org.apache.harmony.beans.tests.java.beans.PersistenceDelegateTest
error: test_writeObject_java_util_List org.apache.harmony.beans.tests.java.beans.PersistenceDelegateTest
error: test_writeObject_java_util_AbstractList org.apache.harmony.beans.tests.java.beans.PersistenceDelegateTest
error: test_writeObject_java_util_AbstractMap org.apache.harmony.beans.tests.java.beans.PersistenceDelegateTest
error: test_writeObject_javax_swing_JFrame org.apache.harmony.beans.tests.java.beans.PersistenceDelegateTest
error: test_writeObject_javax_swing_DefaultListModel org.apache.harmony.beans.tests.java.beans.PersistenceDelegateTest
error: test_writeObject_javax_swing_DefaultComboBoxModel org.apache.harmony.beans.tests.java.beans.PersistenceDelegateTest
error: test_writeObject_javax_swing_tree_DefaultMutableTreeNode org.apache.harmony.beans.tests.java.beans.PersistenceDelegateTest
error: test_writeObject_javax_swing_ToolTipManager org.apache.harmony.beans.tests.java.beans.PersistenceDelegateTest
error: test_writeExpression_writeObject org.apache.harmony.beans.tests.java.beans.PersistenceDelegateTest
error: testColorEditor org.apache.harmony.beans.tests.java.beans.PropertyEditorManagerRegressionTest
error: testFontEditor org.apache.harmony.beans.tests.java.beans.PropertyEditorManagerTest
error: testColorEditor org.apache.harmony.beans.tests.java.beans.PropertyEditorManagerTest
error: testLoadImage org.apache.harmony.beans.tests.java.beans.SimpleBeanInfoTest
error: testAvoidGui org.apache.harmony.beans.tests.java.beans.beancontext.BeanContextSupportTest
error: test_ConstructorLjava_lang_StringZ tests.api.java.io.FileOutputStreamTest
failure: testDefaultValue org.apache.harmony.logging.tests.java.util.logging.FileHandlerTest
Unit Test Error Details:	(98)
                
Test: testInstantiate_NormalClass: java.beans.ArrayPersistenceDelegateTestjava.lang.ExceptionInInitializerError
	at java.lang.reflect.VMField.getObject(VMField.java)
	at java.lang.reflect.Field.get(Field.java:163)
	at java.beans.StaticFieldPersistenceDelegate.init(StaticFieldPersistenceDelegate.java:36)
	at java.beans.AwtSystemColorPersistenceDelegate.<clinit>(AwtSystemColorPersistenceDelegate.java:28)
	at java.beans.Encoder.<clinit>(Encoder.java:104)
	at java.beans.ArrayPersistenceDelegateTest.testInstantiate_Normal(ArrayPersistenceDelegateTest.java:53)
	at java.lang.reflect.VMReflection.invokeMethod(VMReflection.java)
Caused by: java.lang.NullPointerException
	at java.awt.Toolkit.init(Toolkit.java:565)
	at java.awt.Toolkit.<init>(Toolkit.java:539)
	at java.awt.ToolkitImpl.<init>(ToolkitImpl.java:39)
	at java.awt.Toolkit.getDefaultToolkit(Toolkit.java:471)
	at java.awt.SystemColor.<init>(SystemColor.java:143)
	at java.awt.SystemColor.<clinit>(SystemColor.java:91)
	at java.lang.reflect.VMField.getObject(VMField.java)
	... 18 more
Test: testInstantiate_NormalClass: java.beans.ClassPersistenceDelegateTestjava.lang.NoClassDefFoundError: java/beans/Encoder
	at java.beans.ClassPersistenceDelegateTest.testInstantiate_Normal(ClassPersistenceDelegateTest.java:51)
	at java.lang.reflect.VMReflection.invokeMethod(VMReflection.java)
Test: testInstantiate_PrimitiveClass: java.beans.ClassPersistenceDelegateTestjava.lang.NoClassDefFoundError: java/beans/Encoder
	at java.beans.ClassPersistenceDelegateTest.testInstantiate_Primitive(ClassPersistenceDelegateTest.java:61)
	at java.lang.reflect.VMReflection.invokeMethod(VMReflection.java)
Test: testInstantiate_ClassClass: java.beans.ClassPersistenceDelegateTestjava.lang.NoClassDefFoundError: java/beans/Encoder
	at java.beans.ClassPersistenceDelegateTest.testInstantiate_Class(ClassPersistenceDelegateTest.java:71)
	at java.lang.reflect.VMReflection.invokeMethod(VMReflection.java)
Test: testInstantiate_NormalClass: java.beans.StringPersistenceDelegateTestjava.lang.NoClassDefFoundError: java/beans/Encoder
	at java.beans.StringPersistenceDelegateTest.testInstantiate_Normal(StringPersistenceDelegateTest.java:51)
	at java.lang.reflect.VMReflection.invokeMethod(VMReflection.java)
Test: test_instantiate_with_appletClass: org.apache.harmony.beans.tests.java.beans.BeansTestjava.lang.ClassNotFoundException: class java.lang.NullPointerException: null
	at java.beans.Beans.instantiate(Beans.java:194)
	at java.beans.Beans.instantiate(Beans.java:75)
	at org.apache.harmony.beans.tests.java.beans.BeansTest.test_instantiate_with_applet(BeansTest.java:447)
	at java.lang.reflect.VMReflection.invokeMethod(VMReflection.java)
Test: testStringPDClass: org.apache.harmony.beans.tests.java.beans.CustomizedPersistenceDelegateTestjava.lang.ExceptionInInitializerError
	at java.lang.reflect.VMField.getObject(VMField.java)
	at java.lang.reflect.Field.get(Field.java:163)
	at java.beans.StaticFieldPersistenceDelegate.init(StaticFieldPersistenceDelegate.java:36)
	at java.beans.AwtSystemColorPersistenceDelegate.<clinit>(AwtSystemColorPersistenceDelegate.java:28)
	at java.beans.Encoder.<clinit>(Encoder.java:104)
	at org.apache.harmony.beans.tests.java.beans.CustomizedPersistenceDelegateTest.setUp(CustomizedPersistenceDelegateTest.java:43)
Caused by: java.lang.NullPointerException
	at java.awt.Toolkit.init(Toolkit.java:565)
	at java.awt.Toolkit.<init>(Toolkit.java:539)
	at java.awt.ToolkitImpl.<init>(ToolkitImpl.java:39)
	at java.awt.Toolkit.getDefaultToolkit(Toolkit.java:471)
	at java.awt.SystemColor.<init>(SystemColor.java:143)
	at java.awt.SystemColor.<clinit>(SystemColor.java:91)
	at java.lang.reflect.VMField.getObject(VMField.java)
	... 15 more
Test: testArrayPDClass: org.apache.harmony.beans.tests.java.beans.CustomizedPersistenceDelegateTestjava.lang.NoClassDefFoundError: org/apache/harmony/beans/tests/java/beans/CustomizedPersistenceDelegateTest$MockEncoder
	at org.apache.harmony.beans.tests.java.beans.CustomizedPersistenceDelegateTest.setUp(CustomizedPersistenceDelegateTest.java:43)
Test: testClassPDClass: org.apache.harmony.beans.tests.java.beans.CustomizedPersistenceDelegateTestjava.lang.NoClassDefFoundError: org/apache/harmony/beans/tests/java/beans/CustomizedPersistenceDelegateTest$MockEncoder
	at org.apache.harmony.beans.tests.java.beans.CustomizedPersistenceDelegateTest.setUp(CustomizedPersistenceDelegateTest.java:43)
Test: testProxyPDClass: org.apache.harmony.beans.tests.java.beans.CustomizedPersistenceDelegateTestjava.lang.NoClassDefFoundError: org/apache/harmony/beans/tests/java/beans/CustomizedPersistenceDelegateTest$MockEncoder
	at org.apache.harmony.beans.tests.java.beans.CustomizedPersistenceDelegateTest.setUp(CustomizedPersistenceDelegateTest.java:43)
Test: testPrimitivePDClass: org.apache.harmony.beans.tests.java.beans.CustomizedPersistenceDelegateTestjava.lang.NoClassDefFoundError: org/apache/harmony/beans/tests/java/beans/CustomizedPersistenceDelegateTest$MockEncoder
	at org.apache.harmony.beans.tests.java.beans.CustomizedPersistenceDelegateTest.setUp(CustomizedPersistenceDelegateTest.java:43)
Test: testMethodPDClass: org.apache.harmony.beans.tests.java.beans.CustomizedPersistenceDelegateTestjava.lang.NoClassDefFoundError: org/apache/harmony/beans/tests/java/beans/CustomizedPersistenceDelegateTest$MockEncoder
	at org.apache.harmony.beans.tests.java.beans.CustomizedPersistenceDelegateTest.setUp(CustomizedPersistenceDelegateTest.java:43)
Test: testFieldPDClass: org.apache.harmony.beans.tests.java.beans.CustomizedPersistenceDelegateTestjava.lang.NoClassDefFoundError: org/apache/harmony/beans/tests/java/beans/CustomizedPersistenceDelegateTest$MockEncoder
	at org.apache.harmony.beans.tests.java.beans.CustomizedPersistenceDelegateTest.setUp(CustomizedPersistenceDelegateTest.java:43)
Test: testInstantiate_NormalClass: org.apache.harmony.beans.tests.java.beans.DefaultPersistenceDelegateTestjava.lang.NoClassDefFoundError: java/beans/Encoder
	at org.apache.harmony.beans.tests.java.beans.DefaultPersistenceDelegateTest.testInstantiate_Normal(DefaultPersistenceDelegateTest.java:111)
	at java.lang.reflect.VMReflection.invokeMethod(VMReflection.java)
Test: testInstantiate_NullInstanceClass: org.apache.harmony.beans.tests.java.beans.DefaultPersistenceDelegateTestjava.lang.NoClassDefFoundError: java/beans/Encoder
	at org.apache.harmony.beans.tests.java.beans.DefaultPersistenceDelegateTest.testInstantiate_NullInstance(DefaultPersistenceDelegateTest.java:127)
	at java.lang.reflect.VMReflection.invokeMethod(VMReflection.java)
Test: testInstantiate_NullPropertyClass: org.apache.harmony.beans.tests.java.beans.DefaultPersistenceDelegateTestjava.lang.NoClassDefFoundError: java/beans/Encoder
	at org.apache.harmony.beans.tests.java.beans.DefaultPersistenceDelegateTest.testInstantiate_NullProperty(DefaultPersistenceDelegateTest.java:161)
	at java.lang.reflect.VMReflection.invokeMethod(VMReflection.java)
Test: testInstantiate_NoPropertyClass: org.apache.harmony.beans.tests.java.beans.DefaultPersistenceDelegateTestjava.lang.NoClassDefFoundError: java/beans/Encoder
	at org.apache.harmony.beans.tests.java.beans.DefaultPersistenceDelegateTest.testInstantiate_NoProperty(DefaultPersistenceDelegateTest.java:188)
	at java.lang.reflect.VMReflection.invokeMethod(VMReflection.java)
Test: testInstantiate_NonExistingGetterClass: org.apache.harmony.beans.tests.java.beans.DefaultPersistenceDelegateTestjava.lang.NoClassDefFoundError: java/beans/Encoder
	at org.apache.harmony.beans.tests.java.beans.DefaultPersistenceDelegateTest.testInstantiate_NonExistingGetter(DefaultPersistenceDelegateTest.java:204)
	at java.lang.reflect.VMReflection.invokeMethod(VMReflection.java)
Test: testInstantiate_InvalidGetterClass: org.apache.harmony.beans.tests.java.beans.DefaultPersistenceDelegateTestjava.lang.NoClassDefFoundError: java/beans/Encoder
	at org.apache.harmony.beans.tests.java.beans.DefaultPersistenceDelegateTest.testInstantiate_InvalidGetter(DefaultPersistenceDelegateTest.java:257)
	at java.lang.reflect.VMReflection.invokeMethod(VMReflection.java)
Test: testInstantiate_ExceptionalGetterClass: org.apache.harmony.beans.tests.java.beans.DefaultPersistenceDelegateTestjava.lang.NoClassDefFoundError: java/beans/Encoder
	at org.apache.harmony.beans.tests.java.beans.DefaultPersistenceDelegateTest.testInstantiate_ExceptionalGetter(DefaultPersistenceDelegateTest.java:275)
	at java.lang.reflect.VMReflection.invokeMethod(VMReflection.java)
Test: testInstantiate_ErrorGetterClass: org.apache.harmony.beans.tests.java.beans.DefaultPersistenceDelegateTestjava.lang.NoClassDefFoundError: java/beans/Encoder
	at org.apache.harmony.beans.tests.java.beans.DefaultPersistenceDelegateTest.testInstantiate_ErrorGetter(DefaultPersistenceDelegateTest.java:293)
	at java.lang.reflect.VMReflection.invokeMethod(VMReflection.java)
Test: testInstantiate_PrivateGetterClass: org.apache.harmony.beans.tests.java.beans.DefaultPersistenceDelegateTestjava.lang.NoClassDefFoundError: java/beans/Encoder
	at org.apache.harmony.beans.tests.java.beans.DefaultPersistenceDelegateTest.testInstantiate_PrivateGetter(DefaultPersistenceDelegateTest.java:311)
	at java.lang.reflect.VMReflection.invokeMethod(VMReflection.java)
Test: testInstantiate_InitialUpperCasePropNameClass: org.apache.harmony.beans.tests.java.beans.DefaultPersistenceDelegateTestjava.lang.NoClassDefFoundError: java/beans/Encoder
	at org.apache.harmony.beans.tests.java.beans.DefaultPersistenceDelegateTest.testInstantiate_InitialUpperCasePropName(DefaultPersistenceDelegateTest.java:329)
	at java.lang.reflect.VMReflection.invokeMethod(VMReflection.java)
Test: testInstantiate_NoGetterClass: org.apache.harmony.beans.tests.java.beans.DefaultPersistenceDelegateTestjava.lang.NoClassDefFoundError: java/beans/Encoder
	at org.apache.harmony.beans.tests.java.beans.DefaultPersistenceDelegateTest.testInstantiate_NoGetter(DefaultPersistenceDelegateTest.java:342)
	at java.lang.reflect.VMReflection.invokeMethod(VMReflection.java)
Test: testInstantiate_NotRegularGetterClass: org.apache.harmony.beans.tests.java.beans.DefaultPersistenceDelegateTestjava.lang.NoClassDefFoundError: java/beans/Encoder
	at org.apache.harmony.beans.tests.java.beans.DefaultPersistenceDelegateTest.testInstantiate_NotRegularGetter(DefaultPersistenceDelegateTest.java:368)
	at java.lang.reflect.VMReflection.invokeMethod(VMReflection.java)
Test: test_initializeClass: org.apache.harmony.beans.tests.java.beans.DefaultPersistenceDelegateTestjava.lang.NoClassDefFoundError: java/beans/Encoder
	at org.apache.harmony.beans.tests.java.beans.DefaultPersistenceDelegateTest.test_initialize(DefaultPersistenceDelegateTest.java:503)
	at java.lang.reflect.VMReflection.invokeMethod(VMReflection.java)
Test: testInitialize_NormalClass: org.apache.harmony.beans.tests.java.beans.DefaultPersistenceDelegateTestjava.lang.NoClassDefFoundError: java/beans/Encoder
	at org.apache.harmony.beans.tests.java.beans.DefaultPersistenceDelegateTest.testInitialize_Normal(DefaultPersistenceDelegateTest.java:595)
	at java.lang.reflect.VMReflection.invokeMethod(VMReflection.java)
Test: testInitialize_NormalBeanInfoClass: org.apache.harmony.beans.tests.java.beans.DefaultPersistenceDelegateTestjava.lang.NoClassDefFoundError: org/apache/harmony/beans/tests/java/beans/DefaultPersistenceDelegateTest$CollectingEncoder
	at org.apache.harmony.beans.tests.java.beans.DefaultPersistenceDelegateTest.testInitialize_NormalBeanInfo(DefaultPersistenceDelegateTest.java:624)
	at java.lang.reflect.VMReflection.invokeMethod(VMReflection.java)
Test: testInitialize_TransientPropertyClass: org.apache.harmony.beans.tests.java.beans.DefaultPersistenceDelegateTestjava.lang.NoClassDefFoundError: org/apache/harmony/beans/tests/java/beans/DefaultPersistenceDelegateTest$CollectingEncoder
	at org.apache.harmony.beans.tests.java.beans.DefaultPersistenceDelegateTest.testInitialize_TransientProperty(DefaultPersistenceDelegateTest.java:666)
	at java.lang.reflect.VMReflection.invokeMethod(VMReflection.java)
Test: testInitialize_NoSetterClass: org.apache.harmony.beans.tests.java.beans.DefaultPersistenceDelegateTestjava.lang.NoClassDefFoundError: org/apache/harmony/beans/tests/java/beans/DefaultPersistenceDelegateTest$MockEncoder
	at org.apache.harmony.beans.tests.java.beans.DefaultPersistenceDelegateTest.testInitialize_NoSetter(DefaultPersistenceDelegateTest.java:688)
	at java.lang.reflect.VMReflection.invokeMethod(VMReflection.java)
Test: testInitialize_NoGetterClass: org.apache.harmony.beans.tests.java.beans.DefaultPersistenceDelegateTestjava.lang.NoClassDefFoundError: org/apache/harmony/beans/tests/java/beans/DefaultPersistenceDelegateTest$MockEncoder
	at org.apache.harmony.beans.tests.java.beans.DefaultPersistenceDelegateTest.testInitialize_NoGetter(DefaultPersistenceDelegateTest.java:715)
	at java.lang.reflect.VMReflection.invokeMethod(VMReflection.java)
Test: testInitialize_NullClassClass: org.apache.harmony.beans.tests.java.beans.DefaultPersistenceDelegateTestjava.lang.NoClassDefFoundError: java/beans/Encoder
	at org.apache.harmony.beans.tests.java.beans.DefaultPersistenceDelegateTest.testInitialize_NullClass(DefaultPersistenceDelegateTest.java:739)
	at java.lang.reflect.VMReflection.invokeMethod(VMReflection.java)
Test: testInitialize_NullInstancesClass: org.apache.harmony.beans.tests.java.beans.DefaultPersistenceDelegateTestjava.lang.NoClassDefFoundError: java/beans/Encoder
	at org.apache.harmony.beans.tests.java.beans.DefaultPersistenceDelegateTest.testInitialize_NullInstances(DefaultPersistenceDelegateTest.java:763)
	at java.lang.reflect.VMReflection.invokeMethod(VMReflection.java)
Test: testArrayPD_NormalClass: org.apache.harmony.beans.tests.java.beans.DefaultPersistenceDelegateTestjava.lang.NoClassDefFoundError: org/apache/harmony/beans/tests/java/beans/DefaultPersistenceDelegateTest$MockEncoder
	at org.apache.harmony.beans.tests.java.beans.DefaultPersistenceDelegateTest.testArrayPD_Normal(DefaultPersistenceDelegateTest.java:803)
	at java.lang.reflect.VMReflection.invokeMethod(VMReflection.java)
Test: testGetExceptionListenerClass: org.apache.harmony.beans.tests.java.beans.EncoderTestjava.lang.NoClassDefFoundError: java/beans/Encoder
	at org.apache.harmony.beans.tests.java.beans.EncoderTest.testGetExceptionListener(EncoderTest.java:228)
	at java.lang.reflect.VMReflection.invokeMethod(VMReflection.java)
Test: testSetExceptionListener_NullClass: org.apache.harmony.beans.tests.java.beans.EncoderTestjava.lang.NoClassDefFoundError: org/apache/harmony/beans/tests/java/beans/EncoderTest$MockEncoder
	at org.apache.harmony.beans.tests.java.beans.EncoderTest.testSetExceptionListener_Null(EncoderTest.java:240)
	at java.lang.reflect.VMReflection.invokeMethod(VMReflection.java)
Test: testSetExceptionListenerClass: org.apache.harmony.beans.tests.java.beans.EncoderTestjava.lang.NoClassDefFoundError: org/apache/harmony/beans/tests/java/beans/EncoderTest$MockEncoder
	at org.apache.harmony.beans.tests.java.beans.EncoderTest.testSetExceptionListener(EncoderTest.java:252)
	at java.lang.reflect.VMReflection.invokeMethod(VMReflection.java)
Test: testWriteExpression_NullClass: org.apache.harmony.beans.tests.java.beans.EncoderTestjava.lang.NoClassDefFoundError: java/beans/Encoder
	at org.apache.harmony.beans.tests.java.beans.EncoderTest.testWriteExpression_Null(EncoderTest.java:268)
	at java.lang.reflect.VMReflection.invokeMethod(VMReflection.java)
Test: testWriteStatement_NullClass: org.apache.harmony.beans.tests.java.beans.EncoderTestjava.lang.NoClassDefFoundError: java/beans/Encoder
	at org.apache.harmony.beans.tests.java.beans.EncoderTest.testWriteStatement_Null(EncoderTest.java:282)
	at java.lang.reflect.VMReflection.invokeMethod(VMReflection.java)
Test: testWriteObject_NullClass: org.apache.harmony.beans.tests.java.beans.EncoderTestjava.lang.NoClassDefFoundError: java/beans/Encoder
	at org.apache.harmony.beans.tests.java.beans.EncoderTest.testWriteObject_Null(EncoderTest.java:293)
	at java.lang.reflect.VMReflection.invokeMethod(VMReflection.java)
Test: testWriteObjectClass: org.apache.harmony.beans.tests.java.beans.EncoderTestjava.lang.NoClassDefFoundError: org/apache/harmony/beans/tests/java/beans/EncoderTest$VerboseEncoder
	at org.apache.harmony.beans.tests.java.beans.EncoderTest.testWriteObject(EncoderTest.java:304)
	at java.lang.reflect.VMReflection.invokeMethod(VMReflection.java)
Test: testGetPersistenceDelegate_NullClass: org.apache.harmony.beans.tests.java.beans.EncoderTestjava.lang.NoClassDefFoundError: java/beans/Encoder
	at org.apache.harmony.beans.tests.java.beans.EncoderTest.testGetPersistenceDelegate_Null(EncoderTest.java:363)
	at java.lang.reflect.VMReflection.invokeMethod(VMReflection.java)
Test: testGetPersistenceDelegate_ArrayClassClass: org.apache.harmony.beans.tests.java.beans.EncoderTestjava.lang.NoClassDefFoundError: java/beans/Encoder
	at org.apache.harmony.beans.tests.java.beans.EncoderTest.testGetPersistenceDelegate_ArrayClass(EncoderTest.java:369)
	at java.lang.reflect.VMReflection.invokeMethod(VMReflection.java)
Test: testGetPersistenceDelegate_ProxyClassClass: org.apache.harmony.beans.tests.java.beans.EncoderTestjava.lang.NoClassDefFoundError: java/beans/Encoder
	at org.apache.harmony.beans.tests.java.beans.EncoderTest.testGetPersistenceDelegate_ProxyClass(EncoderTest.java:375)
	at java.lang.reflect.VMReflection.invokeMethod(VMReflection.java)
Test: testGetPersistenceDelegate_BeanInfoClass: org.apache.harmony.beans.tests.java.beans.EncoderTestjava.lang.NoClassDefFoundError: java/beans/Encoder
	at org.apache.harmony.beans.tests.java.beans.EncoderTest.testGetPersistenceDelegate_BeanInfo(EncoderTest.java:381)
	at java.lang.reflect.VMReflection.invokeMethod(VMReflection.java)
Test: testGetPersistenceDelegate_DefaultClass: org.apache.harmony.beans.tests.java.beans.EncoderTestjava.lang.NoClassDefFoundError: java/beans/Encoder
	at org.apache.harmony.beans.tests.java.beans.EncoderTest.testGetPersistenceDelegate_Default(EncoderTest.java:388)
	at java.lang.reflect.VMReflection.invokeMethod(VMReflection.java)
Test: testSetPersistenceDelegate_NullClass: org.apache.harmony.beans.tests.java.beans.EncoderTestjava.lang.NoClassDefFoundError: java/beans/Encoder
	at org.apache.harmony.beans.tests.java.beans.EncoderTest.testSetPersistenceDelegate_Null(EncoderTest.java:407)
	at java.lang.reflect.VMReflection.invokeMethod(VMReflection.java)
Test: testSetPersistenceDelegateClass: org.apache.harmony.beans.tests.java.beans.EncoderTestjava.lang.NoClassDefFoundError: java/beans/Encoder
	at org.apache.harmony.beans.tests.java.beans.EncoderTest.testSetPersistenceDelegate(EncoderTest.java:426)
	at java.lang.reflect.VMReflection.invokeMethod(VMReflection.java)
Test: testGet_NullParamClass: org.apache.harmony.beans.tests.java.beans.EncoderTestjava.lang.NoClassDefFoundError: java/beans/Encoder
	at org.apache.harmony.beans.tests.java.beans.EncoderTest.testGet_NullParam(EncoderTest.java:438)
	at java.lang.reflect.VMReflection.invokeMethod(VMReflection.java)
Test: testGet_StringClass: org.apache.harmony.beans.tests.java.beans.EncoderTestjava.lang.NoClassDefFoundError: java/beans/Encoder
	at org.apache.harmony.beans.tests.java.beans.EncoderTest.testGet_String(EncoderTest.java:444)
	at java.lang.reflect.VMReflection.invokeMethod(VMReflection.java)
Test: testGet_IntegerClass: org.apache.harmony.beans.tests.java.beans.EncoderTestjava.lang.NoClassDefFoundError: org/apache/harmony/beans/tests/java/beans/EncoderTest$MockEncoder
	at org.apache.harmony.beans.tests.java.beans.EncoderTest.testGet_Integer(EncoderTest.java:451)
	at java.lang.reflect.VMReflection.invokeMethod(VMReflection.java)
Test: testRemove_NullClass: org.apache.harmony.beans.tests.java.beans.EncoderTestjava.lang.NoClassDefFoundError: java/beans/Encoder
	at org.apache.harmony.beans.tests.java.beans.EncoderTest.testRemove_Null(EncoderTest.java:466)
	at java.lang.reflect.VMReflection.invokeMethod(VMReflection.java)
Test: testRemove_StringClass: org.apache.harmony.beans.tests.java.beans.EncoderTestjava.lang.NoClassDefFoundError: org/apache/harmony/beans/tests/java/beans/EncoderTest$MockEncoder
	at org.apache.harmony.beans.tests.java.beans.EncoderTest.testRemove_String(EncoderTest.java:472)
	at java.lang.reflect.VMReflection.invokeMethod(VMReflection.java)
Test: testRemove_IntegerClass: org.apache.harmony.beans.tests.java.beans.EncoderTestjava.lang.NoClassDefFoundError: org/apache/harmony/beans/tests/java/beans/EncoderTest$MockEncoder
	at org.apache.harmony.beans.tests.java.beans.EncoderTest.testRemove_Integer(EncoderTest.java:484)
	at java.lang.reflect.VMReflection.invokeMethod(VMReflection.java)
Test: testWriteObject_NormalMutatesToTrueClass: org.apache.harmony.beans.tests.java.beans.PersistenceDelegateTestjava.lang.NoClassDefFoundError: java/beans/Encoder
	at org.apache.harmony.beans.tests.java.beans.PersistenceDelegateTest.testWriteObject_NormalMutatesToTrue(PersistenceDelegateTest.java:56)
	at java.lang.reflect.VMReflection.invokeMethod(VMReflection.java)
Test: testWriteObject_NormalMutatesToFalseClass: org.apache.harmony.beans.tests.java.beans.PersistenceDelegateTestjava.lang.NoClassDefFoundError: org/apache/harmony/beans/tests/java/beans/PersistenceDelegateTest$MockEncoder2
	at org.apache.harmony.beans.tests.java.beans.PersistenceDelegateTest.testWriteObject_NormalMutatesToFalse(PersistenceDelegateTest.java:71)
	at java.lang.reflect.VMReflection.invokeMethod(VMReflection.java)
Test: testWriteObject_NullObjectClass: org.apache.harmony.beans.tests.java.beans.PersistenceDelegateTestjava.lang.NoClassDefFoundError: java/beans/Encoder
	at org.apache.harmony.beans.tests.java.beans.PersistenceDelegateTest.testWriteObject_NullObject(PersistenceDelegateTest.java:86)
	at java.lang.reflect.VMReflection.invokeMethod(VMReflection.java)
Test: testInitialize_NormalClass: org.apache.harmony.beans.tests.java.beans.PersistenceDelegateTestjava.lang.NoClassDefFoundError: java/beans/Encoder
	at org.apache.harmony.beans.tests.java.beans.PersistenceDelegateTest.testInitialize_Normal(PersistenceDelegateTest.java:116)
	at java.lang.reflect.VMReflection.invokeMethod(VMReflection.java)
Test: testInitialize_NullClassClass: org.apache.harmony.beans.tests.java.beans.PersistenceDelegateTestjava.lang.NoClassDefFoundError: java/beans/Encoder
	at org.apache.harmony.beans.tests.java.beans.PersistenceDelegateTest.testInitialize_NullClass(PersistenceDelegateTest.java:137)
	at java.lang.reflect.VMReflection.invokeMethod(VMReflection.java)
Test: testInitialize_NullInstancesClass: org.apache.harmony.beans.tests.java.beans.PersistenceDelegateTestjava.lang.NoClassDefFoundError: java/beans/Encoder
	at org.apache.harmony.beans.tests.java.beans.PersistenceDelegateTest.testInitialize_NullInstances(PersistenceDelegateTest.java:156)
	at java.lang.reflect.VMReflection.invokeMethod(VMReflection.java)
Test: testInitialize_circularRedundancyClass: org.apache.harmony.beans.tests.java.beans.PersistenceDelegateTestjava.lang.NoClassDefFoundError: java/beans/Encoder
	at org.apache.harmony.beans.tests.java.beans.PersistenceDelegateTest.testInitialize_circularRedundancy(PersistenceDelegateTest.java:182)
	at java.lang.reflect.VMReflection.invokeMethod(VMReflection.java)
Test: test_writeObject_Null_LXMLEncoderClass: org.apache.harmony.beans.tests.java.beans.PersistenceDelegateTestjava.lang.NoClassDefFoundError: java/beans/Encoder
	at org.apache.harmony.beans.tests.java.beans.PersistenceDelegateTest.test_writeObject_Null_LXMLEncoder(PersistenceDelegateTest.java:217)
	at java.lang.reflect.VMReflection.invokeMethod(VMReflection.java)
Test: test_writeObject_java_lang_reflect_FieldClass: org.apache.harmony.beans.tests.java.beans.PersistenceDelegateTestjava.lang.NoClassDefFoundError: java/beans/XMLEncoder
	at org.apache.harmony.beans.tests.java.beans.PersistenceDelegateTest.test_writeObject_java_lang_reflect_Field(PersistenceDelegateTest.java:243)
	at java.lang.reflect.VMReflection.invokeMethod(VMReflection.java)
Test: test_writeObject_java_lang_reflect_MethodClass: org.apache.harmony.beans.tests.java.beans.PersistenceDelegateTestjava.lang.NoClassDefFoundError: java/beans/XMLEncoder
	at org.apache.harmony.beans.tests.java.beans.PersistenceDelegateTest.test_writeObject_java_lang_reflect_Method(PersistenceDelegateTest.java:262)
	at java.lang.reflect.VMReflection.invokeMethod(VMReflection.java)
Test: test_writeObject_java_util_CollectionClass: org.apache.harmony.beans.tests.java.beans.PersistenceDelegateTestjava.lang.NoClassDefFoundError: java/beans/XMLEncoder
	at org.apache.harmony.beans.tests.java.beans.PersistenceDelegateTest.test_writeObject_java_util_Collection(PersistenceDelegateTest.java:280)
	at java.lang.reflect.VMReflection.invokeMethod(VMReflection.java)
Test: test_writeObject_java_awt_ChoiceClass: org.apache.harmony.beans.tests.java.beans.PersistenceDelegateTestjava.lang.NoClassDefFoundError: java/beans/XMLEncoder
	at org.apache.harmony.beans.tests.java.beans.PersistenceDelegateTest.test_writeObject_java_awt_Choice(PersistenceDelegateTest.java:301)
	at java.lang.reflect.VMReflection.invokeMethod(VMReflection.java)
Test: test_writeObject_java_awt_SystemColorClass: org.apache.harmony.beans.tests.java.beans.PersistenceDelegateTestjava.lang.NoClassDefFoundError: java/beans/XMLEncoder
	at org.apache.harmony.beans.tests.java.beans.PersistenceDelegateTest.test_writeObject_java_awt_SystemColor(PersistenceDelegateTest.java:433)
	at java.lang.reflect.VMReflection.invokeMethod(VMReflection.java)
Test: test_writeObject_java_awt_font_TextAttributeClass: org.apache.harmony.beans.tests.java.beans.PersistenceDelegateTestjava.lang.NoClassDefFoundError: java/beans/XMLEncoder
	at org.apache.harmony.beans.tests.java.beans.PersistenceDelegateTest.test_writeObject_java_awt_font_TextAttribute(PersistenceDelegateTest.java:447)
	at java.lang.reflect.VMReflection.invokeMethod(VMReflection.java)
Test: test_writeObject_java_awt_MenuShortcutClass: org.apache.harmony.beans.tests.java.beans.PersistenceDelegateTestjava.lang.NoClassDefFoundError: java/beans/XMLEncoder
	at org.apache.harmony.beans.tests.java.beans.PersistenceDelegateTest.test_writeObject_java_awt_MenuShortcut(PersistenceDelegateTest.java:461)
	at java.lang.reflect.VMReflection.invokeMethod(VMReflection.java)
Test: test_writeObject_java_awt_ComponentClass: org.apache.harmony.beans.tests.java.beans.PersistenceDelegateTestjava.lang.NoClassDefFoundError: java/beans/XMLEncoder
	at org.apache.harmony.beans.tests.java.beans.PersistenceDelegateTest.test_writeObject_java_awt_Component(PersistenceDelegateTest.java:484)
	at java.lang.reflect.VMReflection.invokeMethod(VMReflection.java)
Test: test_writeObject_java_awt_ContainerClass: org.apache.harmony.beans.tests.java.beans.PersistenceDelegateTestjava.lang.NoClassDefFoundError: java/beans/XMLEncoder
	at org.apache.harmony.beans.tests.java.beans.PersistenceDelegateTest.test_writeObject_java_awt_Container(PersistenceDelegateTest.java:520)
	at java.lang.reflect.VMReflection.invokeMethod(VMReflection.java)
Test: test_writeObject_java_awt_MenuClass: org.apache.harmony.beans.tests.java.beans.PersistenceDelegateTestjava.lang.NoClassDefFoundError: java/beans/XMLEncoder
	at org.apache.harmony.beans.tests.java.beans.PersistenceDelegateTest.test_writeObject_java_awt_Menu(PersistenceDelegateTest.java:593)
	at java.lang.reflect.VMReflection.invokeMethod(VMReflection.java)
Test: test_writeObject_java_awt_MenuBarClass: org.apache.harmony.beans.tests.java.beans.PersistenceDelegateTestjava.lang.NoClassDefFoundError: java/beans/XMLEncoder
	at org.apache.harmony.beans.tests.java.beans.PersistenceDelegateTest.test_writeObject_java_awt_MenuBar(PersistenceDelegateTest.java:628)
	at java.lang.reflect.VMReflection.invokeMethod(VMReflection.java)
Test: test_writeObject_java_awt_ListClass: org.apache.harmony.beans.tests.java.beans.PersistenceDelegateTestjava.lang.NoClassDefFoundError: java/beans/XMLEncoder
	at org.apache.harmony.beans.tests.java.beans.PersistenceDelegateTest.test_writeObject_java_awt_List(PersistenceDelegateTest.java:646)
	at java.lang.reflect.VMReflection.invokeMethod(VMReflection.java)
Test: test_writeObject_java_awt_BorderLayoutClass: org.apache.harmony.beans.tests.java.beans.PersistenceDelegateTestjava.lang.NoClassDefFoundError: java/beans/XMLEncoder
	at org.apache.harmony.beans.tests.java.beans.PersistenceDelegateTest.test_writeObject_java_awt_BorderLayout(PersistenceDelegateTest.java:668)
	at java.lang.reflect.VMReflection.invokeMethod(VMReflection.java)
Test: test_writeObject_java_awt_CardLayoutClass: org.apache.harmony.beans.tests.java.beans.PersistenceDelegateTestjava.lang.NoClassDefFoundError: java/beans/XMLEncoder
	at org.apache.harmony.beans.tests.java.beans.PersistenceDelegateTest.test_writeObject_java_awt_CardLayout(PersistenceDelegateTest.java:686)
	at java.lang.reflect.VMReflection.invokeMethod(VMReflection.java)
Test: test_writeObject_java_awt_GridBagLayoutClass: org.apache.harmony.beans.tests.java.beans.PersistenceDelegateTestjava.lang.NoClassDefFoundError: java/beans/XMLEncoder
	at org.apache.harmony.beans.tests.java.beans.PersistenceDelegateTest.test_writeObject_java_awt_GridBagLayout(PersistenceDelegateTest.java:705)
	at java.lang.reflect.VMReflection.invokeMethod(VMReflection.java)
Test: test_writeObject_java_awt_CursorClass: org.apache.harmony.beans.tests.java.beans.PersistenceDelegateTestjava.lang.NoClassDefFoundError: java/beans/XMLEncoder
	at org.apache.harmony.beans.tests.java.beans.PersistenceDelegateTest.test_writeObject_java_awt_Cursor(PersistenceDelegateTest.java:726)
	at java.lang.reflect.VMReflection.invokeMethod(VMReflection.java)
Test: test_writeObject_java_awt_InsetsClass: org.apache.harmony.beans.tests.java.beans.PersistenceDelegateTestjava.lang.NoClassDefFoundError: java/beans/XMLEncoder
	at org.apache.harmony.beans.tests.java.beans.PersistenceDelegateTest.test_writeObject_java_awt_Insets(PersistenceDelegateTest.java:743)
	at java.lang.reflect.VMReflection.invokeMethod(VMReflection.java)
Test: test_writeObject_java_awt_pointClass: org.apache.harmony.beans.tests.java.beans.PersistenceDelegateTestjava.lang.NoClassDefFoundError: java/beans/XMLEncoder
	at org.apache.harmony.beans.tests.java.beans.PersistenceDelegateTest.test_writeObject_java_awt_point(PersistenceDelegateTest.java:759)
	at java.lang.reflect.VMReflection.invokeMethod(VMReflection.java)
Test: test_writeObject_java_awt_ScrollPaneClass: org.apache.harmony.beans.tests.java.beans.PersistenceDelegateTestjava.lang.NoClassDefFoundError: java/beans/XMLEncoder
	at org.apache.harmony.beans.tests.java.beans.PersistenceDelegateTest.test_writeObject_java_awt_ScrollPane(PersistenceDelegateTest.java:775)
	at java.lang.reflect.VMReflection.invokeMethod(VMReflection.java)
Test: test_writeObject_java_util_MapClass: org.apache.harmony.beans.tests.java.beans.PersistenceDelegateTestjava.lang.NoClassDefFoundError: java/beans/XMLEncoder
	at org.apache.harmony.beans.tests.java.beans.PersistenceDelegateTest.test_writeObject_java_util_Map(PersistenceDelegateTest.java:794)
	at java.lang.reflect.VMReflection.invokeMethod(VMReflection.java)
Test: test_writeObject_java_util_ListClass: org.apache.harmony.beans.tests.java.beans.PersistenceDelegateTestjava.lang.NoClassDefFoundError: java/beans/XMLEncoder
	at org.apache.harmony.beans.tests.java.beans.PersistenceDelegateTest.test_writeObject_java_util_List(PersistenceDelegateTest.java:811)
	at java.lang.reflect.VMReflection.invokeMethod(VMReflection.java)
Test: test_writeObject_java_util_AbstractListClass: org.apache.harmony.beans.tests.java.beans.PersistenceDelegateTestjava.lang.NoClassDefFoundError: java/beans/XMLEncoder
	at org.apache.harmony.beans.tests.java.beans.PersistenceDelegateTest.test_writeObject_java_util_AbstractList(PersistenceDelegateTest.java:853)
	at java.lang.reflect.VMReflection.invokeMethod(VMReflection.java)
Test: test_writeObject_java_util_AbstractMapClass: org.apache.harmony.beans.tests.java.beans.PersistenceDelegateTestjava.lang.NoClassDefFoundError: java/beans/XMLEncoder
	at org.apache.harmony.beans.tests.java.beans.PersistenceDelegateTest.test_writeObject_java_util_AbstractMap(PersistenceDelegateTest.java:870)
	at java.lang.reflect.VMReflection.invokeMethod(VMReflection.java)
Test: test_writeObject_javax_swing_JFrameClass: org.apache.harmony.beans.tests.java.beans.PersistenceDelegateTestjava.lang.NoClassDefFoundError: java/beans/XMLEncoder
	at org.apache.harmony.beans.tests.java.beans.PersistenceDelegateTest.test_writeObject_javax_swing_JFrame(PersistenceDelegateTest.java:890)
	at java.lang.reflect.VMReflection.invokeMethod(VMReflection.java)
Test: test_writeObject_javax_swing_DefaultListModelClass: org.apache.harmony.beans.tests.java.beans.PersistenceDelegateTestjava.lang.NoClassDefFoundError: java/beans/XMLEncoder
	at org.apache.harmony.beans.tests.java.beans.PersistenceDelegateTest.test_writeObject_javax_swing_DefaultListModel(PersistenceDelegateTest.java:909)
	at java.lang.reflect.VMReflection.invokeMethod(VMReflection.java)
Test: test_writeObject_javax_swing_DefaultComboBoxModelClass: org.apache.harmony.beans.tests.java.beans.PersistenceDelegateTestjava.lang.NoClassDefFoundError: java/beans/XMLEncoder
	at org.apache.harmony.beans.tests.java.beans.PersistenceDelegateTest.test_writeObject_javax_swing_DefaultComboBoxModel(PersistenceDelegateTest.java:929)
	at java.lang.reflect.VMReflection.invokeMethod(VMReflection.java)
Test: test_writeObject_javax_swing_tree_DefaultMutableTreeNodeClass: org.apache.harmony.beans.tests.java.beans.PersistenceDelegateTestjava.lang.NoClassDefFoundError: java/beans/XMLEncoder
	at org.apache.harmony.beans.tests.java.beans.PersistenceDelegateTest.test_writeObject_javax_swing_tree_DefaultMutableTreeNode(PersistenceDelegateTest.java:947)
	at java.lang.reflect.VMReflection.invokeMethod(VMReflection.java)
Test: test_writeObject_javax_swing_ToolTipManagerClass: org.apache.harmony.beans.tests.java.beans.PersistenceDelegateTestjava.lang.NoClassDefFoundError: java/beans/XMLEncoder
	at org.apache.harmony.beans.tests.java.beans.PersistenceDelegateTest.test_writeObject_javax_swing_ToolTipManager(PersistenceDelegateTest.java:962)
	at java.lang.reflect.VMReflection.invokeMethod(VMReflection.java)
Test: test_writeExpression_writeObjectClass: org.apache.harmony.beans.tests.java.beans.PersistenceDelegateTestjava.lang.NoClassDefFoundError: java/beans/XMLEncoder
	at org.apache.harmony.beans.tests.java.beans.PersistenceDelegateTest.test_writeExpression_writeObject(PersistenceDelegateTest.java:1013)
	at java.lang.reflect.VMReflection.invokeMethod(VMReflection.java)
Test: testColorEditorClass: org.apache.harmony.beans.tests.java.beans.PropertyEditorManagerRegressionTestjava.lang.NullPointerException
	at org.apache.harmony.beans.tests.java.beans.PropertyEditorManagerRegressionTest.testColorEditor(PropertyEditorManagerRegressionTest.java:82)
	at java.lang.reflect.VMReflection.invokeMethod(VMReflection.java)
Test: testFontEditorClass: org.apache.harmony.beans.tests.java.beans.PropertyEditorManagerTestjava.lang.NullPointerException
	at org.apache.harmony.beans.tests.java.beans.PropertyEditorManagerTest.testFontEditor(PropertyEditorManagerTest.java:735)
	at java.lang.reflect.VMReflection.invokeMethod(VMReflection.java)
Test: testColorEditorClass: org.apache.harmony.beans.tests.java.beans.PropertyEditorManagerTestjava.lang.NullPointerException
	at org.apache.harmony.beans.tests.java.beans.PropertyEditorManagerTest.testColorEditor(PropertyEditorManagerTest.java:775)
	at java.lang.reflect.VMReflection.invokeMethod(VMReflection.java)
Test: testLoadImageClass: org.apache.harmony.beans.tests.java.beans.SimpleBeanInfoTestjava.lang.NullPointerException
	at java.awt.Toolkit.init(Toolkit.java:565)
	at java.awt.Toolkit.<init>(Toolkit.java:539)
	at java.awt.ToolkitImpl.<init>(ToolkitImpl.java:39)
	at java.awt.Toolkit.getDefaultToolkit(Toolkit.java:471)
	at java.beans.SimpleBeanInfo.loadImage(SimpleBeanInfo.java:38)
	at org.apache.harmony.beans.tests.java.beans.SimpleBeanInfoTest.testLoadImage(SimpleBeanInfoTest.java:84)
	at java.lang.reflect.VMReflection.invokeMethod(VMReflection.java)
Test: testAvoidGuiClass: org.apache.harmony.beans.tests.java.beans.beancontext.BeanContextSupportTestjava.lang.NullPointerException
	at java.awt.Toolkit.init(Toolkit.java:565)
	at java.awt.Toolkit.<init>(Toolkit.java:539)
	at java.awt.ToolkitImpl.<init>(ToolkitImpl.java:39)
	at java.awt.Toolkit.getDefaultToolkit(Toolkit.java:471)
	at java.awt.Component.<init>(Component.java:109)
	at java.awt.Button.<init>(Button.java:141)
	at java.awt.Button.<init>(Button.java:158)
	at org.apache.harmony.beans.tests.java.beans.beancontext.BeanContextSupportTest.testAvoidGui(BeanContextSupportTest.java:2207)
	at java.lang.reflect.VMReflection.invokeMethod(VMReflection.java)
Test: test_ConstructorLjava_lang_StringZClass: tests.api.java.io.FileOutputStreamTestjava.io.IOException
	at org.apache.harmony.luni.platform.OSFileSystem.close(OSFileSystem.java:208)
	at java.io.FileOutputStream.close(FileOutputStream.java:191)
	at org.apache.harmony.nio.internal.FileChannelImpl.implCloseChannel(FileChannelImpl.java:102)
	at java.nio.channels.spi.AbstractInterruptibleChannel.close(AbstractInterruptibleChannel.java:99)
	at java.io.FileOutputStream.close(FileOutputStream.java:184)
	at tests.api.java.io.FileOutputStreamTest.test_ConstructorLjava_lang_StringZ(FileOutputStreamTest.java:89)
	at java.lang.reflect.VMReflection.invokeMethod(VMReflection.java)
Test: testDefaultValueClass: org.apache.harmony.logging.tests.java.util.logging.FileHandlerTestjunit.framework.ComparisonFailure: expected:<<?xml version="1.0" encoding="8859_1" standalone="no"?>
<!DOCTYPE log SYSTEM "logger.dtd">
<log><record>
    <date>Aug 2, 2007 8:50:15 PM</date>
    <millis>1186062615325</millis>
    <sequence>13</sequence>
    <level>CONFIG</level>
    <thread>0</thread>
    <message>msg</message>
</record>
</log>> but was:<>
	at org.apache.harmony.logging.tests.java.util.logging.FileHandlerTest.assertFileContent(FileHandlerTest.java:223)
	at org.apache.harmony.logging.tests.java.util.logging.FileHandlerTest.assertFileContent(FileHandlerTest.java:188)
	at org.apache.harmony.logging.tests.java.util.logging.FileHandlerTest.testDefaultValue(FileHandlerTest.java:183)
	at java.lang.reflect.VMReflection.invokeMethod(VMReflection.java)

***********************************************************
Modifications since last successful build:	(12)
            
add cc-hdk log20070802202134Lbuild.81 08/02/2007 20:21:34hdk
modified hindessm  /harmony/enhanced/drlvm/trunk/src/test/regression/H4595/Test.java 08/02/2007 20:03:37 Fixing the commit r562098.Correcting the svn:eol-style property which should be set automaticallyif the instructions for new committers have been followed.Adding missing licenses.Note, the commit message was also missing the titles of the referencedJIRA.
modified hindessm  /harmony/enhanced/drlvm/trunk/src/test/regression/H4595/run.test.xml 08/02/2007 20:03:37 Fixing the commit r562098.Correcting the svn:eol-style property which should be set automaticallyif the instructions for new committers have been followed.Adding missing licenses.Note, the commit message was also missing the titles of the referencedJIRA.
add cc-hdk log20070802195343Lbuild.80 08/02/2007 19:53:43hdk
modified mfursov  /harmony/enhanced/drlvm/trunk/vm/jitrino/src/codegenerator/ia32/Ia32InstCodeSelector.cpp 08/02/2007 19:41:27 Fix and regression test for HARMONY-4595Fix for HARMONY-1874
added mfursov  /harmony/enhanced/drlvm/trunk/src/test/regression/H4595/Test.java 08/02/2007 19:41:27 Fix and regression test for HARMONY-4595Fix for HARMONY-1874
modified mfursov  /harmony/enhanced/drlvm/trunk/vm/jitrino/src/jet/cg_regs.cpp 08/02/2007 19:41:27 Fix and regression test for HARMONY-4595Fix for HARMONY-1874
added mfursov  /harmony/enhanced/drlvm/trunk/src/test/regression/H4595 08/02/2007 19:41:27 Fix and regression test for HARMONY-4595Fix for HARMONY-1874
added mfursov  /harmony/enhanced/drlvm/trunk/src/test/regression/H4595/run.test.xml 08/02/2007 19:41:27 Fix and regression test for HARMONY-4595Fix for HARMONY-1874
add cc-hdk log20070802192600Lbuild.79 08/02/2007 19:26:00hdk
modified tellison  /harmony/enhanced/classlib/trunk/modules/beans/src/test/java/org/apache/harmony/beans/tests/java/beans/beancontext/BeanContextServicesSupportTest.java 08/02/2007 19:03:46 Apply patch for HARMONY-4272 ([classlib][beans] BeanContextServicesSupport.releaseService() throws unexpected NPE)
modified tellison  /harmony/enhanced/classlib/trunk/modules/beans/src/main/java/java/beans/beancontext/BeanContextServicesSupport.java 08/02/2007 19:03:46 Apply patch for HARMONY-4272 ([classlib][beans] BeanContextServicesSupport.releaseService() throws unexpected NPE)

begin 644 execution_log.zip
M4$L#! H    ( #RJ C=S6$FY:$,  !+) P 2    97AE8W5T:6]N7VQO9RYH
M=&UL[7UK<]M&LNC]NOD5N*=\:I6J$")>?)TD]\B2[&A7DG5$*<F6RU<%@4,)
M-@AP 5 F4W7_^YT9@!0IXM%-LD72AA-)? "-F9Z>GG[WSX_QP/OUY_N@-_GU
MYV'(?OW95J)XXK%?_MX/_+@6N7^QCM*J_^=__?W7'\*1W_E!492//>:QF'U2
M3L1?UW]0-*-A*GW78Y'2#X.!<LC&PR",#T<1"Z-#Q^'_UYQ@, C\P_N1Z_4.
M0Q:-O)A_Y=E1Y+GWM9A%L8#-H7^VG^Q/REMQG0#94>0MZGC@+5RP\*;F^FY<
M>^Q]Z>1?(QZQ^'7RFCF/P8M+Y[_X!?@O%\ -?ZY DIRKPB<;VJ'+(E55-_O,
MA3>.QVQ?8K46C.+A:'GFRZO8<T/FQ$$X*5\_YY$Y7SC@Z)#C_/!K$'[A .ZF
MJYE>))Y^%S(!J6"@P7"2C)/31# *'185K*%\;BT:#070VF<[++JX)J_.7_)C
M\;68>#\(E1X;,K\7'0J8AY/@2W!WH=?T>KU9UXRZ_$#E7VT*%L=FR#8*,!RX
M-7<P]#8.-!HR9T6@]P[S:I:JSUZL"&=L>YR8/]_I:E.M)^]6A<0$@7% ;0%(
MOE'_<H<K0/H\XASGSE!;?'KR]<HX&H;!4^US[XMFU32CF7ZP(C37&9F?^:A,
MU9R^OC/OS!6A#<826)U/4;Q<%5,LCB?)[UJ# ZNO.)IY.*/8]38 C+.W)\[\
M:O;0K>FJM2K$'N,7CFKBQ)R]B>,^!ZFU:MH2VA:95,39KQ/7OKI^C<.+:N-6
MXZYA%K&UC#N*+@^9[7F3A!F*FTHY)NPB3O/C]%! LEA^0D3I$>$Y T&TCF&J
MC^53\%P?R\Y?/DO\HG_4T'\0/T[@]U_M8?0/^CQD#X>?Q:3<!]7SQZ_S//Z+
M?_9:LQOP<]GIOQHR61@&X6H/R]V32^P OTG<>[E/^$-'8Y7#>PT2YF\%%;_:
M,^4"\/?B[WI/+5J)$E8^=[%K0R\MNHJ-X]#FAP.7(8:%LG$ZF^GUXGP'P"T3
MS8N^#P9#KLY-A?>"*^?$^Z(A/?"#6RH.3X-,'6=)^:M]#IFXV/7[03[=/$Y4
M<;'Z-%!]>\"47Y1>6*!Y2L"#H#?RBA67=/;B70'-RJL$T1X='Y]VNV=OS\[/
M;OZ5J(XL*M&B( I4].1GS'_AC=P>)<B7UP"F*[ 3X><K;UNZZ^/@"U=1^5V<
M=F/6$_IJ9VU5-5VZ0]OAB(O<>SX<+AC>N_[ADDEB]M*9'WE+2;">VC_B8%M#
MZKJ^& 6'IKB1TK>]B/VDN ]^$(IA#A@_VB87]M@=C 9=]R^F1%P$YM_D+^*0
MZ^XVWS)L['BC'ENV('!1P+'C3\IEH+"QFU@Y$BS8?D_Q \7GX^4+%7/N\9/2
M"\3W?A _%CXUV:DOJ8]L_?G)X 5<K>#?/5LME@E6O E3JY28AA@@S;,7E_U.
M;H4EE63A33CR\S8:"<J*K3O)2Z$1?U*N1[Z?8.O)'JL+$U./TG<>Z\9\;#?9
MI)W $5]&8IX=1?M)>6>[WH@SNXY2_TDY%1)4\O+&Y>R:>?8P8CW^@=IJ-#F1
M.Q"H)ARJ5C>A4%MPJ/5F&PK50$ U=2A4!%[KND4!%3[6)@:O) A8AKK(PX*1
M\UCKI^!JTHQ==K54!4JOK<W)&YL4-RXO/]P<W9Q]N/P>9(WGR6Y#T/#Y$6C'
MKK@/+F58=%(&8CR;$#'FX=5F_W(OT53ECZ/KR[/+]XKK4TPZ"IWDW!4// S"
MAT-[:',PAX]VR.%.YJ^5Y))<Z-E<9YW[ZLP7="@\*D>S#T_'#AN*%X+-J.*V
MW&DJ!W:L\)5FBF7\F'O5W_A$_OKK)\Z+V(#Y\2773W[\K_RK_Z_XE_OUS63(
M5\CNLWC246X>.8<;<XF/'\F!KP1])19?'TN?E<]8+U)&OD0NWP]<[GOB^!<7
M<D(4!J$@'(B7\O*?_P^'% MU6WE&Q:]KT0 710,N* R4 TWY:H="IO@QGR%L
M1VXMDL)>B$.<R-2$R-24R-1G2E*G$M^3K0HBF__JFI.7+UY=!9[K3* R$T)B
M:#9;% =F$RPSZ1B)P:" JI.,U5B&NN<BP]75^>G-]R N)!/=AJ@P% <*1DS0
MYL6$C4H)P*%\(T:('&:^YSOV^OBWL]]/]W'+EL2(T._$T'ETGU@V_:_)7M)5
MR>$O2UM<)S0X%LUR>[M\DV)6,D-5Q ^HM_P7@=FI"3<[:0@+D6:!K2X6%*K!
M)3.P#(4RD"Q+D;F/.!TS![U38SM\X.>1>"G,IY_#A&H%=*7F#,FV1&=SQM-H
M;5BI_7C.=IRZSH2]>!EZLA=JMA_7-+6A6L+[^1R[!+Q>O/-LJ0N&N-N0#YD-
M3!&GAW(8#X:'CY,XNFO6Z]9R)%E%7A5Y;8R\E@/F*O*JR*LBKXJ\]I.\%B2Z
M1Z:\/^;JD5".8V%9?7)[3'EP[NQ>[^XKL[_<A4$0WW&9_8[Y<3@Y*#"U5J1:
MD>HZI-K:(B?L!X%Z;X<JXX#Y*&30U[L@V"*Q=Q:0TY!"[KX,<WEQ&T8Q'UHA
M^D(W5+T!=U TH'";JF5IE<9:<3HR3M?*3BN94>UI]Z:BO8KV:&@O.^\NE_;6
MM?]9J@GWH6H(LZ)F5&;%:J/0;91VNSA7KR*OBKQ6)R^M7I(*6I%715X5>57D
M59%715[?'WE53I&*O C)JUEQKXJ\R,A+6SX<<^P=X-@LK:U:]0;4C (V=8NP
M>;!Q!@/56#:@YT#%)#!:X+1(1 IGW0!#1:0::O!L!,18=7!6))BR4%F1F!P'
M,%:U-@*M;;##1Z\C\*K!4V,Q8'4*TJJWP% QF&V0;*YO+SGV]N:W?0R:QP:B
MBVEN(\ME%#]B<ES:)ET /&@H^Q']GJ01VD-7IA*.5;XG1Z$HO" FJ8ZM>EW]
MD_^ZXH-VW*$-CH1''#.M)OB<P1Q>#;#\@H!J@$4M"\$,+:-$*%@S&"MGB T+
M? P8JF'"I0$#(0ZT: IEP#V+)-4W,%#;%'4R$*<V*C\53/^H7%J:JB84#*#>
M!&, )12WP'(F JJAD20IP]WV-,N%&BMXN5#"*UB)PV" @@3J%DWV.P50\ &#
M&BG-_/=HK!K-20 F 51]*XKM:F;4C-I3LZ[0/&:E:)[52!+-YMNQQ&:E^ KU
M)E%^LA2?+RR\9V$0J?],7RPH0&].6-\>>?$UL[W!W>7(\WZWO1&K"*PB, H"
MZTZBF VNPF#(PGA245E%9114=BPKMK]S/08Y?L$^GY;::(-]/AB52=/ ,AA-
MA4V4% [6\;<N,)O@U4)!)0"JM^ ^GZTC@*9>F$9BC]%(J)7&& $?*\;*\^WD
M>55'[4JQ&R?B:O4Q&+!?9 @'_[GEG_S&/W@7A,E9.0KM:=E.?H-8NN?C=YA(
M:RZ+DOO%MTU=:^K3*U8XS;W@P?75I6>_N0R>S^Z;X"WCYWFO(MWOEW1AE&@2
M4&(WO>IJ]LQ,>ER703=4T]BG(VJ/H,(-FR;B/#4SK- 54_JNF%+A>7HN^ EG
M)Z+Z)NHXM=9F8B\?77Z:YNP' ^R=-50#[I9"L002_P&- X4$ 1:)1DR# )(#
MC @JC==_RPY?E$U@RX[T[6OO1/7.M[RW4"%%)$YO^%A1 0HD$34T0C<\I@A3
M!Q<>9HZQ"[5HK$WPT#I,8)E%P0HU>"G@[;-MFH *BX(1:/"6&AA&0./.@->N
M-NJ82$@X$:"R@VB$;?!ZH;*NX,X'#&81P;L8#@.OLK8F9A?>[%UJR-O3H\ON
M/N:&;+NAPCVS_2@_U4*T]1A.!*:'$X%GT]I\LD?!$#)I(B_OXO70Q$DC9J%O
M>]L<Q%V:T@O8'>F5T_TA.W$G.T;B,H.[V"_[V1!VNP!.:SJH3?6^6T;3=%61
MN&F\$F8*J(X<-3B,"#WN55!"BHF%-QM)#9OB=9H:!B2XQ7PR:;:5:)"_G<2P
MJK[EKU,C:S?903?9"$J@_<F1VA$M WWFQ&D#P?_PH[@7>F.OI;H<NAB=I_)%
MZAB&6O\/)61]OGH]Y7["T14^L?Q*A@GPRT#D4<6!$WA*-&2.VW<9T&MZZSOV
MZ.$Q5MBT<Z-H.GGTQTWMTH[=)W;ZQ/SXYI$SV5Y^ IY$E.S<=Y;B68I$'>58
M=O)3@B'S.8..AIX]4?[^]UPX?[/C3-OWUUC]&G]1.<6/QNJ?78F2XQE"U9]=
M?O>O!\M?2)G&K.<GD($>>"Y^_^'ZO>#K.]N).3U/GYCQ3?+(QD8>>?//Q0?Q
M]Q)\6R\&_[P<G) \C@OU]XOKY)7 BL^^RJZ59YP(.56S@X5OQ<U8\!SE41R.
M! 8$]!G@^<_ER/569JO/+-ARB(O0Y"<23J-M N (G-X$@??%C55'B@D<A0?3
M3Q)4MDJ6:@E0TM+[C?82#F1B<W#>:*I8VD4HEF6M3#A+VU7E[/%@^=.$0)OY
MS\GG"!+,"=_&=NP\PGF"B"F_"B0'GK6'Q>'\@<5S$_F?$1NQ1<1I&AC_&9.0
MF,KZ/,%5P9H ;(_:4I43U6B7&%U.NS?SA\]1&-J3*WZ:NU',^$XX81Y[L),&
M\LJ[H[/STY-UK'A&EIFAQ$+^8H1R:ZX_0C . 1;L%R/LQD(>67^(&J8\2@ML
MK,&8EC10-GC.E%X*1AAY*(/[),A]]DNO+RZM9B)OE>2<5D)8)82M]LA*"*N$
ML$H(VQ<A+,\]L21!Z&I9I18A0,!//''*11!9HCJ)JI.H.HFJDZ@ZB;[IDRA/
M36QFU67<Z$ET/(KB8.#^Q7JK:KLT%;K,/!57SU#OS;+8 1Q.TN3@]=5_/<_W
MKV?&;0&L*/!)G'*5NL="K-4'$;S51I290A@L='@M3PL1"Z,CRE=AK#:($L28
M:GM-BG [W2A>L6XP8!_B1Q8*^53\G/G]0##0Z8Y("S&<^3TV/OA1<6S/8SU5
M54$\#KQ8NJK!(R-1:P6/!:*H"&7FL0,CB\^7)<[CV,'ZS P5, RF7E00+CBF
M$5[>L:XV3' H%X8[ZB7)$Y5F5VEVJSVRTNPJS:[2[/9$L\N+6,]R4I85KD6>
M^*FP=MIS^4:[L'W[@877[(&/))K6;JBLC]4959U1U1E5G5'?W1E5\?:*MU>\
MO>+M%6__]GC[O/Z1IX#H&49G2*3IF@H(-H 2E?@.MCJB\E(K,UYUC%;':'6,
M(N!4QR@"Y_MPC.;YDS)S#4K\2;A3M.L.AAZ;.F.1QV?NZ9]9AH.F$ F\8 ;B
MK">I<Z3!W98:QF\)+^Z!:7D*K^V!<(:6IO*LZ"*'!TD@(D4,1.?;S=6EJB2^
M2N);[9&5Q%=)?*\O\2U4.$+D3#8R.@$LP,7),>5)?F5R326Z8D77#(0NO-EZ
M.:G"ZAWB%:<8Q^;SX2<B&[N1J 62UBZQ?1%PK/C\.?QD%:3TD](+Q/?\A'HL
MK!E"5.OJ^/I?5S<?]K'8%;(1>CI1<?VLA)%<%/B]]M#=1BMU)YP,XV!6IN:0
M#R-C"]DORN883;*R.9@!T541FEL4U__,)0"YHW9A==3I> #+I-5?<YG*1T:^
M7L(RL%,+)@:$6K'Y!:-<+]C 7F?!=F2==FM#%8[H=8N&*51BQZP 68VSC_(B
M9.4G92KK%13<2-"\T DB_4B8%=0NXVI4_$\VZ?)WT#H;",M7$Y[* S;0Z&I=
M!YM],#8J YX<@C"H6:V2I 6B]#GPS%'X1'6U!V=KH*HZT_2?!].I!AZLKAJ(
ME#.,@1+1_!'34Q)4* B?M ,O&8ZA@Q9\MV**)=$DB)%D0\&AHL8*WE^H>OS;
M'2IB%YCPQ$L$5,,B*48/WP2H(O\D?L &R7$ =U>A>!;\.-CZUH(7XT>-=;N9
MLJ@>!R2-2>#2"R8O%E[AC^0@0(6]@1<+E1@,WED85WA.^8=\C4HMLYJ\4*V6
M5:>KKM2,*8H3PG$$ALJ%_":XO0:&2EHDX0+PC&R4$$+"TPR:L6Y#:41LN39"
M6R:I&X 1$C*6Z)7<8,\F'V'@ MM\BNR$ZQA]9O:>-+KA[HP_",K"P,*>5GYZ
MTM OIH%/NPV/2\/4DJ"01S4-S+M1+8PHA!%XFSA4!!W%8B'R!3!HA7<SPV @
MIYM9$0-!RCCYG&3:#D,&3!R[PT<6=H<NE&]@3%NMC#*;K\VJ7[])UMG ?F!G
M>QDYL.TV6:Y G3OG2)H-) /OBRVS],U[M8"C62_Z8DHM>;OZU9RL+V?[W?CO
M\F/+%O7%%$%JNF)@A@D7M(R,&+U7XI=4O/"R>W-]>W%Z>5.QPQ6VI(S/'7"9
M&=XZ4#,)&&').-;D@,\T F6"=+W@("C?#B-<E7EE"()ST;PR<O9YTNJMSS'A
M]EW[WF,RHGL62DL14-#>?"]V7=7+*J^NYO'(\'SN-V_^Q^7)6<65\2SBL]]S
M$?RXO7DFE3^"]3BQI BP(&K0M9\L1O'>\U\QO06#GF\/^*5J-'35:T[5WA/C
M?T8>N%D2V'QJZ*I9WW*\%<IY#>\BCG&RPL>*.'>T!D46:QT>:X *YZ((X]$U
M. 8083Q6F1F6R/Z,H2AX:-BV0V(T.$&1! ,T$ Y)N/V=)H +Y>.C6"Q$@"3&
MSTL2%86(#=0P@VV3(!8>:(,I20^G5P3_0Q2Z1X6;41"!!M]<-$%LJ!H9"(JE
M8(4Z@@@0$7>H;4 CL\ Y;!TC")1%W\]Q0TRH=$EM_WD1"T$'B!8E&':H@T5B
M3,P57'Q'17+!50U,-!]-F*@.AHJ)5H&W$\'P KBXB6&'\.,;TY #,5@,7L&D
MU<;$B\/7"R,6D!PS<*@8&J )JX.K\0BHB+9"F,V%",%&[5G$]B(1"PP$Q<)Y
M(>8X(.*P<.D8[HO55'C@#R9038,+7*CX=A*5MJ2_&+FM!"7(TB3GF12'EV;!
M4_XPQPR\HQ9&+D(HM226752J#P5IP=D69K7JK6+26M%_<"E?SI5G!ND?B""5
M1J.8>#<Q[K?"600?/F(QVR5TM^+H3]R0R1AL).+A9[*6*9ONMP?Z_.CR?>WB
MZ/+H_2DL1&C[)93RKRLN Y$_Z:.K7)\KI1=;!'[4!I):9]$NL/I)0H(A\OMB
M![5Q#_#BBA9G>>0OJ<C#D!.PDXJBN[&ZT#(Q=,%5Z%'MGH<_^YKLO?_R3)D+
MNQK%KJ=ZP<.#.$#.D[\7?XI"BAMW^?,S#R[!T8C&&[-!3??*A<!44D]6^>K&
MC\K924>Y/3OYJ-7MAMW6>AU-,_5&K\%,QCJU5KU>_]29%?7M:)M&,-Q+AU+J
MP(HM1EV&IT+3R,BH=MQP&Q?"9H* BJK@39+L2&) STD_6M,SL8R 5Q)/R_(R
M <*]C(-]/IK4I#+KM$9_+L2/YX'=XPQ)?',HF/KA<>"EM9JC-]V)[SR&@<^/
MIEZ7Q4H_# ;8PS2VPP<6RY>?Q4_(#L61>A\$\:''!\'/D_ 38GR_V=%C+*)[
MWQC;'H_ ^6%:I/KP* SMR:9&) 2+7M+D_O#P"PM]YJV.)_'J+&:AS?6[;:/L
MY1*^T;8\HO'AG#QW%,>A>S^*V;D;;9[:!V/S\YVAUE5=OBP>XRH\7,/8DC$G
M [P4%^9L+#YO(*)2T]3T?BHJ->N-5FM%40D1&M N<X-L/Y?<T&G$ _!1CG"N
MPB5[&K<]AE[A0C*F'8N>$<Z\YU:Q#^_?GUV^!Z9F<"[XFND9X'20W<_C2-5O
M>"H'029'X1B@-LEB,MJ&]>G%K&K3D@,0\Q-5?C-^4)LJ(+T\29VN%',I56_'
MMI;LINVF<6>I?:D)+L\T]^?%^;L@'-AQ7.+3@8A;;<-LL:FX93AF8T5Q"YZ4
M8JB&11*4#2^3A3(B;:?.T(*TH14J"'ICM9ZZ973VCF^#W_@N\!BZI2Y&#P'3
M L:85.(/GJ<%E)$.'C.&R2C)*$F3AUF$XMA Q(E@0I.;39)05_B2810G'9Y1
M@#)6;G[!=*N!*5YIUA&<42/)V %%ON]\@RBT*G1[6:6HKR($<JJ ZS6-.H$8
MFCN"-;4:01'_N.5$G] \0-@V-+J&3\6(WHZH#16/7Q:; Z VRY\MZN\^"S1_
M<"E,V*<O["'4DPT_8D14;IF%EDA&A,L"FJHU22ICP\\K5"%WDL!ADMKH\'!_
MFB*U&/V()FD5GK>+$+ 0A3-1Y$JB(L+KF&-$3)*JSQI\K*C2H2358^%9A311
M(33M?5 IQB05\N%A[IBT!*,!KZ"+<BE2E(; A-M@PJ$U$C* 9W\A&(S>)LEY
M@=<'P:1^P:47FD1S ]6)AR2T$1X&@#EEX,ME@$/$-(0+&,5C2?B63A.)"C>Y
MH%! LP_@RX48K %/VT7)FQ12@6[0F E)"H_ 20N5LDHB&Q-M+IIM0"-O?HMH
MM3"R%LF.1>R"'8 *Q@"J5! \%A\#M4$CP]*$^-/L+AHBJ,9*PPAHH,+-+W6P
M8-Q6-8)^U:CS !/("1=?4.4F:+)]MK*]/HQB)>BG[A*E-Y+.DW[(V$7R28X+
M9AU=&-$^%N/,S1" <Q]Q.F8.VC&8DQ(AH"LU9TCC_NIL%&H4.B^:KJP-/[DH
M\8:M"ZO'AEXPF0-Y^)G%\:364/GZBM0$LB<(-QOI8SB@)X_%(J>UIJL6[;-&
M0P$Q&WH20U6S_;BFJ0W5DJD@<EL@KA?O/'OD\V]"W&W(A\P&IM1.I#^4;W'.
MH^))FE86_I(5%R:2;>:"PF0:6C>],:TEH0LN\^9B\N+CS# S,#CQZUT0=B=1
MS 9783!D83S9J.%75UL9C9<K/E?QN8K/?2M\3ERM/@8#]LMA/!B*GUO^R6_\
M \%;%OF.C&M=D6=)EB61?L7"@1M%;N"?BZOOIDSV[OD+<7%V&/ZR= J6!0U5
MAX=*Z @/H5:G45+@Q2%1!?[!ND\#;+VVU#:BR2:J'AK<<@?6*SE8>/M2"^-W
MRS@M-T$(<(T=@0-$479,O0<#'NZ,"6Z ;S$-K+)K#4RB**KD WBT-#G(-%47
M=\#.1N/*^28Q0!.6AVHF0>%_1G3>AC,"35=U>*,25 $@\'!1^3IP!PG)/D#5
MBB4IJM.@2,5'= I'88#D_-;@J3JHHPL^6(2(K--T=H>W/$"%DH*AHBS&)+(A
MC7, 'OB[_8 DQ#Y $0%<32*)4J8A6)IH'-18240XDBY )KRW+296'UY%A@:O
M&LJT01.LOVT4;%OBUFD:V"&T9!K?/H5V0*0>8<:*R#C'6&#@W491#0]:Q:-U
MO"!BFY\+G -CP"(2QC"B2$:L;>XSCOHQ"Q4.E<4'/W96G@E\K3$VH:T'"V*P
M#@_F0?7/H0F<)@G*U^'V !0*B"*GX7LZ#ZR69<$I62]1@"7Q)LT2D]U UE?Y
M,(J'H[@;A\P>2&<4O,@*C:J&:FRRS,HJ5WKE2J]<Z=^&*SWA6-.I=9._=R>,
M(Y5]\$_';BPYUD:W2\\-35$0(R:%S-?KGK\'Z>Q@:ZNAZG!K*TUA=(QE&)X(
MCCIH:"07N/2&$&";- WJB-QD8+4!U48-#!5%6G"=%:5OT'B+MPP5GE8K4K;A
M*?:8Y$>XGPQ39@!AO4+E?]*$I,#U#3!8G2\805$[4U/A97=HC@3X8+GD56*]
MF0>+.!:;<,^#@3%FP]O!HEPZ%!Q1;\,7#&."@=<@Q#A,B<K";]E.8&#6"\X1
M=\&V1>(TAE??P7 NA%%U^QV,B01$FHU $TE&4MPKPP-5F:,J<U1ECOHFS%&;
MYL(9T9$5MZBX1<4MO@END6.\/GKB[$$PC&K?5_N^VO??S;Z_"@-.Q-$ULWM_
MA&[,EEC NDJ-R!?<O"%9XZH2W!A#$:J&T)8-N-D?Y:+8O%XKT HWI&/&"C=-
M8^KEU,&4A3'/PS5[3%%9N%66)GX%4]X(D1Z$VEP4S5:(4OI(;+*(%&<24Q1*
M#033*RKQC"1VG:; %9P3@OF UE ;)42@U^O-6KU5J^O\9<=J=TQ-M0RKTSF[
M?/>AHRCG21,RT1>E>W-R>GVM/+FV+-4PX ?ZO2W;EZG=N,<'P:]%/:?9;LV>
M\RPYCA$P=+7>;LY@=+G(+]KE= /G"XN/ ]]GCNC+_=\"O^*_CM$VZL9FSP5-
MU>%+AVI>2V3S):A[H',I<"N54.<I0NO4ZQU-%V$/G<X?1]>7G")._SP^O;HY
M^W"9KUO**-!H6H[IR!'R*2>=. R\T['#AK$;\#$_5Q!1I'RO]/D,.*D=R-ME
M69+KD1_SX<]=&4DB%!TKCX7T+SNCA_DM9?YFQT6C24&I+TJ='&1>).!T-,-8
M^6D>UQ0*G^1)54(\I6T"GI)5N67I 2^_E_";9@,*_^8QY)J%FHGW@_1+";/1
M*L',/(.3K$E--4+UZ#Z*0]N)NTR.>3K4R+&?F/_ #G*^EX\U6JT-/]:62_*F
M4:\7/KBA;_:Y;]*WW736H<IW=N$(VD8)E<P/(4Z6ZFTP\GNLERS<51!X;\2O
M=!W% Y<N2)YE-BU0XR9X&G]=-5LT9;GW15=#G1SP @G"OTV2O(OP&6,$2KAF
MN68>?V4+K6RAE2WT6[*%SE*.?'ZL"D:1= )/E)4S?BV(7X--%4W5W'(,.(VB
M#D: H3;A]E54Z!3\9$$<VF9) M^2JJ.WU$;=6EF!GL'0-)0";=:;H*DCC)5M
M>*XIC148=58C-5*]K1KFZG:.&0RKCELF#63GP$2]6W [!R(TVR1*-*8(I4=T
MPT0E%L&CDC$1U#0].1 &<(RQ"]Y5K8G @0FO#&0@F(#5)*$NA T<C%HNL,';
M3*(:UNU+AT6M]&A=,5U'0_3OI%&S,3X+.,G"94R^$^ ULE!'-]RB3E+$Q@(?
MBRU5:\-W J)U8YNB,*WP7\)CZ5&=A^'!]&"JU=4&HODR9C-8) D%B ,7T\:4
MQCZ&**L-]@,)H8.DI!,BNP@AT#8;--;7+5N*42VHP1('A@@0Y7@039W!!Q@J
M;XU&]83'2*"V ;S1(";-$!XJ!,9L0T4TC4=EP\'[A9.$"F$\&W!>2%,_%-,H
MN@67.N'Q?0:7N;;LBL*<!R:B1RR&'<(SY>&)O!JBZR@FZ;AE07"041UKX4T<
MC)S'6C]]9DW4>^F47<WDH,JNK0EC>BWQ#*U_F1,,AOQY->DV7IJS\I$YC\$G
MY5A>):*@+HYN?E.D^X)%15"'D]JSFRK_PNC)K[E^/RBX1/I&:L+S4'(-8):)
MIPLZ37GU,AT,OO3<D%\<,EO8(/D;M#<RU]$WL./'F?LP@P3Y2V=^G"*)62)9
M$503B2"UUQU*U_7%PSD0Q8V4ONU%["?%?? #V7\RZ49Y88_=P6C0=?]B(B)H
MJ?W0PIMAR(9VR&IL['BC'EM:K(].X#LVWX>7@<+&KFQFE$[>]GN*'R@^'R]?
M%Q']\I/2"\3W?A _%CZ5<XD\XICN^^N1[\LXP$5?ED"3^M9]./-CEO9B HFH
M\- +E T/U5X9+OMBC'@-N(R&B9$F48#J+1)CK@;7VE'Q]_!&&@9FM' 5P,0$
MBIM@W%H8^FK"2V)@;)EP\R"J% !)R1G-@JM7&-2651MY9,K[8W[B"3X;<U8=
M/+D]ICPX=W:O=_>5V5_NPB"([SB3OV-^'$X.-AN%)O8KF VT4!E#-'(O7%=#
MI;8@TD50I;A)HML0VQ7,7'15AX\6D2V@MC+",'9+KD<+[&?=X^]!8!?3W(; 
M[D8.1F#7YN7UC8KKH(%\?^)Z1D]5@:JTIVH2/<YWI]J-!0J.TO=0,1[!7EL9
MC'"_6<OEV8=]Y"Q\/!(?.8,B9QF^&^1O5+%AAA.!Y>%$*OCZYC7[W &LQX(%
M.>1PX&4VJ&EDAHM"_&Z'$6Z0>?'9S?>#%F^=1]OWF1>IT=!5N\R3L7!7B7 .
MYF0(Q:Z-"/M >38V;RG7N0Q.T[J(Q,6)R%E'K)?9H!DL6+O'=&^"!RQC.B>7
M42R-8HN9>+T-CR-"K#W"R(<J3@LW\J' (I1%%%AXUQ$:*PQFR>H$WFA4 W44
M6'C_+@Q8#1&80M/=%S/:.MQW;*$X+)QL4;Y^ HL,'5A$?"4"K &OX8\:+9PC
M;#_4&&Z;1@T6'IZ!,DZ2R#!P%*#.<KC A6**\*!-%,V" A[P=&"1'#B(K@NH
M)8-O,11NX?(L;H^1M!RHP[LYX"B!B,#@+!S%;&EP2X,#>"HFBM/0'.54F"4"
M2W0\$G$$&OI"E)##T!?"T($!"X^U1%D/X D(.*T!?IQCP,(;6^ V+Y'P0:-#
M$R&!I,07345%>% /!FH;;DU%! E8\%0O%&)IEFN[B@@- C1X (JFM55XQA_&
M5@F7P35,6!.-^1N.6TPZ$I&F3T*S\&A$5&;#'G$"$K22-&6B00!-&S$X6E$9
M:21^0$1\)X83PJ5Y3."@B3@/,&)WB;J8UF<1!4%#UA_QNT!<$YX8J>FBDBYX
M:JCX<)HM3G,BD>P;>/(!JL/GEDMST9@MUBQWO?!F'\/![HY_.[JN8L)6BEFZ
M<Q[M$!X8UB0)G"H81"9M8(+#$N* 1HB9I %B)<B>#N?["Y=-PV)GE1J3\+*0
M3TR]O7EWG+P\]9T $5J&"0)KP2LG("I Z?!##",<P&,?4%T[2HX;FE@E\($H
MDB3 @@9FWA9)+1)X9L_VH5HDO8#@W9 PBD^)ZG=L^X(Z^R[G6B-_8 ^']KW'
ME/M)S!0[#.V)X*K*;;=VU#T^.P/)5IA$2;C(AJH50Y+5B>A_A,GN12A$B%8?
MB, L3*A3 ^ZY0:6TP6,0-F<!AI'^^[=:JV[4-TY,)<5$EP?'A0EQPG,AN=]G
M(6AL&P&R*EV76%Q@V#_K?JBU6E:[IH$ #6R/WS58 <JJR]B&VQU0WC:2&EHE
MTA7P++AY5],:;T_769!2&"NS:.QIE[$A4!-<'<J*ML$Z7/#&D$9)G@2&--8G
M#!#.-B@&(A:4%,:J) &/-T211+&\@R&)\PUPBP(8JW*+DL(7B"4%3G!U*"N2
MA@&/:T0=).!3#T5PQ5X/.,&U-DXI&SI6\@>V 1"K<H]V24^?O3-P7QT=_U.O
MURO[-M[D.K2=+QQU</.VL7FS;^$8UK-N3RD#:MP6?BHBXW8IIK\?V_9TG::V
M[;)56K2$9^1>I[A-\Z_% 2'LX.IQX$>Q[<>R-Q_4)HXPB<.]]JA4.!)C(SS4
M'U.;"QXAB:DH!X]R1YF<2'HB( )"$,F;\ IMJ+@P$KQFB!,Y4#$5SQ I5>N9
MW'=+]*D-["^,2P/BR*F)D[[@TNEIZ-NQ^Y1Y*"Y>+S@R]%HB0>WZ]%VW$M-6
M$!Y"UH_@0EJ+0'S)'\&:(IJD";" 9M$):,4XWHYX!A6I($*2F-]\B1K1GC/]
M](K_9B'C,XN@@A+8-:"K;;BW!Y44"4\E@?O1VAD=;W.@TH0 TGCF4:&S),'#
M)4"W7,%44YO?7!FXJ^NSRYM]/&VQ)PCGO/$V:DP.Q8,Q129-0O,";"Q[?'KQ
M^<V=7N/T$[GXIV.'#44<.UC+KR/4_)+:-+_,_U.Z-T?7-\IY$'P9#2]&7NR>
M!(X<H^BI[*;GZ^(]_%\N\"B]2W+%?C#R\T/T%\=Q>GFRN5&L=I#0M,J#]\[%
M]%>!-[C<8-NUHS@.W?M1S+HLON7"F!N[@BDP:8%3514T',P97.(M/^$L4MS3
MG?BQ/48.!%. OB06YM3GW&>5,6"V=9E%[#<[>IPM$&0<4J86'=33M)H94^HH
M7N#8WF,0Q8>:WI2-D+5.P]"4&B8%YV]VG,48/?ZM?.R59[M^VK-],/14)P%]
M\/)S*3[H>CM?@-KHDZQZR9-F>$ONG$%+WTH@;4-?;;B<Y;'0MSWY@*]?O_)3
M(X@#)_#4QS@>JK_Q7\]+H/[L<H"_'KSX5(Z@\1H#N+!]^X&%;YX_$:9K]8'%
MB]<=9-Z6#%0S7W&D8FBP836:9*.ZO3Z?6RV!K)N;JQ>C6KPF&9&UXA9 #VE*
MT7D#,2WT0*;BCSL<JF?#X;'G<JU(#=F_1YQ1'3Q_DI"$IM$^H(5?W"E\9S2,
MU./;J^Z\>#*MD:L*]_@)Z]M<A)G__B#W!CD<L[GZ?(O'PXD+/QRM >" "_)L
M"B:1WU1/_LEZ;L;%R1,-Q!/MZ2&G+AQYXEB5\O91KZ<?+'^5/$AO 9B[9_.3
MDQ]OH@"R^OO%=?)*T+_K/P5?V 6+'X/>P<(WXD8LZ 1."O0@?2?':6@E%"I?
MJOW0'C"A8JEBBL=VQ%0N5XC7![,/DGE;YNKPWG)]Z24\?87Q7;.($\0;3?(?
MP5^>/TRAUANK0A7CO$K LMXR8'V%Z3\#SAAH&;T6H/,E*K4RDLR U1VY\>):
M)Y\DLE)]'8C+T PP<XKYZ1^IME!\[>A+3UAJ RE2\L,G>>@_;OEOB4ZN.G.&
M(Q[X\K/DL6TXC\8_UK-'OO.8_>1&$RZ0X)\\X")G]G,MLX#Z_[!#86GH*+V$
MK2J2%T[5;>6K'?E_3Q7N_YT+Y,ICG.P4::%1W+XR"4;*H_W$%-N?) !9&"GI
MZ2_B)P)Q22@M7)R-AI4J4:D2E2I1J1*5*E&I$M^%*G'Z[Y'M17G*A-XJDRHK
M9:)2)BIEHE(FJ)Z\S\H$R$&"2:+32\)PT\;:*SEJ,%E")642^-8/O)%8UM5<
M1BC_67%8;I?%'_IHM @_NWZ"&?PXAE]]>WT&O_@=5UHB$=8/\D+^([COQG;,
MKCGA!OX*MT#NN& ]UP9?>,FY)OAB*?*(E+*CD,$?(98+^IBK9-MBL;1\6^5_
MK(P&E=&@,AI41H/*:/"]&0TJ_V-E,JA,!BM#1)L,=GU\E4GC>S%I5*I.I>I4
MJDZEZE2J3J7J?!>J3N4?K92=2MFIE)U*V?G^E!V8M]+"M->#-Y5")36":Q.A
MTO'@8#%UE<L:H=&4'4#5< !GR:+F35)O MY4#=7&B2*C%T%/F-)D=9J64_ Z
M'J@M14($)55;R:%B6BZ7E#3>W#98>+-WE4*N3]^?_OD=5 I)YBDO7Z8)RDHA
M(7M@8TRED#99H1#@4+[]*J2S ++\HB/RSKEB61)W:G?H)0+FAOE*JZPS#)&P
M CZIK(;:;M#TW80?@ @!V(+WQ$%TVH%WQ $7,]-5#5XL!:,"M.!-BU&M1TE$
M &-9#MSS8_7B['LX5/DL[:&[E6-UX,Y.LD,^!L#!:IAT)RMT-+M0A*O&!UA>
MF;MD;<M/4(Z3A:)=XCW'FMJ-/ Y;V--9F'@?W]E.S.<-/5<1ITL+SELQ9Y:U
M1YW;C6(,B!4Z<4/FQ,E:W'$*??#8[Q=*%-OA$NW-W]I-+Y PI,FLP&]_.AX*
MCX.4Q(]._J7TPV!0=L_-,]QD-*R7;RK[</^9/Z"C7$RN^2Z*6?+^XZWO.G84
M)^1VS?H?F=\;<@$R[GS\J(DRYA;_T56CU3'K]7KSTZ<#&4;PXT\"X-G)QX9E
M&8V?E%O^4JNW6_U[4^]HFJDW6+//&EJGUN*W?>+_%"=E<T)D3=A*T7"/1@]B
M&77^3*7=J;<Z1D.YNLC;1PD25+YOKJ?56A51+KH;AT'!"KT[NSR][BC"-MI1
MDFN]B3(K^-I3KMD#%[?#B0@DR-_CZ473&9:M@7(OS*6*ZRLQ%UO#].[\NV;P
M!>:12&L5(,U)?*>)"W4N!"3B)'#R_OC(^0)$'+]=X3<HMO-%'!H?9X$FPJ'2
M_I3T:\DED&:_W_N4^Z3$H:@$">9<OHFOPF \^2B-QOW.QP+&JDY)_4Q>:SO\
M*)$*B[@@^>;33\K\;CCSGP2*.1)^XU3JL7"Z/4 ;(Y20\#LC?_(W26J#9"!W
MG#[%V?I[X/:*<AU. I^I^:=<+G@!-WU&$?AK%H]"7_#.14:BO@2R\0'R5:2=
M/'\ ;.;M5K-AF8:>WT)QU7$D&"6;YAQXY:L;/RH)R4YW%QO'G,C%U;:P'O!3
M9>%[,L0GPRH"OR.,+6O?EW(WULK?X,\TM097T\G8FF9EL[5V$5OC?]K%;&U5
M8CGGY[/\!=RF[5:KV6SP 9NF8>BZMOG]FO+D==GF ABJ7;_*+FOOS2[KL?W=
M9>W,769JQ;NLUZ?99<F<@-+&)@VOZPWX^Z#R^MY2N=[(IG*KA,HU&BI_&P0>
ML_V$S(G%+KD>9-"/1+]/6LE8/H).('V%&<P]",4;S/K>\(;[ BUZ5=S-LD>*
MD%;,8.824+)$G]G7FQ^[,/J55@40(TV,7_+Z3F(K5 +'&84AXVK2H^NQJ1XT
MD*&\BCOC@?\U];RRZ32$B2+WB7^3CY2QPNG3,E$BOMK\5AOYL3M@H!5]'N;+
MNS)&/%Z&3<0GX&.?6]7GD;\ 0KK&S^=G&>H6+]H4YJ9F8>&R\EC,"B2X^:N]
M(!**3.[%MWYBN14+LS5#\H8.B?RY:+C):%KF9)K%@DW??)W)F,C)&)F3:95H
M_/W=7)E,,C/K)9,QJ"8S[T[8.63I]4QDZ27R>6\G5U[7,R=CE$RF]3J3,9"3
MR=R3IEDRF>9NKDSVGBQD_<V^LYL,1F]G3J:$]3NOQ/J1DS&R&4 )ZW<VRBWG
MI1$V=N-":>39-R]R;1&>^1-^8QC(?K E+O9OSX=O6 C1JZ7WF+,Y'[Y9Y+6I
M?/C92+.V8H( ^O!3 OD6?/A&CK,+M#,J'SYH@)4/?Y/@]]R';VD[85OE^[Z4
MN^VQ#]\T,#[\YQE7/GP<V]Q5'_X>[;(]]N&;V0& .3[\YQE7/OS-^/ M?7^H
M?']]^):)\>$_S[CRX9= KWSX8!$3[\/?(]Y0^? K'W[EPZ]\^/O@PU_+D+QS
MOH],1TZ.#__9Z+F;/GPS.R AVY'SK/'OIHO-S"2S'!_^\V2^3Q^^V4+X\)_E
M\]WTX5O9_LAL'_[S9';3AV]E[LD<'_[S9';3AV]E[\E"UK^S/GPK.R"AA/7O
MJ _?RF8 ):Q_BSY\N"O^CZ/KR[/+]QTI34IU?-'K[T9*],4=#KF4=\\<>Q0Q
M8<H:3Y0#44Q2E:]5Z=$T1&\4<;TP=]F.PZ+(O?<*Y*OE1Q^_/WN5)\\5-0#7
MB]&;JMZFJ<!07.%(J_&%?V"Q,A2%70I\W'K-[X$NG!LGN @/WPH-<-E$3'7/
M[13,1(U0HUAU>+E(#-3BLANS> FNJ1W?=F\^7"B"/RH'%O_W8WF4AN1!Y8K3
M_&-.3M\=W9[?I,\140_0YR2NU0@0$3-5B)]LCY/)I3T0O/'>%47<[ &+RAAP
MOL8J_AT>+@9M'"Z<(ZO?JJ]^J['ZK>;JMUJKW]I8_=;FZK>V<F\]%O65!,5(
M(H%9 I8(+&2;(['GUC%H$BNXM8S$"FXM([&"6\M(K.#6,A(KN+6,Q IN+2.Q
M@EL!)):2R8I$EO2'*">R-1Q;&IECJY$3)#'3:&S6:^AL*C=;3K,N[3_-8L?6
M;LXUVXGW;.O*F6MC'^>:$]/7*IFKM8]SS4ZP?@[TR9FKN8]SS0FWJ)?,U=C'
MN;9*0DMRYJKOXUQS2F'H)7,M"3#8R;DVZ]ES-4KF6A)O#!'B_"CNA=[8:^&%
MN();RX2X@EO+A+B"6\N$N();RX2X@EO+A+B"6\N$N(); 4)<*H:M*,2-_$UH
M"K/!I.!P>OB"NM_D_X!J^*OHU6(\*^K52[?"]>JE6^%Z]=*M<+UZZ=;\_;+#
M:BIZQ0INA:NIZ!4KN!6NIJZR8I765VE]E=97:7W[,%<:K:^2 #8I >RG #KO
M@$_=.>OZEE;QBQEJNUWL8]U8I$ CN] +Z.S;N; '>;H5A.\5'6Z[-YGLP$K0
MZ;5[DVED3@9T/.W>9$KJ"16=/[LWF>Q0(9!9<?<FDUV(!60WW+G)-$L"'XL,
M@YL,XEHE F4;<4>KC97CG&2L)#$X!DES59*&.O"NO6NV5MYHU)@8.$5/6!/>
M9Q45DP7>9Q@,P&D7U<:99*SFYAL8<J@ETO>JQ MO-[ZYSE6K45;3!,=.8NC5
M+-X%Y\%#-PZ9/?@81_&GSO_*W^=TG0YS^J$NO"'JAM@]/;Z]/KOYUW?0$G$V
MU:2@VF@H_3RRX> R=5 V2.3D. K=>/+<ES =3 :1VB\Z)9HZ6:=$_+ VT3*Q
M9*VVU,-R&1>P1I:Z\9KK0]W.$K VKB^T#-D >C<629V."+!:K===J_*AO<*B
MN2)Y<+=630P)LVR:\8KK!AO<:RW<SJP79'>])BLL'-/&6_M*66Q)?%&F;_A2
MO!73$=#%56O/N\>&7C!)KTV.YA0#=Y(B[@1WX4_:H>'<N?XNC4ANXQT;SXZA
M*)7VEH:TK 7(Z_-T 3*&M#R!V0AF4\E@J&+$@BT-9::G7F]OCAVA1[3PAJP_
M.$1XGD:_I;?(J]2$BSS9ZG3PZA4+!VX4N8%_''A>4J!(Z.$;-JDTVV#5'V6H
M63:SYC[B=,P<-(W&=OC 8OGRL_@)F3R1!'2EY@Q?C>]W7I,Y$#QL>=M0S*AH
M"DF,2<WVXYJF-E3K4,"0I(&X7KSS[)'/OPEQMR$?,AN84CL15ZN/P8#]<A@/
MAN+GEG_R&__@71 >R43OX\"/0[%_0SW)&ET.JIGM^(03+'*!3"AO>L%5Z#YQ
M7OK >N?BAKL9S3Q_<31C&46U25<Q0QJJU@(;C36PQ9 CNLP639-MC6!L&MPG
MTX9"-=6F!H:J(8SP<+]< \/:H4";&'<!P4@UDV3^#;BW$XP!SF$T$K^<#C[=
MP>0J$ O>_32(U3"DU8:SJA8"!_ MB_*C$BP7?,>B* O.LBPXV$83[HM#X17L
MD"7A6IBA:B0T0!.CH8&]D:BQTN 53 (818?&TX^0!S!;%HQ7!".L6V#^BL&K
M3@.5YI %\RS4+@!#!:^6QD5L^&#WB6EI8"K0N* !KQ2%P(%15BIJ!<QJ+=6 
MRR]@U#94C23D10,C%B,7PC<M:JP4O-"DV5Q@!* V%PF'!?,!A)S5 )^QJ$@J
M.%0, IIPL!@::(&W%B9*#ZX>[A.]THP5)16"#RZ$;E1OD 39:B1\ *X9H*)*
M2<;: -, 8K40L@L&K5L^8% D #X+< R6XHBIPTU:*,2"B8!&,T"=W'#N@MFR
M))HLC?@*MQ=K&+!@O&+\$'">A:)7&K5@\QI,7=7ALC;&7*R;% 'V6Q>)$,ME
MP!D!B:T4(Q$1R:\TME(2K@TG+ S3IJFE34&M1$!)H-9IL+I=M*+X%0FQ9AC+
MJUBC*M;H6XHUPH8-.8QCX)C_NK+C1QG,RD)-A@Z=L+X]\N*;R9!MUD:EJRVX
MRHL*)=Q\Q V5Z(0XC%!YE'!%&@%6IW&(PI<+I4/!A7W,T4%C4*,Q -.8$FBV
M 9Q@M^]CW"-]#Z[N$-GI,(HT7"[%Q/3IX.7"Z)%- MN7KAIP11)5L('"H$2T
MNYIPDQHJX@*^7D3E)5 55TA"9N&&*HP'NPT6"E!V&A+#*EPNLC","QXOJ=6W
M+L71'+4D#G<:;@B/0\7$G,!#$%$.7!JW,(DK .YF(Z%6#-"2.C,KFI4HC, Z
M#0(((L\XU-;>4 !<CT.IW12^=HTFD =. =MWLU90X=KA#HQURU Q.Y8B%E^#
M"Z^8@P#.!E LBP0JR5J1% BD:8&LD80>:B2!(31ADD2;@&3#$IW;-';"-HV,
M19&;J-$$MS=I&"$)'R2)$80S0IKJR31IE!C"HLG*(HGBT2P2<MVC,":+9+'@
MH9<TCE.4E9@DM!WNC<78AN 96310=51D-SP^"B41D5 !?'?AK,3PC8 !BZC7
M O=OF30%R8G\O#3AEV ,H-*RP*N%V;5PSJVAJDN0&+41Y350@:TD3C-X3C7*
MOT63H4D3,4QT?)$H,C2R,=SV0I-'1\.V:&IA[!-4FCXP* F&R%A(@@(2,\E>
M*1TDA:$0Y9;6"RC+?405.E^%SN]?Z#S]PL\H3-0 ?9SP3PRSW;;2&J&"TI_C
M\H>!YSJ37V13FL7KS?2[M![P="FZR=^[K&K 2@+F%6CM,.OQAY'[X+/>VW]V
M,TMI3]E&4O-]_O=&A<2FJN4(M$6UF=6R-@SIB*;W+JYBET_<COG8Q( WK%-;
M\/HAJ,()-&F"\,,>D]L,MP,A= D-'I>/4JHI-#\-49L&$SR=X<5;>/,*?;9J
MHOP^HI!Z4>^-%YNT/$EJ;-7;:AP-58&9;FP/AM<L&D)W,:+$6(ND\ .BYB@-
M;T")["4[@Z:4,\;[3,-F:+PN<%T-PP_@>B6"?</KU8&)M*FV,UJ!;@"M\,Z/
MVT_0@), YJREL5K!*[:A0KU)G%F(W)_MZNN::L = X@#0(/7Z$$P%Q-130>U
M94GX*\+UB-D&)-F5<-+"9+VTP5 1<I"%*%D''JRAZO"NS1A>2+):-.7*X'%C
M*,HBP0!-:35XV!3-WL+X!Q'JW+8]VHC# *RY:.(T(-"'3'@O>TQG!T06*$+.
ML. \"[6Y:!H;D/2$A\?YH7)+:3PC)"D:\,!<U!%#PEZ(\$JR"TB 9CAS<Q]Q
MVSV[?-])6KD7&J)20T>8E.CYTZJWCZ_/S[);J":@'UA\&?C'_&[7L;W3<<Q\
M88C_<';"Q_U15RTNNZD&WS'I2[W^J0A6"2"]E7_WHQW=^JEG@O66 '64.!R!
MJ@KIF#JZ\%IT"";?@A\=!H;)PS-\#<2A;%"@ !''BLKL@OL$4!9Q"IM* \[D
MZYAP#9I,?[CBBS IZ 0A5JVV:L$+-M'$+6VP6,^OORJAX-91YV/*KT^%05HP
M[4XAKY?NAINW75&([=R-XC?7["GXPCDG?^_V.>^,V7]K]KW=;_:X&+5YV':C
MV6B3 #:;EI%_3OP_CC$Z3!4^]L,OXA;E0_A@^^Y?MO!3;_1Z?^3EG]1EWZ\H
MX+:VG(.,&2M<':&IJ(9AT_#H=1J?^)JU4W(?\>'ZJ-?C0+.Z@Z>7U,=&G?_B
M<O/T55V! 7_/?!;:WJ4]8$7@;6-M\(#AFVL\:55]>_,)FRVJ>LOP?F_;KS>,
M,+I@-B.)7DBB&.<05G%@!#*,J>@(3@O#7LDHM*YC^WPC0B,C$/RQ!>>Z&+T+
M3C[@L6IJ$UZX#76>;[GT R9" &ZPPE37(O)>T&1[;B6.!1/69<#- _ Z>#I?
M>XH^$!I<Y\8D.&J-[8>V%5PC+Z@-@MZH$!3P,B<8#/F8:N)=?BC=L;Q*GAD?
M;B]/$MLDBXK #B>U6?!OP?.C)[_F^OV@X!(93EP38=$EUP"FF8'<HGGF'(6#
M+STWY%>'S!8')G^#3F98BIU.5BHZY"CS>S*Q(<X^,?E+9WZDPK8NT2QCN"-.
M;Z\]EJ[KBZ=S*(H;I4':BOO@!Z$8WX -@G!R88_=P6C0=?]B?'/%,?\F?[6&
M(1O:(:NQL>.->LO*P4<G\+D>_TFY#!0VYCJ^>$XR>]L7S%/Q^7BE*#..?U)Z
M@?B>L]3'PJ=*FDT"2R&4F[-7YQE0D:PD4#M7;W^<?A+97!9C_._052_<,0NO
M4B/_QB-+A>$:;@W \$]XF +J2 8+4!CQH0$62E"1W"21<'"A!-/["JZ"8>+ 
M:/JNPS& "H#9AE2&(B>2^!2:U&4:0P%)%2HBKQ4\1@GCNJ1Q=M,4.Z7Q]I,8
M8!"=_TBV%L9O21+[!C]6MV\NI G<)^)8V](AJ12__SG_'M0^/LMM*'W_]C J
MGPC_HU+Y("/Y1A2^-36X?WL+^EL<VGYDRW1F=6RK?[H]J,H&#K0Q.%NAB7D#
MLT!,\"L\@(GHQ,9D\&7(5[G/V,GR%5D[>.V,_GF@4>B\2.I_[;H12.C/8#-&
MNJ<U* 0G2B\[3#F17!PY2TE,\JW8!1>VZ[\+PI/0?6+Y-1563)N!-PE 63AH
M%-T2J$1N%\R\2111D@Y4&DU3<W@^)BK)G>:TA.NWF&P9,%H1=KA&DR3" N[,
M1G70I,F3(+%O(BH?(@:K(X)2$:/5$0V8,$A &/HQ= #O&X>*T8,GZ*.V+8U1
M E$6>>LAE7!['ZIG%DF-'7C U=9KV2.X+ *J09,Y1Y0 0A++F%&O<]=L<T S
M&MJ(-_+E.SLNM^7MK(GN]O+XP\75T<U6#'5<UY/XRS:2[:Y1:]<('$>W-Z=_
MWNRC]3D-*,D;%#FY"LK)-^<*"AQ.!)Z'$QE)M'ES<OX UF,"DB#R I5?FLN%
MA$9D+B]&\';LY1NT<8OIS1FYD_?=6 S[F%]C.S$+S_B/'0<4 4K-%ERJ0&@"
M&KQ'#JIW+ES)0A73@<<2(7!@P<5K#6'SM[84XHR8>0.N8Z-*?VV^?HBFMN$9
MT)@@;T3<-"8^ 1&B MX 6DMM(OH6(.@ $4]"4P8091XEJ:L)5S Q#(LF5@L>
M4HFJID1 LKIJP1&+:8_3;L&I8+TVVONM+?Q9NSS=2W4!*00G\Q27*ZG;-!%P
MP;?:0W<;2O2XYK-GJ?F0CP(BQ+?)A'C$>#8AR1>M""@3\Q771HQG5N!^IU8)
M-K)76:_=6"; ZC1?<W%V1!M6%&I#6XTSC/(J]*4<MUP;'W,<+X2<B?=\'52^
M>*[MI35'U&[WO,MD@XVWKM_CL$Z?N"H%5<\1 G]S\[DS7':"UWO&"'IP81]5
MX+($+(VVBZGV15*6'9$@C@HM(0DJTN!Q\Z@6('#?-P:S</410_WPG8I22K<<
M"82!2N*@;='D(Y#TUX$7O:,I;8K:6W#UF:;U(0(JW.B%<=*3)&89)-U9-'BU
M=YJ:W#L E81EO1K45[+VA,B^3>4:%DIDGE7+_1Q%3+T)1R)"VK<?6/C.=N(@
M*2VX<2G9Y (M23KD5B1/5(PH28\9>$00I@H 48+UYMM@Y#?N*M@]ZU?VDMLH
M?P-A=@Z"5[5(?"D:/'P;%0!'4IJ X+S250,N8F^_[%X9&]EZ[S<-KER1)'NC
M8N%IBGW0M+VB:?P%#Z= C77SLIJNZO 6\(B8@@:\X@M*P2;QI&+JGR.,C#JB
MMCZ&5X$Y(.8,@ =!@44>35<1)CQ$>C(BL@2\7*;:I,D+I,FQ("JQ32%+4K73
M*FEVLA_U$Z7GJ]8/PAH;#.-)T:5<ZG!8%)5>"+VN/_*\6LB$9V[QJF1ADF_X
M\HB* WR  R7F2R"BGUIU;9#O_A>RDHP62  ([YOKK^T"?,ZRODO@'C[& ^_0
M]7MLK(J7!8$5C_SRS(DNO'E@?OE%R7)-HZU'7M&U;V_/SD^4=T=GYZ<G"U]L
M!!?J>.!UM$:[(Q'>#SPO^"KT*DG"2N XHS#DRMC71T[+"ALS9R0=DO$C7P_/
M]5\0Y=H>6OL+2ZZ4R$D&9S;EX$*F?!6_)%$D.TS-Q]I-$-O>E-0,9>#Z(WZC
M8M7%;@_\WB+A_8/_5JZ3E5"T]*O%>'/-X,<PW!6=+"O_*IU:[3GF6OGXESOD
MZRJN$Y#Y.X"O/1/@G5ZO-_E&TOD+TU YI!]^$.N8+E3@IW2C?'7C1[YH"RL\
M=MA07-/Y8=6E+QBTW;.'<1"^&._T8[FPK?K"NAZ?'W6[YV=OE5O.-20W5Z9<
M5_WAYT/[UY\/AR'CO^^#WH3_$;OUU_\/4$L! A0#"@    @ /*H"-W-82;EH
M0P  $LD# !(              *2!     &5X96-U=&EO;E]L;V<N:'1M;%!+
4!08      0 ! $    "80P     ! 
end

Mime
View raw message