harmony-alerts mailing list archives

Site index · List index
Message view « Date » · « Thread »
Top « Date » · « Thread »
From nom...@intel.com
Subject [build-test alert] BUILD FAILED Linux x86: JettyScenario
Date Thu, 02 Aug 2007 12:20:31 GMT
Jetty server JRE:

Apache Harmony Launcher : (c) Copyright 1991, 2006 The Apache Software Foundation or its licensors,
as applicable.
java version "1.5.0" 
pre-alpha : not complete or compatible
svn = r561336, (Aug  1 2007), Linux/ia32/gcc 3.3.3, release build
http://harmony.apache.org

Scenario framework JRE:

Apache Harmony Launcher : (c) Copyright 1991, 2006 The Apache Software Foundation or its licensors,
as applicable.
java version "1.5.0" 
pre-alpha : not complete or compatible
svn = r561336, (Aug  1 2007), Linux/ia32/gcc 3.3.3, release build
http://harmony.apache.org

================================================================================
Scenario results:

Testsuite: org.apache.harmony.test.jetty.JettyScenario
Tests run: 5, Failures: 1, Errors: 0, Time elapsed: 40.064 sec
------------- Standard Output ---------------
Setup completed.

==============================================================testInitialPage===
Starting initial page test case.
Loading page from server: http://localhost:7070/test/
Getting resource with name: initial_page.html
Found resource: /export/users/cc/cc-suites/tests/JettyScenario/resources/JettyScenario/initial_page.html
Saving content of downloaded page to: /export/users/cc/cc-suites/build/results/JettyScenario/JettyScenario/initial_page.html
Comparing page content with etalon: initial_page.html
Page is equal to etalon.
Initial page test case passed.

============================================================testStaticContent===
Starting static content page test case.
Loading page from server: http://localhost:7070/test/data.txt
Getting resource with name: static_content.txt
Found resource: /export/users/cc/cc-suites/tests/JettyScenario/resources/JettyScenario/static_content.txt
Saving content of downloaded page to: /export/users/cc/cc-suites/build/results/JettyScenario/JettyScenario/static_content.txt
Comparing page content with etalon: static_content.txt
Page have different number of lines than etalon.

=======================================================testSessionDumpServlet===
Starting servlet test case.
Loading page from server: http://localhost:7070/test/session/
Getting resource with name: session_dump.html
Found resource: /export/users/cc/cc-suites/tests/JettyScenario/resources/JettyScenario/session_dump.html
Saving content of downloaded page to: /export/users/cc/cc-suites/build/results/JettyScenario/JettyScenario/session_dump.html
Comparing page content with etalon: session_dump.html
Page is equal to etalon.
Session dump servlet page is OK.
Getting resource with name: session_dump_new.html
Found resource: /export/users/cc/cc-suites/tests/JettyScenario/resources/JettyScenario/session_dump_new.html
Saving content of downloaded page to: /export/users/cc/cc-suites/build/results/JettyScenario/JettyScenario/session_dump_new.html
Comparing page content with etalon: session_dump_new.html
Page is equal to etalon.
Session create page is OK.
Getting resource with name: session_dump_set.html
Found resource: /export/users/cc/cc-suites/tests/JettyScenario/resources/JettyScenario/session_dump_set.html
Saving content of downloaded page to: /export/users/cc/cc-suites/build/results/JettyScenario/JettyScenario/session_dump_set.html
Comparing page content with etalon: session_dump_set.html
Page is equal to etalon.
Session set page is OK.
Getting resource with name: session_dump_remove.html
Found resource: /export/users/cc/cc-suites/tests/JettyScenario/resources/JettyScenario/session_dump_remove.html
Saving content of downloaded page to: /export/users/cc/cc-suites/build/results/JettyScenario/JettyScenario/session_dump_remove.html
Comparing page content with etalon: session_dump_remove.html
Page is equal to etalon.
Session remove page is OK.
Getting resource with name: session_dump_invalidate.html
Found resource: /export/users/cc/cc-suites/tests/JettyScenario/resources/JettyScenario/session_dump_invalidate.html
Saving content of downloaded page to: /export/users/cc/cc-suites/build/results/JettyScenario/JettyScenario/session_dump_invalidate.html
Comparing page content with etalon: session_dump_invalidate.html
Page is equal to etalon.
Session invalidate page is OK.
Servlet test case passed.

===========================================================testRequestDumpJSP===
Starting JSP test case.
Loading page from server: http://localhost:7070/test/snoop.jsp
Getting resource with name: request_dump_JSP.html
Found resource: /export/users/cc/cc-suites/tests/JettyScenario/resources/JettyScenario/request_dump_JSP.html
Saving content of downloaded page to: /export/users/cc/cc-suites/build/results/JettyScenario/JettyScenario/request_dump_JSP.html
Comparing page content with etalon: request_dump_JSP.html
Page is equal to etalon.
JSP test case passed.

=====================================================testGZippedStaticContent===
Starting gzipped static content test case.
Loading page from server: http://localhost:7070/test/data.txt.gz
Unpacking content from archive.
Getting resource with name: static_content_ungzipped.txt
Found resource: /export/users/cc/cc-suites/tests/JettyScenario/resources/JettyScenario/static_content_ungzipped.txt
Saving content of downloaded page to: /export/users/cc/cc-suites/build/results/JettyScenario/JettyScenario/static_content_ungzipped.txt
Comparing page content with etalon: static_content_ungzipped.txt
Page is equal to etalon.
Gzipped static content test case passed.
------------- ---------------- ---------------

Testcase: testInitialPage took 6.365 sec
Testcase: testStaticContent took 1.231 sec
	FAILED
Content is not correct.
junit.framework.AssertionFailedError: Content is not correct.
	at org.apache.harmony.test.jetty.JettyScenario.testStaticContent(Unknown Source)
	at java.lang.reflect.VMReflection.invokeMethod(VMReflection.java)

Testcase: testSessionDumpServlet took 1.867 sec
Testcase: testRequestDumpJSP took 10.389 sec
Testcase: testGZippedStaticContent took 19.892 sec

================================================================================
Jetty server output:

2007-08-02 19:19:02.416::INFO:  Logging to STDERR via org.mortbay.log.StdErrLog
2007-08-02 19:19:03.570::INFO:  Statistics on = false for SelectChannelConnector @ 0.0.0.0:7070
2007-08-02 19:19:03.827::INFO:  jetty-6.1.2rc1
2007-08-02 19:19:03.972::INFO:  Deploy /export/users/cc/cc-suites/build/libs/jetty-6.1.2rc1/contexts/javadoc.xml
-> org.mortbay.jetty.servlet.Context@10a4eb2d{/javadoc,file:/export/users/cc/cc-suites/build/libs/jetty-6.1.2rc1/javadoc/}
2007-08-02 19:19:04.156::INFO:  Deploy /export/users/cc/cc-suites/build/libs/jetty-6.1.2rc1/contexts/test.xml
-> org.mortbay.jetty.webapp.WebAppContext@10a6e089{/test,/export/users/cc/cc-suites/build/libs/jetty-6.1.2rc1/webapps/test}
The GC did not provide gc_add_weak_root_set_entry()
2007-08-02 19:19:24.531::WARN:  Unknown realm: Test JAAS Realm
2007-08-02 19:19:36.109::INFO:  Started SelectChannelConnector @ 0.0.0.0:7070
2007-08-02 19:19:47.029::WARN:  EXCEPTION 
java.nio.channels.CancelledKeyException
	at org.apache.harmony.nio.internal.SelectionKeyImpl.checkValid(SelectionKeyImpl.java:90)
	at org.apache.harmony.nio.internal.SelectionKeyImpl.interestOps(SelectionKeyImpl.java:55)
	at org.apache.harmony.nio.internal.SelectorImpl.prepareChannels(SelectorImpl.java:222)
	at org.apache.harmony.nio.internal.SelectorImpl.selectInternal(SelectorImpl.java:185)
	at org.apache.harmony.nio.internal.SelectorImpl.select(SelectorImpl.java:167)
	at org.mortbay.io.nio.SelectorManager$SelectSet.doSelect(SelectorManager.java:394)
	at org.mortbay.io.nio.SelectorManager.doSelect(SelectorManager.java:175)
	at org.mortbay.jetty.nio.SelectChannelConnector.accept(SelectChannelConnector.java:124)
	at org.mortbay.jetty.AbstractConnector$Acceptor.run(AbstractConnector.java:498)
	at org.mortbay.thread.BoundedThreadPool$PoolThread.run(BoundedThreadPool.java:442)
2007-08-02 19:19:47.039::WARN:  EXCEPTION 
java.lang.ArrayIndexOutOfBoundsException
	at org.apache.harmony.nio.internal.SelectorImpl.processSelectResult(SelectorImpl.java:259)
	at org.apache.harmony.nio.internal.SelectorImpl.selectInternal(SelectorImpl.java:199)
	at org.apache.harmony.nio.internal.SelectorImpl.select(SelectorImpl.java:167)
	at org.mortbay.io.nio.SelectorManager$SelectSet.doSelect(SelectorManager.java:394)
	at org.mortbay.io.nio.SelectorManager.doSelect(SelectorManager.java:175)
	at org.mortbay.jetty.nio.SelectChannelConnector.accept(SelectChannelConnector.java:124)
	at org.mortbay.jetty.AbstractConnector$Acceptor.run(AbstractConnector.java:498)
	at org.mortbay.thread.BoundedThreadPool$PoolThread.run(BoundedThreadPool.java:442)

================================================================================
BUILD FAILED:
	Ant Error Message:
/export/users/cc/cc-suites/scripts/cc-exec-adaptor.xml:101: The following error occurred while
executing this line: /export/users/cc/cc-suites/adaptors/JettyScenario/adaptor.xml:186: Jetty
scenario failed

Date of build:	08/02/2007 19:18:55
Time to build:	1 minute 27 seconds
Last changed:	08/02/2007 03:37:30
Last log entry:	snapshot

***********************************************************
Errors/Warnings:	(3)
            
The GC did not provide gc_add_weak_root_set_entry()
The execution FAILED with the following exception:
The following error occurred while executing this line:
/export/users/cc/cc-suites/adaptors/JettyScenario/adaptor.xml:186: Jetty scenario failed

***********************************************************
Unit Tests: (5)
        
failure: testStaticContent org.apache.harmony.test.jetty.JettyScenario
Unit Test Error Details:	(1)
                
Test: testStaticContentClass: org.apache.harmony.test.jetty.JettyScenariojunit.framework.AssertionFailedError:
Content is not correct.
	at org.apache.harmony.test.jetty.JettyScenario.testStaticContent(Unknown Source)
	at java.lang.reflect.VMReflection.invokeMethod(VMReflection.java)

***********************************************************
Modifications since last successful build:	(2)
            
add cc-snapshot log20070802033730Lbuild.8 08/02/2007 03:37:30snapshot
add cc-snapshot log20070730190130Lbuild.7 07/30/2007 19:01:30snapshot

begin 644 execution_log.zip
M4$L#! H    ( (V: C<Y*D9*PP$  $8#   2    97AE8W5T:6]N7VQO9RYH
M=&ULE5-1:]LP$'[WK[B7T0UB*X6N9)X;*&L[-O:TY"T$HTKG6)VL,]*Y2?;K
M)\4-S"T,)F1L^?1]=_?=7=5R9Y?5(^GCLNH]+BL)@8\6;RX:<IP'\QM+6,S?
M?;Y89KFBKC<6<]/D#E&C+K/,#Z[,(*T-JI:V<//W@ELM>R8/37R^(_-QI=!)
M;ZB$GX.#HDC8C4:+C%NX2V_C=B4(//3D60P!?1!*Q9V'P3 &\3@8JX7',%@.
M8D(JGM*IL+2;A+1BZ1/M& %$RF?TIQN;I\$9WJ987+I ?E?(7JH6BU;ZCMRQ
MB"ZY&'DGOB;X=8OP]0MHH\$10^_IV6B$G:JEUO4>Y:_:$W$=D&MT[(_O/TSQ
MT4F I"5\G,&#-':("99P.8-[[\G'S_D,UJ9#0"O[$*6'JWDQO[Z*V:@W5/^3
M!SS<?OMQ?Y>->(])]LCBI0NQ:!UP=%K"I_FB"]G8 A0PCUF:QBC)AE[5?\74
M]V_$SI)">$ U),2+3]@;;H&CI2%K:9]0>%#8CZSKJ2'I *34X#UJV+>Q$\^,
MT<RM"6"-PS+[1^_(L1U?M\W+[^+0V?)R<5V>8S]+U,2"H,XJ(9>5.(V)&$=&
MG.;G#U!+ 0(4 PH    ( (V: C<Y*D9*PP$  $8#   2              "D
M@0    !E>&5C=71I;VY?;&]G+FAT;6Q02P4&      $  0!     \P$     
 
end

Mime
View raw message