harmony-alerts mailing list archives

Site index · List index
Message view « Date » · « Thread »
Top « Date » · « Thread »
From nom...@intel.com
Subject [build-test alert] BUILD FAILED Linux x86: jedit_test
Date Wed, 01 Aug 2007 20:38:45 GMT
BUILD FAILED:
	Ant Error Message:
/export/users/cc/cc-suites/scripts/cc-exec-adaptor.xml:101: The following error occurred while
executing this line: /export/users/cc/cc-suites/adaptors/jedit_test/adaptor.xml:122: Some
of JEdit tests failed.

Date of build:	08/02/2007 03:38:00
Time to build:	38 seconds
Last changed:	08/02/2007 03:37:30
Last log entry:	snapshot

***********************************************************
Errors/Warnings:	(16)
            
Java Result: 1
Java Result: 1
[junit] Test org.apache.harmony.guitests.JEditLaunchTest FAILED
BUILD FAILED
/export/users/cc/cc-suites/tests/jedit_test/build.xml:118: if=test.not.passed
Total time: 11 seconds
[junit] Test org.apache.harmony.guitests.JEditFunctionalTest FAILED
BUILD FAILED
/export/users/cc/cc-suites/tests/jedit_test/build.xml:122: if=test.not.passed
Total time: 14 seconds
[junit] Test org.apache.harmony.guitests.JEditStressTest FAILED
BUILD FAILED
/export/users/cc/cc-suites/tests/jedit_test/build.xml:126: if=test.not.passed
Total time: 9 seconds
The execution FAILED with the following exception:
The following error occurred while executing this line:
/export/users/cc/cc-suites/adaptors/jedit_test/adaptor.xml:122: Some of JEdit tests failed.

***********************************************************
Unit Tests: (3)
        
error: /export/users/cc/cc-suites/tests/jedit_test/scripts/jedit_fn_00.xml org.apache.harmony.guitests.JEditFunctionalTest
error: /export/users/cc/cc-suites/tests/jedit_test/scripts/jedit_ln_00.xml org.apache.harmony.guitests.JEditLaunchTest
error: test org.apache.harmony.guitests.JEditStressTest
Unit Test Error Details:	(3)
                
Test: /export/users/cc/cc-suites/tests/jedit_test/scripts/jedit_fn_00.xmlClass: org.apache.harmony.guitests.JEditFunctionalTestjava.lang.NoSuchMethodError:
java/awt/Toolkit.getEventMonitor()Ljava/lang/Object; while resolving constant pool entry at
index 107 in class java/awt/EventQueueCore
	at java.awt.EventQueueCore.postEvent(EventQueueCore.java:91)
	at java.awt.EventQueue.postEvent(EventQueue.java:116)
	at java.awt.EventQueue.invokeAndWait(EventQueue.java:67)
	at abbot.util.AWT.invokeAndWait(AWT.java:96)
	at abbot.script.AppClassLoader$AppEventQueue.install(AppClassLoader.java:235)
	at abbot.script.AppClassLoader.install(AppClassLoader.java:185)
	at abbot.script.Launch.install(Launch.java:112)
	at abbot.script.Launch.runStep(Launch.java:180)
	at abbot.script.Step.run(Step.java:92)
	at abbot.script.StepRunner.runStep(StepRunner.java:277)
	at abbot.script.Sequence.runStep(Sequence.java:110)
	at abbot.script.Script.runStep(Script.java:499)
	at abbot.script.StepRunner.runStep(StepRunner.java:274)
	at abbot.script.StepRunner.run(StepRunner.java:194)
	at junit.extensions.abbot.ScriptFixture.runTest(ScriptFixture.java:60)
Test: /export/users/cc/cc-suites/tests/jedit_test/scripts/jedit_ln_00.xmlClass: org.apache.harmony.guitests.JEditLaunchTestjava.util.NoSuchElementException
	at java.util.LinkedList.getLast(LinkedList.java:476)
	at java.awt.EventQueueCore.pop(EventQueueCore.java:215)
	at java.awt.EventQueue.pop(EventQueue.java:140)
	at abbot.script.AppClassLoader$AppEventQueue.uninstall(AppClassLoader.java:250)
	at abbot.script.AppClassLoader.uninstall(AppClassLoader.java:206)
	at abbot.script.Launch.terminate(Launch.java:153)
	at abbot.script.StepRunner.terminate(StepRunner.java:341)
	at abbot.script.StepRunner.run(StepRunner.java:209)
	at junit.extensions.abbot.ScriptFixture.runTest(ScriptFixture.java:60)
Test: testClass: org.apache.harmony.guitests.JEditStressTestjava.util.NoSuchElementException
	at java.util.LinkedList.getLast(LinkedList.java:476)
	at java.awt.EventQueueCore.pop(EventQueueCore.java:215)
	at java.awt.EventQueue.pop(EventQueue.java:140)
	at abbot.script.AppClassLoader$AppEventQueue.uninstall(AppClassLoader.java:250)
	at abbot.script.AppClassLoader.uninstall(AppClassLoader.java:206)
	at abbot.script.Launch.terminate(Launch.java:153)
	at abbot.script.Fixture.terminate(Fixture.java:61)
	at abbot.script.StepRunner.terminate(StepRunner.java:341)
	at abbot.script.StepRunner.run(StepRunner.java:209)
	at junit.extensions.abbot.ScriptFixture.runTest(ScriptFixture.java:60)
	at org.apache.harmony.guitests.JEditStressTest$RepeatableScript.runTest(Unknown Source)
	at org.apache.harmony.guitests.JEditStressTest.test(Unknown Source)
	at java.lang.reflect.VMReflection.invokeMethod(VMReflection.java)

***********************************************************
Modifications since last successful build:	(3)
            
add cc-snapshot log20070802033730Lbuild.8 08/02/2007 03:37:30snapshot
add cc-snapshot log20070730190130Lbuild.7 07/30/2007 19:01:30snapshot
add cc-snapshot log20070724161215Lbuild.6 07/24/2007 16:12:15snapshot

begin 644 execution_log.zip
M4$L#! H    ( -0< C<T,"@6/ 0  /D=   2    97AE8W5T:6]N7VQO9RYH
M=&UL[5E+;^,V$#[7OX*7Q29 1/F1AZMZ VPW3K%!NH=-<@H"@Y9&-F.*5$DJ
ML?OK.Z2=AQ);=K(-X(,,0P]RYIO1<&;XV>J-;2:.>T.5S(Y[N8;C'B/&S@1\
M^9PJ:0/#_X6(=)N?_OA\W-"%C!K$?:YOV1V[(7\67"0I%R@R=)=TFHF20.DF
M,&"#7*OI+*H02L'&XR"!'&1BJ@2Y-)8)$=Q"PNW&@D$NBA&.;**@-$=1)@(V
M'*I*$SES3F\N'ZLLQ[#-]2!9KW#+].;"#_YO++A!M!<>TS'3F9(SZIVI4,"U
M+O(J0,/N8+$D*&NY'&V^VBZ+<M"6PPL==Y6   LWY,2=$98D7$-LE9Z14*8F
M1*1PK#((!1LF6@S^82'UJ"^1R'4V0=T;\DT#LY XH.@M&*6;6 "35$.NM'V;
MTS!U.F%A0)LPCO$;F();,*$ONA"3(IZHPIK0NS# &1O.#56E+$HP#0$PS-Q7
ME?TA/MTK/4&<#>.\K2;61A:#&0A6R)?U,;\L)+<WY&<AI0NITB/*<ER"I\H:
M>0^LH6=]M'GN@2YQ8"76Y1C(7]_PD1(BE258&W<\ 3**!RQ)!O? )@.ME!U@
MF0U 6CW;V5V-Y2P3EPZDM4=.&1>%QB(CS3W2UUIIX\<O>08$!,L-)!'IT-9!
M%PL^7HEZ)6-6C,:6P#2&W'(E"9<D8_QUUCWJ^.9%^U-N^P]*$?F:YX+'S", 
M3I$$),?EW&GO$ARZ'./R)M<.>.]@SYUN5N+_QNS"Q@_EK%Q 7&AN9W\SR4:@
MJ5][-[&S?-XA1OO-U:%T!MPH%4R.*"ZXQ:A1Y_7.P\T<XV!_4Y"+F;&0S3$6
MUQZBU5SCQ[,TLTH)0YFTU#(S22 U5/GH,D&]!CV[PJ-+!)>D^*0NCCLO![W=
M@Z/6;D4AC  EL=R"%5VOE'5O*05R^O7[>?^DA#?'FEM"1,VD297.B LT,IC#
M=F96N[JL7,M,Y^K[^<DRLQ4]Q+O^O',\<J2HU>I&A*=?W##%HL7MU& MK;9_
MJ7#W6SQ+J^6*3>&&71(YPR/Y":80%F464['*9]CU\.BZ38LXLD:L6M_ZM <J
MN=]N-H^"9C=HM@?-3J=;,\&:"=9,L&:"6TK3MH4)IKBSS+?7_X$-GCZ";34C
M[-+]=B4AW&S#+S_MLMWW#7QC#3\X:E7Q@U6+^*$<H=W^!8ZP7W.$DF#-$=;Y
M7W.$FB.L3MF:(WP@1S"X+YG7R?EV?G#A@;::&W1HY_"H_K>H_K?H/8SP*;\_
ME@WN=ZK8X+)R_5@F>/A^)OC[UA#!7]HBEI@0[+'-E3WO>,_->UWWN W7)V&*
M9>S;QWPMR3VW8V)Q)E5"J'MG[+%)15[EV83K@$3%V @T-IW[L8OF A&G[9@;
M(KB$J%'A)$M8C@$J^;<8>_J1<('<@JB4^!(A/I%(BLT8$MKHA>RX%_HWN^'\
M+6_H7_G^!U!+ 0(4 PH    ( -0< C<T,"@6/ 0  /D=   2            
M  "D@0    !E>&5C=71I;VY?;&]G+FAT;6Q02P4&      $  0!     ; 0 
#     
end

Mime
View raw message