harmony-alerts mailing list archives

Site index · List index
Message view « Date » · « Thread »
Top « Date » · « Thread »
From nom...@intel.com
Subject [build-test alert] BUILD FAILED Windows 2003 x86: stress
Date Wed, 01 Aug 2007 20:29:36 GMT
BUILD FAILED:
	Ant Error Message:
C:\cc\cc-suites\scripts\cc-exec-adaptor.xml:101: The following error occurred while executing
this line: C:\cc\cc-suites\adaptors\stress\adaptor.xml:100: The following error occurred while
executing this line: C:\cc\cc-suites\adaptors\stress\adaptor.xml:116: The following error
occurred while executing this line: C:\cc\cc-suites\scripts\framework.xml:1069: Java returned:
1

Date of build:	08/02/2007 03:05:31
Time to build:	24 minutes 1 second
Last changed:	08/01/2007 21:44:56
Last log entry:	snapshot

***********************************************************
Errors/Warnings:	(4)
            
BUILD FAILED
C:\cc\cc-suites\tests\stress\qa\build.xml:169: Java returned: -1
Total time: 23 minutes 59 seconds
The execution FAILED with the following exception:
The following error occurred while executing this line:
C:\cc\cc-suites\adaptors\stress\adaptor.xml:100: The following error occurred while executing
this line:
C:\cc\cc-suites\adaptors\stress\adaptor.xml:116: The following error occurred while executing
this line:
C:\cc\cc-suites\scripts\framework.xml:1069: Java returned: 1

***********************************************************
Unit Tests: (193)
        
error: test stress.org.apache.harmony.test.stress.classloader.MixThreads.MethodArgs.testMethodArgs2
error: test stress.org.apache.harmony.test.stress.exceptions.catcher.StackUnwindingTests.StackUnwindingTest5
error: test stress.org.apache.harmony.test.stress.gc.frag.FragmentationSimpleTest2.FragmentationSimpleTest2
Unit Test Error Details:	(3)
                
Test: testClass: stress.org.apache.harmony.test.stress.classloader.MixThreads.MethodArgs.testMethodArgs2TestHarness:ExecUnit
runProc(): Timeout!!!. The test hung (not finished in 180 second).

java version "1.5.0" 
pre-alpha : not complete or compatible
svn = r561336, (Aug  1 2007), Windows/ia32/msvc 1310, release build
http://harmony.apache.org

The GC did not provide gc_add_weak_root_set_entry()


Apache Harmony Launcher : (c) Copyright 1991, 2006 The Apache Software Foundation or its licensors,
as applicable.
[debug] started null(org.apache.harmony.test.share.stress.ReliabilityRunner)
[debug] timeToWork = 30, timeToAbort = 30
[debug] started null(org.apache.harmony.test.share.stress.generator.Thread)
[debug] Thread.setContext  { org.apache.harmony.test.stress.classloader.MixThreads.MethodArgs.testMethodArgs
{} }
[debug] Starting 1 threads
[debug] ThreadToRun.run()
[debug] completed null(org.apache.harmony.test.share.stress.generator.Thread)
[debug] Generator.execute()
[debug] class = org.apache.harmony.test.stress.classloader.MixThreads.MethodArgs.testMethodArgs...
Test: testClass: stress.org.apache.harmony.test.stress.exceptions.catcher.StackUnwindingTests.StackUnwindingTest5java
version "1.5.0" 
pre-alpha : not complete or compatible
svn = r561336, (Aug  1 2007), Windows/ia32/msvc 1310, release build
http://harmony.apache.org

The GC did not provide gc_add_weak_root_set_entry()


Apache Harmony Launcher : (c) Copyright 1991, 2006 The Apache Software Foundation or its licensors,
as applicable.
[debug] started null(org.apache.harmony.test.share.stress.ReliabilityRunner)
[debug] timeToWork = 30, timeToAbort = 30
[debug] started null(org.apache.harmony.test.share.stress.generator.Thread)
[debug] Thread.setContext  { generator.Thread { generator.Loop { org.apache.harmony.test.stress.gc.padder.BigObjectPadder{}
}} generator.Thread { org.apache.harmony.test.stress.exceptions.thrower.NullPointerExceptionThrower{}
generator.Loop { org.apache.harmony.test.stress.exceptions.catcher.StackUnwinding{} } } }
[debug] Starting 1 threads
[debug] ThreadToRun.run()
[debug] completed null(org.apache.harmony.test.share.stress.generator.Thread)
[debug] Gen...
Test: testClass: stress.org.apache.harmony.test.stress.gc.frag.FragmentationSimpleTest2.FragmentationSimpleTest2java
version "1.5.0" 
pre-alpha : not complete or compatible
svn = r561336, (Aug  1 2007), Windows/ia32/msvc 1310, release build
http://harmony.apache.org

The GC did not provide gc_add_weak_root_set_entry()


Apache Harmony Launcher : (c) Copyright 1991, 2006 The Apache Software Foundation or its licensors,
as applicable.
[debug] started null(org.apache.harmony.test.share.stress.ReliabilityRunner)
[debug] timeToWork = 30, timeToAbort = 30
[debug] started null(org.apache.harmony.test.share.stress.generator.Thread)
[debug] Thread.setContext  { org.apache.harmony.test.stress.gc.frag.share.FragmentationSimpleTest
{} }
[debug] Starting 1 threads
[debug] ThreadToRun.run()
[debug] completed null(org.apache.harmony.test.share.stress.generator.Thread)
[debug] Generator.execute()
[debug] class = org.apache.harmony.test.stress.gc.frag.share.FragmentationSimpleTest
[debug] org.apache.harmony.test.stress.gc.frag.share.FragmentationSimpleTest { }
[debug] started test(org.ap...

***********************************************************
Modifications since last successful build:	(5)
            
add cc-snapshot log20070801214456Lbuild.6 08/01/2007 21:44:56snapshot
add cc-snapshot log20070726133349Lbuild.5 07/26/2007 13:33:49snapshot
add cc-snapshot log20070719184806Lbuild.4 07/19/2007 18:48:06snapshot
add cc-snapshot log20070712185838Lbuild.3 07/12/2007 18:58:38snapshot
add cc-snapshot log20070712142711Lbuild.2 07/12/2007 14:27:11snapshot

begin 644 execution_log.zip
M4$L#! H    ( +$; C>L* @CSPH  %B*   2    97AE8W5T:6]N7VQO9RYH
M=&ULW9U_4]LX&L?_AIF^!\W.W2R=:>,X(0%\+#,TA"M=?G02NMS-T6&$K20J
MMNQ*,B%[L^_])#DF<;!#Z+2G)V5:8DNR_-%7S_-8DAVS/Y)1>+!_&P>3@_V$
MDX-]C(2<A.2W7P<QDV\%_9-X:+?^]W_\>O!JDZ?,>[6)$/I/0$(BR6=TI#\I
M&R)W;Q<-:$@$&O X0AWOVO?5O[<BI9*(Z]N4AL$U)R(-I;@64FT)4Y.JZPN^
MQY_1.UU"U^ A4[CV$(7%$L4]?T3\NYH?LP$=>L6L;)OXH_@SZI@"*<>2QLQ#
M^<^8LAN*FXV;2-S[U4?_<9;!H+_]]SZ:GNPO#P7D-AU6'W5)A"0!^J RD)),
MTHBH"J1)K4T3_EK"K'\6!'0,AF,:':=2.(+A1(QBZ8R".^>+_L^)<TN9HZNK
MD0=26OT#\3^CPP2K>M![S*.83= I3IG:Y\A#6_YK)5@RX70XDJI+]]PWJ%&O
MM]&E*C\]K!\/Y!AS@H[CE 5&5A1S1*5 (?4)$S$7;Q 6"">)2L"W(:E5L^@4
M=$^XT-7\XM9:M?HOJ+JXLM"W.$Q&6,&R6"(_CA)MB)I ;RL<=;[JX\4]0[\A
MWFJ[S6;[#=HZ3(<(N;J-.Z_?H"O*@G@L'&T8CC8,Y#;=^AO$E9%C03)3J*Y\
M)&7B.<XHT[6&C5ZUF"^Q%-4'3'D"\N>MU/B1,IA1EEGS!\,76LNUMK7<S:Z_
M8D=5H?_?$';_U*_F*^L^^&$:D!SAJS8EDU(+J9#? R.O3Y]AF7\K/ZF9XTO/
MF6UKL]1ET%2J1TNB M5KVG+K+;>-ML[P!+GMS)9?+ZE.537M$>\,4[:A&+9>
M>ZC#"58VYA=#R<7O+ZA)2,QE?\(Z(\P8"76M?9V$Q$0Y'X^9BK,JI)E,I!J0
MQ"IO3_VL=HXCRH^5\1*^,5 ?NG;E"B,D8R0(YO[(J"2T+!W/\7UG%E=,AI-U
MD:.Z2'#?I#DOE^G2G&-,5&P0RF-\%>VT2FA+QA*'*IPT5]3^B J%KV.2KOHT
M]K$1K.FUO.U=U$L9"G5:S1RD&ZG]+Y7JRJ'.L=HI^C+FI$?$H?CP:0,'0<Z/
MQBIRJ9.BJ2+*>YW,D7._SM299N.$FH#KT#A/4K:B^D$XJJ?Y(>=XTC,)B_M7
M7,G/^^88<V*T]?&PW^\>K:C1CV_ 1YJ08 H_MPT?7+&I$<F4?'X'&GJ(V5!1
M#YS^38\,E-\PG^CZ;NIN21(@6CT&*"$N2X9-W:A(MD3MAUB(,#:&>T8?+D?:
MI%4HB9FZ?C#Y,8Y#4[[S\322MJ1]$20P)8\I"0.AN$SAQSU@4E90 M/R%/,A
MZ>B\<QP1<T0QZ:8'3-<5B-=.XZNUT_@*F,9GF$T,W70T/+</3-LEI- T)7(4
M!X=\. 5]W(6F:!6GUK/;ZUWT &%J[\DO"H44D*)6T@(SU7Z:G# Y>'2HZ3XP
M32LHUT/+YEI0;L.BO.2$S ?[N7U@MKF$%)A]7O&8#>=1S[N=4U4*F*!5F-#5
MO%H+,:_62$M@D;."$D+D/(_U\KH_6KX< 1!T3:;1WX -P<5>C@UB0OT-V"]6
MN_(NB^MZS=:3VRSFODZ$&1Z20-]ST<\"H.8N&(F63(X!=FCEQ!,L:^5\#B Q
MX#G=BJ@08^>2<3Y VJI!]#J@7JT9*03'NF DHUR7H<E+@$&LF<^ (5^]%BDA
M7[=FK/WT=G'P,DL"1@KVVCJ#A'VIFG'"C?S/,D+H\!5F_&N""2&^%S !/RFQ
M"B<X/==DF6<=UWC6<8'GAZ_N_&AFX$]-K,H*3U?(3TZ\9%EHW7C!6<+2*0% 
M6K#3@G59;UN%$\(-P54X(=P27'7Q$IR-?L\'*JKO\K2\1G.UNSP[;1BZ0'Y\
M8R50<%%F7>;V@!_B6(437-0&]B '>?!)HK]5J9"S8.7T)?;O/K$Q90%EPQ,F
M:$!.&)6Z=K$TUZW_#*UH_0R-:/\,C=B!V@@]W+JX_4)\*<I:L9!M*U9^YV: 
M#5$O:P98HRIC-U%UW8!;=K[!\<V\:V<1NY: A[XSX'CH'*M?$6'2O([AGYUC
MRG!(_S3?X&TNS83$W<,LB",3GRLS8/(V*S,@\?:I?D',#,Y])ALR>_N9;,CL
M>\]DPV.OM!:@=E(20^8R[%P,G\$M-6B@IEQIQ/#,-WN?19G]SN5 (BXQ77 7
MOI)+GN6+740BYXQ$,9]D;&H;%%$[)[+HS9JH'^$PU.\QG&V=$ZMSFF?!+%K^
M<C#+QE4-9FM9X%DP6^MXU6#?9/F5MY$:KK>]O=IM)-?=!B0!/!^#Z6"6O2M1
M1^LE"8V3K9^]Q^'@HTFU',.?HD'"NJ3Y@B,TP69D]JF^,.I@/DSUH$XXA_F6
MJ<DF$<<3C:,_[,NS"&/K!ELIC:TX7@ICZVI?"F-KW%T*8VN*K&',R(23@7#,
MP$5-@0V2K05LC23T<GJVJ&[;OQ=1;#K4(HNMX5 9BZU!4 D+(%D J6(S^"Z@
MV R]"R@V Z\P+U_.W\AL?213@F,WV#W!L>O83W#L>M03'+M>]03'UAW["AQK
MPYDDP,Z78)PXPB<,<QH[W3^ZYY?UNNMT[]5L2M=9M_8F\&J\QCR>M4!0B;<W
MCV<MBC_%.^X=GG5UYQYS'!%PG3O%:\SC >K<*5YS'L]:U'^*=]8]N^C]6_?N
M[$;.-W1O]7+QMM=LK[A<W&I 4:-14 .0->6 S0(@0'O:+@!:FS14 [8*@-8&
M/M6 [0*@M:%0->!. =#:X*@$\.1?W2,3TN@#"<!=L*9XC7D\0"'FXMV';N=2
M>W"V9@_.@W/ 5@$0D ?G@.T"(" /S@%W"H" /#@'W"T  IKPY(![!4! @_;+
M][WNH0F"V5? P$7!'+!1  04!W/ 9@$0T% K!]PN  (*U#E@JP (*%#G@.T"
M(*! G0/N%  !!>H<<+< ""A0YX![!4!X@=JMSP/:N^->#5BXDKCPKB1NX4IB
M[:YF1(7O=' 8ZG?XF.,M<IB;0A?WA _">&P=9L+\'O%3\Q=[;<-<82K/8TD'
M$XLD,G^GBMD]89)PGB9F,.FP^.+BK*L^^A?=L@+6QG(K0(^I'%5AV_++(O:'
MF!H3=/P1IJQ,[+P$$)W+@8M"/R(#TSC,_C+O,I%M#0I7(JY0V=8XL<C<#PE)
MJB+&8R80*WX"6Y1VAOO]7GO4V/-6?5Q]KVY3FE0DA 65/3G+!M*7TU?+N V#
M7)(&@K)XG2]3ME@"B+CEV$5O60!_L<N<J0N)=I8<6&1N87SAXO?J.J0I*V.)
MPXU6W:TNB%"B7S@4;"SU+(0&F(:JU-(R:@01\XV-YK(RXHXFB:JH65_R5VH0
M2MD=B\=LV?F.8D9JJ$\(DB.C".(DB;E$E)F4@'+BJWZ?5%>QT?$<WU?_WHJ4
M*LF<VY2&@:,Z+@VEF/;Z\HX2B#RH\;+^ZB&2-"+>1KWN-9K>=@-A%J!=MQ$M
MJT%W4'8<:C111%FJ,%!K%PGBQRQ8.+2X]^[3R>D1.CX\.>T>%7,ZWK7O7S\V
MZ]I8PW76G.NO^-HTL_80A9[;WO/0!W60$D^FRN8"#[UUEYVU"GEOAKQYJ>2?
MR9(1(NT8IF,&<:AF.I0-T>-K+CQSR%R&MB04^VHBPE7T'X^4\>4UJFPYH@*%
ME!'OU>9B6W& $]7KC\V=[F>M57V#_C]G<MO?\4S"YS11/3C0CR>,8WXW;4U)
MY[F;KS;W'7RP[R2<J-^W<3!1'R,9A0?_ U!+ 0(4 PH    ( +$; C>L* @C
MSPH  %B*   2              "D@0    !E>&5C=71I;VY?;&]G+FAT;6Q0
52P4&      $  0!     _PH      
end

Mime
View raw message