harmony-alerts mailing list archives

Site index · List index
Message view « Date » · « Thread »
Top « Date » · « Thread »
From nom...@intel.com
Subject [build-test alert] BUILD FAILED Linux x86: stress
Date Wed, 01 Aug 2007 19:56:19 GMT
BUILD FAILED:
	Ant Error Message:
/export/users/cc/cc-suites/scripts/cc-exec-adaptor.xml:101: The following error occurred while executing this line: /export/users/cc/cc-suites/adaptors/stress/adaptor.xml:100: The following error occurred while executing this line: /export/users/cc/cc-suites/adaptors/stress/adaptor.xml:116: The following error occurred while executing this line: /export/users/cc/cc-suites/scripts/framework.xml:1069: Java returned: 1

Date of build:	08/02/2007 01:09:15
Time to build:	106 minutes 51 seconds
Last changed:	07/30/2007 19:01:30
Last log entry:	snapshot

***********************************************************
Errors/Warnings:	(4)
            
BUILD FAILED
/export/users/cc/cc-suites/tests/stress/qa/build.xml:169: Java returned: 255
Total time: 106 minutes 48 seconds
The execution FAILED with the following exception:
The following error occurred while executing this line:
/export/users/cc/cc-suites/adaptors/stress/adaptor.xml:100: The following error occurred while executing this line:
/export/users/cc/cc-suites/adaptors/stress/adaptor.xml:116: The following error occurred while executing this line:
/export/users/cc/cc-suites/scripts/framework.xml:1069: Java returned: 1

***********************************************************
Unit Tests: (193)
        
error: test stress.org.apache.harmony.test.stress.classloader.MixThreads.ConstantPool.testCPLmt1
error: test stress.org.apache.harmony.test.stress.classloader.MixThreads.ConstantPool.testCPLmt2
error: test stress.org.apache.harmony.test.stress.classloader.MixThreads.FieldsLmt.testFieldsLmt1
error: test stress.org.apache.harmony.test.stress.classloader.MixThreads.FieldsLmt.testFieldsLmt2
error: test stress.org.apache.harmony.test.stress.classloader.MixThreads.LargeClassName.testLargeClassName_W1
error: test stress.org.apache.harmony.test.stress.classloader.MixThreads.SupIntf.testManySupIntf4
error: test stress.org.apache.harmony.test.stress.classloader.MixThreads.WrongClasses.testNECLoad1
error: test stress.org.apache.harmony.test.stress.classloader.MixThreads.WrongClasses.testNECLoad2
error: test stress.org.apache.harmony.test.stress.classloader.MixThreads.WrongClasses.testWCLoad1
error: test stress.org.apache.harmony.test.stress.classloader.MixThreads.WrongClasses.testWCLoad2
error: test stress.org.apache.harmony.test.stress.classloader.NotSynchThreads.ConstantPool.testCPLmt
error: test stress.org.apache.harmony.test.stress.classloader.NotSynchThreads.SupIntf.testManySupIntf1
error: test stress.org.apache.harmony.test.stress.classloader.NotSynchThreads.SupIntf.testManySupIntf2
error: test stress.org.apache.harmony.test.stress.classloader.NotSynchThreads.WrongClasses.testNECLoad
error: test stress.org.apache.harmony.test.stress.classloader.NotSynchThreads.WrongClasses.testWCLoad
error: test stress.org.apache.harmony.test.stress.classloader.OneThread.MethodArgs.testMethodArgs
error: test stress.org.apache.harmony.test.stress.classloader.OneThread.SubClasses.testManySubClasses
error: test stress.org.apache.harmony.test.stress.classloader.OneThread.SupIntf.testManySupIntf1
error: test stress.org.apache.harmony.test.stress.classloader.OneThread.WrongClasses.testWCLoad
error: test stress.org.apache.harmony.test.stress.classloader.SynchThreads.ConstantPool.testCPLmt1
error: test stress.org.apache.harmony.test.stress.classloader.SynchThreads.ConstantPool.testCPLmt2
error: test stress.org.apache.harmony.test.stress.classloader.SynchThreads.FieldsLmt.testFieldsLmt1
error: test stress.org.apache.harmony.test.stress.classloader.SynchThreads.FieldsLmt.testFieldsLmt2
error: test stress.org.apache.harmony.test.stress.classloader.SynchThreads.LargeClassName.testLargeClassName_R1
error: test stress.org.apache.harmony.test.stress.classloader.SynchThreads.LargeClassName.testLargeClassName_W1
error: test stress.org.apache.harmony.test.stress.classloader.SynchThreads.MethodArgs.testMethodArgs1
error: test stress.org.apache.harmony.test.stress.classloader.SynchThreads.SupIntf.testManySupIntf1
error: test stress.org.apache.harmony.test.stress.classloader.SynchThreads.SupIntf.testManySupIntf2
error: test stress.org.apache.harmony.test.stress.classloader.SynchThreads.SupIntf.testManySupIntf3
error: test stress.org.apache.harmony.test.stress.classloader.SynchThreads.SupIntf.testManySupIntf4
error: test stress.org.apache.harmony.test.stress.classloader.SynchThreads.WrongClasses.testNECLoad1
error: test stress.org.apache.harmony.test.stress.classloader.SynchThreads.WrongClasses.testNECLoad2
error: test stress.org.apache.harmony.test.stress.classloader.SynchThreads.WrongClasses.testWCLoad1
error: test stress.org.apache.harmony.test.stress.classloader.SynchThreads.WrongClasses.testWCLoad2
error: test stress.org.apache.harmony.test.stress.gc.frag.FragmentationGCFinalizeTest3.FragmentationGCFinalizeTest3
error: test stress.org.apache.harmony.test.stress.gc.frag.FragmentationSimpleTest2.FragmentationSimpleTest2
error: test stress.org.apache.harmony.test.stress.jni.stack.StackTest12
error: test stress.org.apache.harmony.test.stress.jni.stack.StackTest3
error: test stress.org.apache.harmony.test.stress.jni.stack.StackTest4
error: test stress.org.apache.harmony.test.stress.jni.strings.StringsTest1
error: test stress.org.apache.harmony.test.stress.jni.strings.StringsTest2
error: test stress.org.apache.harmony.test.stress.jni.strings.StringsTest3
error: test stress.org.apache.harmony.test.stress.jpda.jdwp.scenario.THREAD001.ThreadTest001
error: test stress.org.apache.harmony.test.stress.misc.WaitNotifyTest
error: test stress.org.apache.harmony.test.stress.threads.StressThreads12Test.StressThreads12Test
Unit Test Error Details:	(45)
                
Test: testClass: stress.org.apache.harmony.test.stress.classloader.MixThreads.ConstantPool.testCPLmt1java version "1.5.0" 
pre-alpha : not complete or compatible
svn = r560888, (Jul 30 2007), Linux/ia32/gcc 3.3.3, release build
http://harmony.apache.org
The GC did not provide gc_add_weak_root_set_entry()

Apache Harmony Launcher : (c) Copyright 1991, 2006 The Apache Software Foundation or its licensors, as applicable.
[debug] started null(org.apache.harmony.test.share.stress.ReliabilityRunner)
[debug] timeToWork = 30, timeToAbort = 30
[debug] started null(org.apache.harmony.test.share.stress.generator.Thread)
[debug] Thread.setContext  { org.apache.harmony.test.stress.classloader.MixThreads.ConstantPool.testCPLmt {} }
[debug] Starting 1 threads
[debug] ThreadToRun.run()
[debug] completed null(org.apache.harmony.test.share.stress.generator.Thread)
[debug] Generator.execute()
[debug] class = org.apache.harmony.test.stress.classloader.MixThreads.ConstantPool.testCPLmt
[debug] org.apache.harmony.test.stress.classloader.MixThreads.ConstantPool.testCPLmt { }
[debug] started test(or...
Test: testClass: stress.org.apache.harmony.test.stress.classloader.MixThreads.ConstantPool.testCPLmt2java version "1.5.0" 
pre-alpha : not complete or compatible
svn = r560888, (Jul 30 2007), Linux/ia32/gcc 3.3.3, release build
http://harmony.apache.org
The GC did not provide gc_add_weak_root_set_entry()

Apache Harmony Launcher : (c) Copyright 1991, 2006 The Apache Software Foundation or its licensors, as applicable.
[debug] started null(org.apache.harmony.test.share.stress.ReliabilityRunner)
[debug] timeToWork = 30, timeToAbort = 30
[debug] started null(org.apache.harmony.test.share.stress.generator.Thread)
[debug] Thread.setContext  { org.apache.harmony.test.stress.classloader.MixThreads.ConstantPool.testCPLmt {} }
[debug] Starting 1 threads
[debug] ThreadToRun.run()
[debug] completed null(org.apache.harmony.test.share.stress.generator.Thread)
[debug] Generator.execute()
[debug] class = org.apache.harmony.test.stress.classloader.MixThreads.ConstantPool.testCPLmt
[debug] org.apache.harmony.test.stress.classloader.MixThreads.ConstantPool.testCPLmt { }
[debug] started test(or...
Test: testClass: stress.org.apache.harmony.test.stress.classloader.MixThreads.FieldsLmt.testFieldsLmt1java version "1.5.0" 
pre-alpha : not complete or compatible
svn = r560888, (Jul 30 2007), Linux/ia32/gcc 3.3.3, release build
http://harmony.apache.org
The GC did not provide gc_add_weak_root_set_entry()

Apache Harmony Launcher : (c) Copyright 1991, 2006 The Apache Software Foundation or its licensors, as applicable.
[debug] started null(org.apache.harmony.test.share.stress.ReliabilityRunner)
[debug] timeToWork = 30, timeToAbort = 30
[debug] started null(org.apache.harmony.test.share.stress.generator.Thread)
[debug] Thread.setContext  { org.apache.harmony.test.stress.classloader.MixThreads.FieldsLmt.testFieldsLmt {} }
[debug] Starting 1 threads
[debug] ThreadToRun.run()
[debug] completed null(org.apache.harmony.test.share.stress.generator.Thread)
[debug] Generator.execute()
[debug] class = org.apache.harmony.test.stress.classloader.MixThreads.FieldsLmt.testFieldsLmt
[debug] org.apache.harmony.test.stress.classloader.MixThreads.FieldsLmt.testFieldsLmt { }
[debug] started test...
Test: testClass: stress.org.apache.harmony.test.stress.classloader.MixThreads.FieldsLmt.testFieldsLmt2java version "1.5.0" 
pre-alpha : not complete or compatible
svn = r560888, (Jul 30 2007), Linux/ia32/gcc 3.3.3, release build
http://harmony.apache.org
The GC did not provide gc_add_weak_root_set_entry()

Apache Harmony Launcher : (c) Copyright 1991, 2006 The Apache Software Foundation or its licensors, as applicable.
[debug] started null(org.apache.harmony.test.share.stress.ReliabilityRunner)
[debug] timeToWork = 30, timeToAbort = 30
[debug] started null(org.apache.harmony.test.share.stress.generator.Thread)
[debug] Thread.setContext  { org.apache.harmony.test.stress.classloader.MixThreads.FieldsLmt.testFieldsLmt {} }
[debug] Starting 1 threads
[debug] ThreadToRun.run()
[debug] completed null(org.apache.harmony.test.share.stress.generator.Thread)
[debug] Generator.execute()
[debug] class = org.apache.harmony.test.stress.classloader.MixThreads.FieldsLmt.testFieldsLmt
[debug] org.apache.harmony.test.stress.classloader.MixThreads.FieldsLmt.testFieldsLmt { }
[debug] started test...
Test: testClass: stress.org.apache.harmony.test.stress.classloader.MixThreads.LargeClassName.testLargeClassName_W1java version "1.5.0" 
pre-alpha : not complete or compatible
svn = r560888, (Jul 30 2007), Linux/ia32/gcc 3.3.3, release build
http://harmony.apache.org
The GC did not provide gc_add_weak_root_set_entry()

Apache Harmony Launcher : (c) Copyright 1991, 2006 The Apache Software Foundation or its licensors, as applicable.
[debug] started null(org.apache.harmony.test.share.stress.ReliabilityRunner)
[debug] timeToWork = 30, timeToAbort = 30
[debug] started null(org.apache.harmony.test.share.stress.generator.Thread)
[debug] Thread.setContext  { org.apache.harmony.test.stress.classloader.MixThreads.LargeClassName.testLCN {} }
[debug] Starting 1 threads
[debug] ThreadToRun.run()
[debug] completed null(org.apache.harmony.test.share.stress.generator.Thread)
[debug] Generator.execute()
[debug] class = org.apache.harmony.test.stress.classloader.MixThreads.LargeClassName.testLCN
[debug] org.apache.harmony.test.stress.classloader.MixThreads.LargeClassName.testLCN { }
[debug] started test(or...
Test: testClass: stress.org.apache.harmony.test.stress.classloader.MixThreads.SupIntf.testManySupIntf4java version "1.5.0" 
pre-alpha : not complete or compatible
svn = r560888, (Jul 30 2007), Linux/ia32/gcc 3.3.3, release build
http://harmony.apache.org
The GC did not provide gc_add_weak_root_set_entry()

Apache Harmony Launcher : (c) Copyright 1991, 2006 The Apache Software Foundation or its licensors, as applicable.
[debug] started null(org.apache.harmony.test.share.stress.ReliabilityRunner)
[debug] timeToWork = 30, timeToAbort = 30
[debug] started null(org.apache.harmony.test.share.stress.generator.Thread)
[debug] Thread.setContext  { org.apache.harmony.test.stress.classloader.MixThreads.SupIntf.testManySupIntf2 {} }
[debug] Starting 1 threads
[debug] ThreadToRun.run()
[debug] completed null(org.apache.harmony.test.share.stress.generator.Thread)
[debug] Generator.execute()
[debug] class = org.apache.harmony.test.stress.classloader.MixThreads.SupIntf.testManySupIntf2
[debug] org.apache.harmony.test.stress.classloader.MixThreads.SupIntf.testManySupIntf2 { }
[debug] started t...
Test: testClass: stress.org.apache.harmony.test.stress.classloader.MixThreads.WrongClasses.testNECLoad1java version "1.5.0" 
pre-alpha : not complete or compatible
svn = r560888, (Jul 30 2007), Linux/ia32/gcc 3.3.3, release build
http://harmony.apache.org
The GC did not provide gc_add_weak_root_set_entry()

Apache Harmony Launcher : (c) Copyright 1991, 2006 The Apache Software Foundation or its licensors, as applicable.
[debug] started null(org.apache.harmony.test.share.stress.ReliabilityRunner)
[debug] timeToWork = 30, timeToAbort = 30
[debug] started null(org.apache.harmony.test.share.stress.generator.Thread)
[debug] Thread.setContext  { org.apache.harmony.test.stress.classloader.MixThreads.WrongClasses.testNECLoad_MT {} }
[debug] Starting 1 threads
[debug] ThreadToRun.run()
[debug] completed null(org.apache.harmony.test.share.stress.generator.Thread)
[debug] Generator.execute()
[debug] class = org.apache.harmony.test.stress.classloader.MixThreads.WrongClasses.testNECLoad_MT
[debug] org.apache.harmony.test.stress.classloader.MixThreads.WrongClasses.testNECLoad_MT { }
[debug] ...
Test: testClass: stress.org.apache.harmony.test.stress.classloader.MixThreads.WrongClasses.testNECLoad2java version "1.5.0" 
pre-alpha : not complete or compatible
svn = r560888, (Jul 30 2007), Linux/ia32/gcc 3.3.3, release build
http://harmony.apache.org
The GC did not provide gc_add_weak_root_set_entry()

Apache Harmony Launcher : (c) Copyright 1991, 2006 The Apache Software Foundation or its licensors, as applicable.
[debug] started null(org.apache.harmony.test.share.stress.ReliabilityRunner)
[debug] timeToWork = 30, timeToAbort = 30
[debug] started null(org.apache.harmony.test.share.stress.generator.Thread)
[debug] Thread.setContext  { org.apache.harmony.test.stress.classloader.MixThreads.WrongClasses.testNECLoad_MT {} }
[debug] Starting 1 threads
[debug] ThreadToRun.run()
[debug] completed null(org.apache.harmony.test.share.stress.generator.Thread)
[debug] Generator.execute()
[debug] class = org.apache.harmony.test.stress.classloader.MixThreads.WrongClasses.testNECLoad_MT
[debug] org.apache.harmony.test.stress.classloader.MixThreads.WrongClasses.testNECLoad_MT { }
[debug] ...
Test: testClass: stress.org.apache.harmony.test.stress.classloader.MixThreads.WrongClasses.testWCLoad1java version "1.5.0" 
pre-alpha : not complete or compatible
svn = r560888, (Jul 30 2007), Linux/ia32/gcc 3.3.3, release build
http://harmony.apache.org
The GC did not provide gc_add_weak_root_set_entry()

Apache Harmony Launcher : (c) Copyright 1991, 2006 The Apache Software Foundation or its licensors, as applicable.
[debug] started null(org.apache.harmony.test.share.stress.ReliabilityRunner)
[debug] timeToWork = 30, timeToAbort = 30
[debug] started null(org.apache.harmony.test.share.stress.generator.Thread)
[debug] Thread.setContext  { org.apache.harmony.test.stress.classloader.MixThreads.WrongClasses.testWCLoad_MT {} }
[debug] Starting 1 threads
[debug] ThreadToRun.run()
[debug] completed null(org.apache.harmony.test.share.stress.generator.Thread)
[debug] Generator.execute()
[debug] class = org.apache.harmony.test.stress.classloader.MixThreads.WrongClasses.testWCLoad_MT
[debug] org.apache.harmony.test.stress.classloader.MixThreads.WrongClasses.testWCLoad_MT { }
[debug] sta...
Test: testClass: stress.org.apache.harmony.test.stress.classloader.MixThreads.WrongClasses.testWCLoad2java version "1.5.0" 
pre-alpha : not complete or compatible
svn = r560888, (Jul 30 2007), Linux/ia32/gcc 3.3.3, release build
http://harmony.apache.org
The GC did not provide gc_add_weak_root_set_entry()

Apache Harmony Launcher : (c) Copyright 1991, 2006 The Apache Software Foundation or its licensors, as applicable.
[debug] started null(org.apache.harmony.test.share.stress.ReliabilityRunner)
[debug] timeToWork = 30, timeToAbort = 30
[debug] started null(org.apache.harmony.test.share.stress.generator.Thread)
[debug] Thread.setContext  { org.apache.harmony.test.stress.classloader.MixThreads.WrongClasses.testWCLoad_MT {} }
[debug] Starting 1 threads
[debug] ThreadToRun.run()
[debug] completed null(org.apache.harmony.test.share.stress.generator.Thread)
[debug] Generator.execute()
[debug] class = org.apache.harmony.test.stress.classloader.MixThreads.WrongClasses.testWCLoad_MT
[debug] org.apache.harmony.test.stress.classloader.MixThreads.WrongClasses.testWCLoad_MT { }
[debug] sta...
Test: testClass: stress.org.apache.harmony.test.stress.classloader.NotSynchThreads.ConstantPool.testCPLmtjava version "1.5.0" 
pre-alpha : not complete or compatible
svn = r560888, (Jul 30 2007), Linux/ia32/gcc 3.3.3, release build
http://harmony.apache.org
The GC did not provide gc_add_weak_root_set_entry()

Apache Harmony Launcher : (c) Copyright 1991, 2006 The Apache Software Foundation or its licensors, as applicable.
[debug] started null(org.apache.harmony.test.share.stress.ReliabilityRunner)
[debug] timeToWork = 30, timeToAbort = 30
[debug] started null(org.apache.harmony.test.share.stress.generator.Thread)
[debug] Thread.setContext  { org.apache.harmony.test.stress.classloader.NotSynchThreads.ConstantPool.testCPLmt {} }
[debug] Starting 1 threads
[debug] ThreadToRun.run()
[debug] completed null(org.apache.harmony.test.share.stress.generator.Thread)
[debug] Generator.execute()
[debug] class = org.apache.harmony.test.stress.classloader.NotSynchThreads.ConstantPool.testCPLmt
[debug] org.apache.harmony.test.stress.classloader.NotSynchThreads.ConstantPool.testCPLmt { }
[debug] ...
Test: testClass: stress.org.apache.harmony.test.stress.classloader.NotSynchThreads.SupIntf.testManySupIntf1java version "1.5.0" 
pre-alpha : not complete or compatible
svn = r560888, (Jul 30 2007), Linux/ia32/gcc 3.3.3, release build
http://harmony.apache.org
The GC did not provide gc_add_weak_root_set_entry()

Apache Harmony Launcher : (c) Copyright 1991, 2006 The Apache Software Foundation or its licensors, as applicable.
[debug] started null(org.apache.harmony.test.share.stress.ReliabilityRunner)
[debug] timeToWork = 30, timeToAbort = 30
[debug] started null(org.apache.harmony.test.share.stress.generator.Thread)
[debug] Thread.setContext  { org.apache.harmony.test.stress.classloader.NotSynchThreads.SupIntf.testManySupIntf1 {} }
[debug] Starting 1 threads
[debug] ThreadToRun.run()
[debug] completed null(org.apache.harmony.test.share.stress.generator.Thread)
[debug] Generator.execute()
[debug] class = org.apache.harmony.test.stress.classloader.NotSynchThreads.SupIntf.testManySupIntf1
[debug] org.apache.harmony.test.stress.classloader.NotSynchThreads.SupIntf.testManySupIntf1 { }
[d...
Test: testClass: stress.org.apache.harmony.test.stress.classloader.NotSynchThreads.SupIntf.testManySupIntf2java version "1.5.0" 
pre-alpha : not complete or compatible
svn = r560888, (Jul 30 2007), Linux/ia32/gcc 3.3.3, release build
http://harmony.apache.org
The GC did not provide gc_add_weak_root_set_entry()

Apache Harmony Launcher : (c) Copyright 1991, 2006 The Apache Software Foundation or its licensors, as applicable.
[debug] started null(org.apache.harmony.test.share.stress.ReliabilityRunner)
[debug] timeToWork = 30, timeToAbort = 30
[debug] started null(org.apache.harmony.test.share.stress.generator.Thread)
[debug] Thread.setContext  { org.apache.harmony.test.stress.classloader.NotSynchThreads.SupIntf.testManySupIntf2 {} }
[debug] Starting 1 threads
[debug] ThreadToRun.run()
[debug] completed null(org.apache.harmony.test.share.stress.generator.Thread)
[debug] Generator.execute()
[debug] class = org.apache.harmony.test.stress.classloader.NotSynchThreads.SupIntf.testManySupIntf2
[debug] org.apache.harmony.test.stress.classloader.NotSynchThreads.SupIntf.testManySupIntf2 { }
[d...
Test: testClass: stress.org.apache.harmony.test.stress.classloader.NotSynchThreads.WrongClasses.testNECLoadjava version "1.5.0" 
pre-alpha : not complete or compatible
svn = r560888, (Jul 30 2007), Linux/ia32/gcc 3.3.3, release build
http://harmony.apache.org
The GC did not provide gc_add_weak_root_set_entry()

Apache Harmony Launcher : (c) Copyright 1991, 2006 The Apache Software Foundation or its licensors, as applicable.
[debug] started null(org.apache.harmony.test.share.stress.ReliabilityRunner)
[debug] timeToWork = 30, timeToAbort = 30
[debug] started null(org.apache.harmony.test.share.stress.generator.Thread)
[debug] Thread.setContext  { org.apache.harmony.test.stress.classloader.NotSynchThreads.WrongClasses.testNECLoad_NST {} }
[debug] Starting 1 threads
[debug] ThreadToRun.run()
[debug] completed null(org.apache.harmony.test.share.stress.generator.Thread)
[debug] Generator.execute()
[debug] class = org.apache.harmony.test.stress.classloader.NotSynchThreads.WrongClasses.testNECLoad_NST
[debug] org.apache.harmony.test.stress.classloader.NotSynchThreads.WrongClasses.testNECLoa...
Test: testClass: stress.org.apache.harmony.test.stress.classloader.NotSynchThreads.WrongClasses.testWCLoadjava version "1.5.0" 
pre-alpha : not complete or compatible
svn = r560888, (Jul 30 2007), Linux/ia32/gcc 3.3.3, release build
http://harmony.apache.org
The GC did not provide gc_add_weak_root_set_entry()

Apache Harmony Launcher : (c) Copyright 1991, 2006 The Apache Software Foundation or its licensors, as applicable.
[debug] started null(org.apache.harmony.test.share.stress.ReliabilityRunner)
[debug] timeToWork = 30, timeToAbort = 30
[debug] started null(org.apache.harmony.test.share.stress.generator.Thread)
[debug] Thread.setContext  { org.apache.harmony.test.stress.classloader.NotSynchThreads.WrongClasses.testWCLoad_NST {} }
[debug] Starting 1 threads
[debug] ThreadToRun.run()
[debug] completed null(org.apache.harmony.test.share.stress.generator.Thread)
[debug] Generator.execute()
[debug] class = org.apache.harmony.test.stress.classloader.NotSynchThreads.WrongClasses.testWCLoad_NST
[debug] org.apache.harmony.test.stress.classloader.NotSynchThreads.WrongClasses.testWCLoad_N...
Test: testClass: stress.org.apache.harmony.test.stress.classloader.OneThread.MethodArgs.testMethodArgsjava version "1.5.0" 
pre-alpha : not complete or compatible
svn = r560888, (Jul 30 2007), Linux/ia32/gcc 3.3.3, release build
http://harmony.apache.org
The GC did not provide gc_add_weak_root_set_entry()

Apache Harmony Launcher : (c) Copyright 1991, 2006 The Apache Software Foundation or its licensors, as applicable.
[debug] started null(org.apache.harmony.test.share.stress.ReliabilityRunner)
[debug] timeToWork = 30, timeToAbort = 30
[debug] started null(org.apache.harmony.test.share.stress.generator.Thread)
[debug] Thread.setContext  { org.apache.harmony.test.stress.classloader.share.MethodArgs.testMethodArgs_R {} }
[debug] Starting 1 threads
[debug] ThreadToRun.run()
[debug] completed null(org.apache.harmony.test.share.stress.generator.Thread)
[debug] Generator.execute()
[debug] class = org.apache.harmony.test.stress.classloader.share.MethodArgs.testMethodArgs_R
[debug] org.apache.harmony.test.stress.classloader.share.MethodArgs.testMethodArgs_R { }
[debug] started test(or...
Test: testClass: stress.org.apache.harmony.test.stress.classloader.OneThread.SubClasses.testManySubClassesjava version "1.5.0" 
pre-alpha : not complete or compatible
svn = r560888, (Jul 30 2007), Linux/ia32/gcc 3.3.3, release build
http://harmony.apache.org
The GC did not provide gc_add_weak_root_set_entry()

Apache Harmony Launcher : (c) Copyright 1991, 2006 The Apache Software Foundation or its licensors, as applicable.
[debug] started null(org.apache.harmony.test.share.stress.ReliabilityRunner)
[debug] timeToWork = 30, timeToAbort = 30
[debug] started null(org.apache.harmony.test.share.stress.generator.Thread)
[debug] Thread.setContext  { org.apache.harmony.test.stress.classloader.OneThread.SubClasses.testManySubClasses {} }
[debug] Starting 1 threads
[debug] ThreadToRun.run()
[debug] completed null(org.apache.harmony.test.share.stress.generator.Thread)
[debug] Generator.execute()
[debug] class = org.apache.harmony.test.stress.classloader.OneThread.SubClasses.testManySubClasses
[debug] org.apache.harmony.test.stress.classloader.OneThread.SubClasses.testManySubClasses { }
[debu...
Test: testClass: stress.org.apache.harmony.test.stress.classloader.OneThread.SupIntf.testManySupIntf1java version "1.5.0" 
pre-alpha : not complete or compatible
svn = r560888, (Jul 30 2007), Linux/ia32/gcc 3.3.3, release build
http://harmony.apache.org
The GC did not provide gc_add_weak_root_set_entry()

Apache Harmony Launcher : (c) Copyright 1991, 2006 The Apache Software Foundation or its licensors, as applicable.
[debug] started null(org.apache.harmony.test.share.stress.ReliabilityRunner)
[debug] timeToWork = 30, timeToAbort = 30
[debug] started null(org.apache.harmony.test.share.stress.generator.Thread)
[debug] Thread.setContext  { org.apache.harmony.test.stress.classloader.OneThread.SupIntf.testManySupIntf1 {} }
[debug] Starting 1 threads
[debug] ThreadToRun.run()
[debug] completed null(org.apache.harmony.test.share.stress.generator.Thread)
[debug] Generator.execute()
[debug] class = org.apache.harmony.test.stress.classloader.OneThread.SupIntf.testManySupIntf1
[debug] org.apache.harmony.test.stress.classloader.OneThread.SupIntf.testManySupIntf1 { }
[debug] started test...
Test: testClass: stress.org.apache.harmony.test.stress.classloader.OneThread.WrongClasses.testWCLoadjava version "1.5.0" 
pre-alpha : not complete or compatible
svn = r560888, (Jul 30 2007), Linux/ia32/gcc 3.3.3, release build
http://harmony.apache.org
The GC did not provide gc_add_weak_root_set_entry()

Apache Harmony Launcher : (c) Copyright 1991, 2006 The Apache Software Foundation or its licensors, as applicable.
[debug] started null(org.apache.harmony.test.share.stress.ReliabilityRunner)
[debug] timeToWork = 30, timeToAbort = 30
[debug] started null(org.apache.harmony.test.share.stress.generator.Thread)
[debug] Thread.setContext  { org.apache.harmony.test.stress.classloader.OneThread.WrongClasses.testWCLoad {} }
[debug] Starting 1 threads
[debug] ThreadToRun.run()
[debug] completed null(org.apache.harmony.test.share.stress.generator.Thread)
[debug] Generator.execute()
[debug] class = org.apache.harmony.test.stress.classloader.OneThread.WrongClasses.testWCLoad
[debug] org.apache.harmony.test.stress.classloader.OneThread.WrongClasses.testWCLoad { }
[debug] started test(or...
Test: testClass: stress.org.apache.harmony.test.stress.classloader.SynchThreads.ConstantPool.testCPLmt1java version "1.5.0" 
pre-alpha : not complete or compatible
svn = r560888, (Jul 30 2007), Linux/ia32/gcc 3.3.3, release build
http://harmony.apache.org
The GC did not provide gc_add_weak_root_set_entry()

Apache Harmony Launcher : (c) Copyright 1991, 2006 The Apache Software Foundation or its licensors, as applicable.
[debug] started null(org.apache.harmony.test.share.stress.ReliabilityRunner)
[debug] timeToWork = 30, timeToAbort = 30
[debug] started null(org.apache.harmony.test.share.stress.generator.Thread)
[debug] Thread.setContext  { org.apache.harmony.test.stress.classloader.SynchThreads.ConstantPool.testCPLmt {} }
[debug] Starting 1 threads
[debug] ThreadToRun.run()
[debug] completed null(org.apache.harmony.test.share.stress.generator.Thread)
[debug] Generator.execute()
[debug] class = org.apache.harmony.test.stress.classloader.SynchThreads.ConstantPool.testCPLmt
[debug] org.apache.harmony.test.stress.classloader.SynchThreads.ConstantPool.testCPLmt { }
[debug] started t...
Test: testClass: stress.org.apache.harmony.test.stress.classloader.SynchThreads.ConstantPool.testCPLmt2java version "1.5.0" 
pre-alpha : not complete or compatible
svn = r560888, (Jul 30 2007), Linux/ia32/gcc 3.3.3, release build
http://harmony.apache.org
The GC did not provide gc_add_weak_root_set_entry()

Apache Harmony Launcher : (c) Copyright 1991, 2006 The Apache Software Foundation or its licensors, as applicable.
[debug] started null(org.apache.harmony.test.share.stress.ReliabilityRunner)
[debug] timeToWork = 30, timeToAbort = 30
[debug] started null(org.apache.harmony.test.share.stress.generator.Thread)
[debug] Thread.setContext  { org.apache.harmony.test.stress.classloader.SynchThreads.ConstantPool.testCPLmt {} }
[debug] Starting 1 threads
[debug] ThreadToRun.run()
[debug] completed null(org.apache.harmony.test.share.stress.generator.Thread)
[debug] Generator.execute()
[debug] class = org.apache.harmony.test.stress.classloader.SynchThreads.ConstantPool.testCPLmt
[debug] org.apache.harmony.test.stress.classloader.SynchThreads.ConstantPool.testCPLmt { }
[debug] started t...
Test: testClass: stress.org.apache.harmony.test.stress.classloader.SynchThreads.FieldsLmt.testFieldsLmt1java version "1.5.0" 
pre-alpha : not complete or compatible
svn = r560888, (Jul 30 2007), Linux/ia32/gcc 3.3.3, release build
http://harmony.apache.org
The GC did not provide gc_add_weak_root_set_entry()

Apache Harmony Launcher : (c) Copyright 1991, 2006 The Apache Software Foundation or its licensors, as applicable.
[debug] started null(org.apache.harmony.test.share.stress.ReliabilityRunner)
[debug] timeToWork = 30, timeToAbort = 30
[debug] started null(org.apache.harmony.test.share.stress.generator.Thread)
[debug] Thread.setContext  { org.apache.harmony.test.stress.classloader.SynchThreads.FieldsLmt.testFieldsLmt {} }
[debug] Starting 1 threads
[debug] ThreadToRun.run()
[debug] completed null(org.apache.harmony.test.share.stress.generator.Thread)
[debug] Generator.execute()
[debug] class = org.apache.harmony.test.stress.classloader.SynchThreads.FieldsLmt.testFieldsLmt
[debug] org.apache.harmony.test.stress.classloader.SynchThreads.FieldsLmt.testFieldsLmt { }
[debug] starte...
Test: testClass: stress.org.apache.harmony.test.stress.classloader.SynchThreads.FieldsLmt.testFieldsLmt2java version "1.5.0" 
pre-alpha : not complete or compatible
svn = r560888, (Jul 30 2007), Linux/ia32/gcc 3.3.3, release build
http://harmony.apache.org
The GC did not provide gc_add_weak_root_set_entry()

Apache Harmony Launcher : (c) Copyright 1991, 2006 The Apache Software Foundation or its licensors, as applicable.
[debug] started null(org.apache.harmony.test.share.stress.ReliabilityRunner)
[debug] timeToWork = 30, timeToAbort = 30
[debug] started null(org.apache.harmony.test.share.stress.generator.Thread)
[debug] Thread.setContext  { org.apache.harmony.test.stress.classloader.SynchThreads.FieldsLmt.testFieldsLmt {} }
[debug] Starting 1 threads
[debug] ThreadToRun.run()
[debug] Generator.execute()
[debug] completed null(org.apache.harmony.test.share.stress.generator.Thread)
[debug] class = org.apache.harmony.test.stress.classloader.SynchThreads.FieldsLmt.testFieldsLmt
[debug] org.apache.harmony.test.stress.classloader.SynchThreads.FieldsLmt.testFieldsLmt { }
[debug] starte...
Test: testClass: stress.org.apache.harmony.test.stress.classloader.SynchThreads.LargeClassName.testLargeClassName_R1java version "1.5.0" 
pre-alpha : not complete or compatible
svn = r560888, (Jul 30 2007), Linux/ia32/gcc 3.3.3, release build
http://harmony.apache.org
The GC did not provide gc_add_weak_root_set_entry()

Apache Harmony Launcher : (c) Copyright 1991, 2006 The Apache Software Foundation or its licensors, as applicable.
[debug] started null(org.apache.harmony.test.share.stress.ReliabilityRunner)
[debug] timeToWork = 30, timeToAbort = 30
[debug] started null(org.apache.harmony.test.share.stress.generator.Thread)
[debug] Thread.setContext  { org.apache.harmony.test.stress.classloader.SynchThreads.LargeClassName.testLCN {} }
[debug] Starting 1 threads
[debug] ThreadToRun.run()
[debug] completed null(org.apache.harmony.test.share.stress.generator.Thread)
[debug] Generator.execute()
[debug] class = org.apache.harmony.test.stress.classloader.SynchThreads.LargeClassName.testLCN
[debug] org.apache.harmony.test.stress.classloader.SynchThreads.LargeClassName.testLCN { }
[debug] started t...
Test: testClass: stress.org.apache.harmony.test.stress.classloader.SynchThreads.LargeClassName.testLargeClassName_W1java version "1.5.0" 
pre-alpha : not complete or compatible
svn = r560888, (Jul 30 2007), Linux/ia32/gcc 3.3.3, release build
http://harmony.apache.org
The GC did not provide gc_add_weak_root_set_entry()

Apache Harmony Launcher : (c) Copyright 1991, 2006 The Apache Software Foundation or its licensors, as applicable.
[debug] started null(org.apache.harmony.test.share.stress.ReliabilityRunner)
[debug] timeToWork = 30, timeToAbort = 30
[debug] started null(org.apache.harmony.test.share.stress.generator.Thread)
[debug] Thread.setContext  { org.apache.harmony.test.stress.classloader.SynchThreads.LargeClassName.testLCN {} }
[debug] Starting 1 threads
[debug] ThreadToRun.run()
[debug] completed null(org.apache.harmony.test.share.stress.generator.Thread)
[debug] Generator.execute()
[debug] class = org.apache.harmony.test.stress.classloader.SynchThreads.LargeClassName.testLCN
[debug] org.apache.harmony.test.stress.classloader.SynchThreads.LargeClassName.testLCN { }
[debug] started t...
Test: testClass: stress.org.apache.harmony.test.stress.classloader.SynchThreads.MethodArgs.testMethodArgs1java version "1.5.0" 
pre-alpha : not complete or compatible
svn = r560888, (Jul 30 2007), Linux/ia32/gcc 3.3.3, release build
http://harmony.apache.org
The GC did not provide gc_add_weak_root_set_entry()

Apache Harmony Launcher : (c) Copyright 1991, 2006 The Apache Software Foundation or its licensors, as applicable.
[debug] started null(org.apache.harmony.test.share.stress.ReliabilityRunner)
[debug] timeToWork = 30, timeToAbort = 30
[debug] started null(org.apache.harmony.test.share.stress.generator.Thread)
[debug] Thread.setContext  { org.apache.harmony.test.stress.classloader.SynchThreads.MethodArgs.testMethodArgs {} }
[debug] Starting 1 threads
[debug] ThreadToRun.run()
[debug] completed null(org.apache.harmony.test.share.stress.generator.Thread)
[debug] Generator.execute()
[debug] class = org.apache.harmony.test.stress.classloader.SynchThreads.MethodArgs.testMethodArgs
[debug] org.apache.harmony.test.stress.classloader.SynchThreads.MethodArgs.testMethodArgs { }
[debug] ...
Test: testClass: stress.org.apache.harmony.test.stress.classloader.SynchThreads.SupIntf.testManySupIntf1java version "1.5.0" 
pre-alpha : not complete or compatible
svn = r560888, (Jul 30 2007), Linux/ia32/gcc 3.3.3, release build
http://harmony.apache.org
The GC did not provide gc_add_weak_root_set_entry()

Apache Harmony Launcher : (c) Copyright 1991, 2006 The Apache Software Foundation or its licensors, as applicable.
[debug] started null(org.apache.harmony.test.share.stress.ReliabilityRunner)
[debug] timeToWork = 30, timeToAbort = 30
[debug] started null(org.apache.harmony.test.share.stress.generator.Thread)
[debug] Thread.setContext  { org.apache.harmony.test.stress.classloader.SynchThreads.SupIntf.testManySupIntf1 {} }
[debug] Starting 1 threads
[debug] ThreadToRun.run()
[debug] completed null(org.apache.harmony.test.share.stress.generator.Thread)
[debug] Generator.execute()
[debug] class = org.apache.harmony.test.stress.classloader.SynchThreads.SupIntf.testManySupIntf1
[debug] org.apache.harmony.test.stress.classloader.SynchThreads.SupIntf.testManySupIntf1 { }
[debug] sta...
Test: testClass: stress.org.apache.harmony.test.stress.classloader.SynchThreads.SupIntf.testManySupIntf2java version "1.5.0" 
pre-alpha : not complete or compatible
svn = r560888, (Jul 30 2007), Linux/ia32/gcc 3.3.3, release build
http://harmony.apache.org
The GC did not provide gc_add_weak_root_set_entry()

Apache Harmony Launcher : (c) Copyright 1991, 2006 The Apache Software Foundation or its licensors, as applicable.
[debug] started null(org.apache.harmony.test.share.stress.ReliabilityRunner)
[debug] timeToWork = 30, timeToAbort = 30
[debug] started null(org.apache.harmony.test.share.stress.generator.Thread)
[debug] Thread.setContext  { org.apache.harmony.test.stress.classloader.SynchThreads.SupIntf.testManySupIntf1 {} }
[debug] Starting 1 threads
[debug] ThreadToRun.run()
[debug] completed null(org.apache.harmony.test.share.stress.generator.Thread)
[debug] Generator.execute()
[debug] class = org.apache.harmony.test.stress.classloader.SynchThreads.SupIntf.testManySupIntf1
[debug] org.apache.harmony.test.stress.classloader.SynchThreads.SupIntf.testManySupIntf1 { }
[debug] sta...
Test: testClass: stress.org.apache.harmony.test.stress.classloader.SynchThreads.SupIntf.testManySupIntf3java version "1.5.0" 
pre-alpha : not complete or compatible
svn = r560888, (Jul 30 2007), Linux/ia32/gcc 3.3.3, release build
http://harmony.apache.org
The GC did not provide gc_add_weak_root_set_entry()

Apache Harmony Launcher : (c) Copyright 1991, 2006 The Apache Software Foundation or its licensors, as applicable.
[debug] started null(org.apache.harmony.test.share.stress.ReliabilityRunner)
[debug] timeToWork = 30, timeToAbort = 30
[debug] started null(org.apache.harmony.test.share.stress.generator.Thread)
[debug] Thread.setContext  { org.apache.harmony.test.stress.classloader.SynchThreads.SupIntf.testManySupIntf2 {} }
[debug] Starting 1 threads
[debug] completed null(org.apache.harmony.test.share.stress.generator.Thread)
[debug] ThreadToRun.run()
[debug] Generator.execute()
[debug] class = org.apache.harmony.test.stress.classloader.SynchThreads.SupIntf.testManySupIntf2
[debug] org.apache.harmony.test.stress.classloader.SynchThreads.SupIntf.testManySupIntf2 { }
[debug] sta...
Test: testClass: stress.org.apache.harmony.test.stress.classloader.SynchThreads.SupIntf.testManySupIntf4java version "1.5.0" 
pre-alpha : not complete or compatible
svn = r560888, (Jul 30 2007), Linux/ia32/gcc 3.3.3, release build
http://harmony.apache.org
The GC did not provide gc_add_weak_root_set_entry()

Apache Harmony Launcher : (c) Copyright 1991, 2006 The Apache Software Foundation or its licensors, as applicable.
[debug] started null(org.apache.harmony.test.share.stress.ReliabilityRunner)
[debug] timeToWork = 30, timeToAbort = 30
[debug] started null(org.apache.harmony.test.share.stress.generator.Thread)
[debug] Thread.setContext  { org.apache.harmony.test.stress.classloader.SynchThreads.SupIntf.testManySupIntf2 {} }
[debug] Starting 1 threads
[debug] ThreadToRun.run()
[debug] completed null(org.apache.harmony.test.share.stress.generator.Thread)
[debug] Generator.execute()
[debug] class = org.apache.harmony.test.stress.classloader.SynchThreads.SupIntf.testManySupIntf2
[debug] org.apache.harmony.test.stress.classloader.SynchThreads.SupIntf.testManySupIntf2 { }
[debug] sta...
Test: testClass: stress.org.apache.harmony.test.stress.classloader.SynchThreads.WrongClasses.testNECLoad1java version "1.5.0" 
pre-alpha : not complete or compatible
svn = r560888, (Jul 30 2007), Linux/ia32/gcc 3.3.3, release build
http://harmony.apache.org
The GC did not provide gc_add_weak_root_set_entry()

Apache Harmony Launcher : (c) Copyright 1991, 2006 The Apache Software Foundation or its licensors, as applicable.
[debug] started null(org.apache.harmony.test.share.stress.ReliabilityRunner)
[debug] timeToWork = 30, timeToAbort = 30
[debug] started null(org.apache.harmony.test.share.stress.generator.Thread)
[debug] Thread.setContext  { org.apache.harmony.test.stress.classloader.SynchThreads.WrongClasses.testNECLoad_ST {} }
[debug] Starting 1 threads
[debug] ThreadToRun.run()
[debug] Generator.execute()
[debug] class = org.apache.harmony.test.stress.classloader.SynchThreads.WrongClasses.testNECLoad_ST
[debug] completed null(org.apache.harmony.test.share.stress.generator.Thread)
[debug] org.apache.harmony.test.stress.classloader.SynchThreads.WrongClasses.testNECLoad_ST { }
[d...
Test: testClass: stress.org.apache.harmony.test.stress.classloader.SynchThreads.WrongClasses.testNECLoad2java version "1.5.0" 
pre-alpha : not complete or compatible
svn = r560888, (Jul 30 2007), Linux/ia32/gcc 3.3.3, release build
http://harmony.apache.org
The GC did not provide gc_add_weak_root_set_entry()

Apache Harmony Launcher : (c) Copyright 1991, 2006 The Apache Software Foundation or its licensors, as applicable.
[debug] started null(org.apache.harmony.test.share.stress.ReliabilityRunner)
[debug] timeToWork = 30, timeToAbort = 30
[debug] started null(org.apache.harmony.test.share.stress.generator.Thread)
[debug] Thread.setContext  { org.apache.harmony.test.stress.classloader.SynchThreads.WrongClasses.testNECLoad_ST {} }
[debug] Starting 1 threads
[debug] ThreadToRun.run()
[debug] Generator.execute()
[debug] class = org.apache.harmony.test.stress.classloader.SynchThreads.WrongClasses.testNECLoad_ST
[debug] org.apache.harmony.test.stress.classloader.SynchThreads.WrongClasses.testNECLoad_ST { }
[debug] completed null(org.apache.harmony.test.share.stress.generator.Thread)
[d...
Test: testClass: stress.org.apache.harmony.test.stress.classloader.SynchThreads.WrongClasses.testWCLoad1java version "1.5.0" 
pre-alpha : not complete or compatible
svn = r560888, (Jul 30 2007), Linux/ia32/gcc 3.3.3, release build
http://harmony.apache.org
The GC did not provide gc_add_weak_root_set_entry()

Apache Harmony Launcher : (c) Copyright 1991, 2006 The Apache Software Foundation or its licensors, as applicable.
[debug] started null(org.apache.harmony.test.share.stress.ReliabilityRunner)
[debug] timeToWork = 30, timeToAbort = 30
[debug] started null(org.apache.harmony.test.share.stress.generator.Thread)
[debug] Thread.setContext  { org.apache.harmony.test.stress.classloader.SynchThreads.WrongClasses.testWCLoad_ST {} }
[debug] Starting 1 threads
[debug] ThreadToRun.run()
[debug] completed null(org.apache.harmony.test.share.stress.generator.Thread)
[debug] Generator.execute()
[debug] class = org.apache.harmony.test.stress.classloader.SynchThreads.WrongClasses.testWCLoad_ST
[debug] org.apache.harmony.test.stress.classloader.SynchThreads.WrongClasses.testWCLoad_ST { }
[debu...
Test: testClass: stress.org.apache.harmony.test.stress.classloader.SynchThreads.WrongClasses.testWCLoad2java version "1.5.0" 
pre-alpha : not complete or compatible
svn = r560888, (Jul 30 2007), Linux/ia32/gcc 3.3.3, release build
http://harmony.apache.org
The GC did not provide gc_add_weak_root_set_entry()

Apache Harmony Launcher : (c) Copyright 1991, 2006 The Apache Software Foundation or its licensors, as applicable.
[debug] started null(org.apache.harmony.test.share.stress.ReliabilityRunner)
[debug] timeToWork = 30, timeToAbort = 30
[debug] started null(org.apache.harmony.test.share.stress.generator.Thread)
[debug] Thread.setContext  { org.apache.harmony.test.stress.classloader.SynchThreads.WrongClasses.testWCLoad_ST {} }
[debug] Starting 1 threads
[debug] ThreadToRun.run()
[debug] completed null(org.apache.harmony.test.share.stress.generator.Thread)
[debug] Generator.execute()
[debug] class = org.apache.harmony.test.stress.classloader.SynchThreads.WrongClasses.testWCLoad_ST
[debug] org.apache.harmony.test.stress.classloader.SynchThreads.WrongClasses.testWCLoad_ST { }
[debu...
Test: testClass: stress.org.apache.harmony.test.stress.gc.frag.FragmentationGCFinalizeTest3.FragmentationGCFinalizeTest3java version "1.5.0" 
pre-alpha : not complete or compatible
svn = r560888, (Jul 30 2007), Linux/ia32/gcc 3.3.3, release build
http://harmony.apache.org
The GC did not provide gc_add_weak_root_set_entry()

Apache Harmony Launcher : (c) Copyright 1991, 2006 The Apache Software Foundation or its licensors, as applicable.
[debug] started null(org.apache.harmony.test.share.stress.ReliabilityRunner)
[debug] timeToWork = 30, timeToAbort = 30
[debug] started null(org.apache.harmony.test.share.stress.generator.Thread)
[debug] Thread.setContext  { org.apache.harmony.test.stress.gc.frag.share.FragmentationGCFinalizeTest {} }
[debug] Starting 1 threads
[debug] ThreadToRun.run()
[debug] completed null(org.apache.harmony.test.share.stress.generator.Thread)
[debug] Generator.execute()
[debug] class = org.apache.harmony.test.stress.gc.frag.share.FragmentationGCFinalizeTest
[debug] org.apache.harmony.test.stress.gc.frag.share.FragmentationGCFinalizeTest { }
[debug] started test(org.apache.har...
Test: testClass: stress.org.apache.harmony.test.stress.gc.frag.FragmentationSimpleTest2.FragmentationSimpleTest2java version "1.5.0" 
pre-alpha : not complete or compatible
svn = r560888, (Jul 30 2007), Linux/ia32/gcc 3.3.3, release build
http://harmony.apache.org
The GC did not provide gc_add_weak_root_set_entry()

Apache Harmony Launcher : (c) Copyright 1991, 2006 The Apache Software Foundation or its licensors, as applicable.
[debug] started null(org.apache.harmony.test.share.stress.ReliabilityRunner)
[debug] timeToWork = 30, timeToAbort = 30
[debug] started null(org.apache.harmony.test.share.stress.generator.Thread)
[debug] Thread.setContext  { org.apache.harmony.test.stress.gc.frag.share.FragmentationSimpleTest {} }
[debug] Starting 1 threads
[debug] ThreadToRun.run()
[debug] completed null(org.apache.harmony.test.share.stress.generator.Thread)
[debug] Generator.execute()
[debug] class = org.apache.harmony.test.stress.gc.frag.share.FragmentationSimpleTest
[debug] org.apache.harmony.test.stress.gc.frag.share.FragmentationSimpleTest { }
[debug] started test(org.apache.harmony.test.st...
Test: testClass: stress.org.apache.harmony.test.stress.jni.stack.StackTest12java version "1.5.0" 
pre-alpha : not complete or compatible
svn = r560888, (Jul 30 2007), Linux/ia32/gcc 3.3.3, release build
http://harmony.apache.org
The GC did not provide gc_add_weak_root_set_entry()

Apache Harmony Launcher : (c) Copyright 1991, 2006 The Apache Software Foundation or its licensors, as applicable.
[debug] started null(org.apache.harmony.test.share.stress.ReliabilityRunner)
[debug] timeToWork = 30, timeToAbort = 30
[debug] started null(org.apache.harmony.test.share.stress.generator.Thread)
[debug] Thread.setContext  { org.apache.harmony.test.stress.jni.stack.StackTest12 {} }
[debug] Starting 1 threads
[debug] ThreadToRun.run()
[debug] completed null(org.apache.harmony.test.share.stress.generator.Thread)
[debug] Generator.execute()
[debug] class = org.apache.harmony.test.stress.jni.stack.StackTest12
[debug] org.apache.harmony.test.stress.jni.stack.StackTest12 { }
[debug] started test(org.apache.harmony.test.stress.jni.stack.StackTest12)
[debug] Main thread:...
Test: testClass: stress.org.apache.harmony.test.stress.jni.stack.StackTest3java version "1.5.0" 
pre-alpha : not complete or compatible
svn = r560888, (Jul 30 2007), Linux/ia32/gcc 3.3.3, release build
http://harmony.apache.org
The GC did not provide gc_add_weak_root_set_entry()

Apache Harmony Launcher : (c) Copyright 1991, 2006 The Apache Software Foundation or its licensors, as applicable.
[debug] started null(org.apache.harmony.test.share.stress.ReliabilityRunner)
[debug] timeToWork = 30, timeToAbort = 30
[debug] started null(org.apache.harmony.test.share.stress.generator.Thread)
[debug] Thread.setContext  { org.apache.harmony.test.stress.jni.stack.StackTest3 {} }
[debug] Starting 1 threads
[debug] ThreadToRun.run()
[debug] completed null(org.apache.harmony.test.share.stress.generator.Thread)
[debug] Generator.execute()
[debug] class = org.apache.harmony.test.stress.jni.stack.StackTest3
[debug] org.apache.harmony.test.stress.jni.stack.StackTest3 { }
[debug] started test(org.apache.harmony.test.stress.jni.stack.StackTest3)
Native code: Cannot get ...
Test: testClass: stress.org.apache.harmony.test.stress.jni.stack.StackTest4java version "1.5.0" 
pre-alpha : not complete or compatible
svn = r560888, (Jul 30 2007), Linux/ia32/gcc 3.3.3, release build
http://harmony.apache.org
The GC did not provide gc_add_weak_root_set_entry()

Apache Harmony Launcher : (c) Copyright 1991, 2006 The Apache Software Foundation or its licensors, as applicable.
[debug] started null(org.apache.harmony.test.share.stress.ReliabilityRunner)
[debug] timeToWork = 30, timeToAbort = 30
[debug] started null(org.apache.harmony.test.share.stress.generator.Thread)
[debug] Thread.setContext  { org.apache.harmony.test.stress.jni.stack.StackTest4 {} }
[debug] Starting 1 threads
[debug] ThreadToRun.run()
[debug] completed null(org.apache.harmony.test.share.stress.generator.Thread)
[debug] Generator.execute()
[debug] class = org.apache.harmony.test.stress.jni.stack.StackTest4
[debug] org.apache.harmony.test.stress.jni.stack.StackTest4 { }
[debug] started test(org.apache.harmony.test.stress.jni.stack.StackTest4)
[debug] Main thread: Pad...
Test: testClass: stress.org.apache.harmony.test.stress.jni.strings.StringsTest1java version "1.5.0" 
pre-alpha : not complete or compatible
svn = r560888, (Jul 30 2007), Linux/ia32/gcc 3.3.3, release build
http://harmony.apache.org
The GC did not provide gc_add_weak_root_set_entry()

Apache Harmony Launcher : (c) Copyright 1991, 2006 The Apache Software Foundation or its licensors, as applicable.
[debug] started null(org.apache.harmony.test.share.stress.ReliabilityRunner)
[debug] timeToWork = 30, timeToAbort = 30
[debug] started null(org.apache.harmony.test.share.stress.generator.Thread)
[debug] Thread.setContext  { org.apache.harmony.test.stress.jni.strings.StringsTest1 {} }
[debug] Starting 1 threads
[debug] ThreadToRun.run()
[debug] completed null(org.apache.harmony.test.share.stress.generator.Thread)
[debug] Generator.execute()
[debug] class = org.apache.harmony.test.stress.jni.strings.StringsTest1
[debug] org.apache.harmony.test.stress.jni.strings.StringsTest1 { }
[debug] started test(org.apache.harmony.test.stress.jni.strings.StringsTest1)
Native c...
Test: testClass: stress.org.apache.harmony.test.stress.jni.strings.StringsTest2java version "1.5.0" 
pre-alpha : not complete or compatible
svn = r560888, (Jul 30 2007), Linux/ia32/gcc 3.3.3, release build
http://harmony.apache.org
The GC did not provide gc_add_weak_root_set_entry()

Apache Harmony Launcher : (c) Copyright 1991, 2006 The Apache Software Foundation or its licensors, as applicable.
[debug] started null(org.apache.harmony.test.share.stress.ReliabilityRunner)
[debug] timeToWork = 30, timeToAbort = 30
[debug] started null(org.apache.harmony.test.share.stress.generator.Thread)
[debug] Thread.setContext  { org.apache.harmony.test.stress.jni.strings.StringsTest2 {} }
[debug] Starting 1 threads
[debug] ThreadToRun.run()
[debug] completed null(org.apache.harmony.test.share.stress.generator.Thread)
[debug] Generator.execute()
[debug] class = org.apache.harmony.test.stress.jni.strings.StringsTest2
[debug] org.apache.harmony.test.stress.jni.strings.StringsTest2 { }
[debug] started test(org.apache.harmony.test.stress.jni.strings.StringsTest2)
Native c...
Test: testClass: stress.org.apache.harmony.test.stress.jni.strings.StringsTest3java version "1.5.0" 
pre-alpha : not complete or compatible
svn = r560888, (Jul 30 2007), Linux/ia32/gcc 3.3.3, release build
http://harmony.apache.org
The GC did not provide gc_add_weak_root_set_entry()

Apache Harmony Launcher : (c) Copyright 1991, 2006 The Apache Software Foundation or its licensors, as applicable.
[debug] started null(org.apache.harmony.test.share.stress.ReliabilityRunner)
[debug] timeToWork = 30, timeToAbort = 30
[debug] started null(org.apache.harmony.test.share.stress.generator.Thread)
[debug] Thread.setContext  { org.apache.harmony.test.stress.jni.strings.StringsTest3 {} }
[debug] Starting 1 threads
[debug] ThreadToRun.run()
[debug] completed null(org.apache.harmony.test.share.stress.generator.Thread)
[debug] Generator.execute()
[debug] class = org.apache.harmony.test.stress.jni.strings.StringsTest3
[debug] org.apache.harmony.test.stress.jni.strings.StringsTest3 { }
[debug] started test(org.apache.harmony.test.stress.jni.strings.StringsTest3)
[debug] ...
Test: testClass: stress.org.apache.harmony.test.stress.jpda.jdwp.scenario.THREAD001.ThreadTest001TestHarness:ExecUnit	runProc(): Timeout!!!. The test hung (not finished in 180 second).

java version "1.5.0" 
pre-alpha : not complete or compatible
svn = r560888, (Jul 30 2007), Linux/ia32/gcc 3.3.3, release build
http://harmony.apache.org
02:44:50| Test: class org.apache.harmony.test.stress.jpda.jdwp.scenario.THREAD001.ThreadTest001
		test case(s) to run 1
02:44:50| Launching as a server listening on: nstdrlxl16:57486
02:44:50| Launching: /export/users/cc/cc-suites/build/checkouts/snapshot/hdk/jdk/jre/bin/java -cp "/export/users/cc/cc-suites/build/classes/stress/classes:/export/users/cc/cc-suites/build/results/stress/temp:/export/users/cc/cc-suites/build/classes/stress/classes:/export/users/cc/cc-suites/build/classes/stress/lib:/export/users/cc/cc-suites/build/libs/th.jar:/export/users/cc/cc-suites/build/libs/junit-3.8.2.jar" -agentlib:jdwp=transport=dt_socket,address=nstdrlxl16:57486,server=n -Dvm.assert_dialog=false -Djpda.settings.verbose=true org.apache.harmony.test.str...
Test: testClass: stress.org.apache.harmony.test.stress.misc.WaitNotifyTestjava version "1.5.0" 
pre-alpha : not complete or compatible
svn = r560888, (Jul 30 2007), Linux/ia32/gcc 3.3.3, release build
http://harmony.apache.org
The GC did not provide gc_add_weak_root_set_entry()

Apache Harmony Launcher : (c) Copyright 1991, 2006 The Apache Software Foundation or its licensors, as applicable.
[debug] started null(org.apache.harmony.test.share.stress.ReliabilityRunner)
[debug] timeToWork = 30, timeToAbort = 30
[debug] started null(org.apache.harmony.test.share.stress.generator.Thread)
[debug] Thread.setContext  { org.apache.harmony.test.stress.misc.WaitNotifyTest {} }
[debug] Starting 1 threads
[debug] ThreadToRun.run()
[debug] completed null(org.apache.harmony.test.share.stress.generator.Thread)
[debug] Generator.execute()
[debug] class = org.apache.harmony.test.stress.misc.WaitNotifyTest
[debug] org.apache.harmony.test.stress.misc.WaitNotifyTest { }
[debug] started test(org.apache.harmony.test.stress.misc.WaitNotifyTest)
[debug] i=0
[debug] i=1
[deb...
Test: testClass: stress.org.apache.harmony.test.stress.threads.StressThreads12Test.StressThreads12TestTestHarness:ExecUnit	runProc(): Timeout!!!. The test hung (not finished in 180 second).

java version "1.5.0" 
pre-alpha : not complete or compatible
svn = r560888, (Jul 30 2007), Linux/ia32/gcc 3.3.3, release build
http://harmony.apache.org

Apache Harmony Launcher : (c) Copyright 1991, 2006 The Apache Software Foundation or its licensors, as applicable.

***********************************************************
Modifications since last successful build:	(7)
            
add cc-snapshot log20070730190130Lbuild.7 07/30/2007 19:01:30snapshot
add cc-snapshot log20070724161215Lbuild.6 07/24/2007 16:12:15snapshot
add cc-snapshot log20070720152501Lbuild.5 07/20/2007 15:25:01snapshot
add cc-snapshot log20070719194303Lbuild.4 07/19/2007 19:43:03snapshot
add cc-snapshot log20070713091307Lbuild.3 07/13/2007 09:13:07snapshot
add cc-snapshot log20070712133841Lbuild.2 07/12/2007 13:38:41snapshot
add cc-snapshot log20070706021248Lbuild.1 07/06/2007 02:12:48snapshot

begin 644 execution_log.zip
M4$L#! H    (  47 C=/EP0:] H  **)   2    97AE8W5T:6]N7VQO9RYH
M=&ULU9W]4]LX&L=_IG^%9N=NELZTL9TWB(]EAD*XPO+22>AR-S<=1MA*(G!D
M5Y*![,W^[R?),;%#')(N>WI""[$E6_KHJT>/WI)X;R3'T?[>;1Q.]O<23O;W
M,!)R$I%??A[$3'X4]'?BHUWW[__X>?\=3YG_#B'TGY!$1))OZ$B_4C9$7F<7
M#6A$!!KP>(P<\I3$7#JI(%PX0:#^?Q0IE40XMRF-0H<3D492.$*J(Z'35*G>
MX0?\#7W2%^BT?&2NK3V-H](%I9-@1(+[6A"S 1WZI9CLF 2C^!LZ-/$IQY+&
MS$?Y3\2>;BANU&^&05!Y[V_G&0?ZVW\?QM.<_O!12&[38>5-5T1($J)3%8&4
M:I*.B;I?FM#:-."/:E[]\ZJ&INAQJE5D.!&C6#JC\-ZYT[^<.+>4.3KE19D\
MD> ;.DBP2@)]QGP<LPDZPRE3YQSY:#MXKR1+)IP.1U+5;<?[@.JNVT97ZOKI
M;?UX(!\Q)^@X3EEHA$4Q1U0*%-& ,!%S\0%A@7"2J !\&Y%:)8H.00^JG#J5
MG[Q:J^;^A"JO5F;Z$4?)""M4%DL4Q.-$VZ/.7Q\K&)5;Y>WB@:%?$&^UW=W=
MW0]H^S2-4,/5!=QY_P&=498^.=HJ'&45J%%3_SX@K@P="Y)90F7*(RD3WW%&
MF:(U;)2JQ;S:3I3X3#4 %!0-U+0D92ZC++(6#(8_;BO:YO)VYGS'CDI,_]X0
M]O"B9163[3X%41J2G.4[KI$LI!91(=^6)T]9YU7=U%6SJ9F[%^6='6O[U)>@
MJ73/-D4%<FO:A-V6UT;;YWB"O'9FU.^K4U,I32O(/\>4;2F"[?<^.N0$*VL+
MRD[E\M?5$Q(2<]F?L,,19HQ$.M&^#D)BHMH@CYGRNLJUF4BD\+68J*-^5LKB
MB/)CRD+"MP;J12>NFL0(R1@)@GDP,A()K<D:]21X8,*<M>6Z,KD]$N4KA&I&
M@7*!6BVT+6.)(^5>&JM5P1$5JAS:1>F4S^( &^$\O^,W6JB7,A3IL)JY29=6
M-\I4JGY$9;%2#GT9<](CXD"<?MW"89C3HT?EQU2>:"J':M%.UKCSMIY),XV^
M8]3!G..)< [,BT[#0VC[RT&_WSU:K;1_)4L=$$L+$$L;$$L'$(OGVH09IF/"
MI.:9'IF4K $IWQW<.WW]UW*[GB-I*))NKW?9LPW2A )BT;?,D5CT+',D%OW*
M?,NI0[$3KP%'E*9-%*[F\D+!F%>=R@XHFEU0-)Y%\WT!8[,MO8"QV1.]@+':
M";R@L=@1F-D1)P/AF+E33QU9;%1JSD\2/7-6\\YL5I<YP:_L44U:E5SGF$TN
M;^_4?-%@BN71EJ8T;UP*2\[_C4MAJ=-XM10G3-"0G# J%Q6B'&MKRO.FA;#D
M^MZT#)8<YIN6 6J#6$0.N4NHXK4T!_]A7JCMLHK7DOWBA)H=+"?";.BHD8O3
MOU&C%L()"XA.[\;U%@3!@=5[9 N %P6O"5VY%MYP_4;CQ6*X67P?8X:')-0K
MXWHC%S5V >I3KPBV7*DTSH,XP:'>+#E4UYL5TIX)F#^_YE02WC?WF(RA\7^A
M"0FG[(5C\-S97&H*7CR!03X,G ''0^=8_=&+U69ST$Q0%@0!0VPL" *$V*=Z
MF[^'61B/3:__2C1@]/8KT8#1.Z]$ T+_Y^$Q93BBOY,%UCT7:67%:B'U3,MZ
M900@D6=4C<H(0+B9O5:Z#YB.8X$Q%"+@F.X,:J&#@^G:*IT:-'<V'18OLMU"
MC#7@1-VMAV1C'$798N!G' V^F%!H9("HKFB^=@I,KAD8!*@Q&6<5J-^0/#NZ
M($.[/<QR+DOK^:]R65J JN8":5QVAUI+H,"9.V1;!V=64RZ[EG5.QC&?9,-V
M=6S?JF9 [1S(TEA1CO1:DUEI4J?]5"2$A3H=A\67E^==]=*_[+Z,MK7R7.8]
M89)PGB:R2/Q(Y6C&7+K$UM+J"M1%G<O,()2^QE1>Q)(.)M52EZ^!H?5B[J+8
M<]0@U+[*SKRZ@5X0MMXTN'(#I;GCMU?;/]EIVU/C-*9F?=8)1IBRQ;:77P/#
MZA83%ZWNF1>$O3WS1ME6PW*)0715%<@+-;8T YCK6R-"DFKG^1P-PX)?T);&
M <^LEJQW3$7@'*HAY@$?6MS_,ACF'027#X0/HOC1-LN$!3T2I.9S@)99ROVJ
ME77;(,)"1'&V>ZH_;#CM0YTSS(?D4,=>X#$Q]Y2#;GIVWO#\9X@M^8T_@7R]
M<2)?0Q-9OQO5X$T_Q5HXM^2;?P05FJJ',1,2,_DECB-SQ^&7L[&EST"L"6EG
MAZP2\IB2*!2*RUS^? 9,R@I*8%KVT]OY]C,+@M:$^FERPN2@0&K.[;SW8%U*
M.Q_J7)<26".JH 36B*YYS(;%9G31/3Q3UP$3LPH3NIK7&R'F]09I:6FG8EU,
M2SMBU:--(D=QJ-<',H?T? K,-J\X(44U"^?0!O!+4*&-/K+JUE.V?%!7"MDP
M7 "&<!'+'UE!V3SJ=4VC8F^E[N_Z]<YJ>RN>U]P<@:XWLEHAK-O,4R]9#X$'
MNWBQP7I7.H\)=J:T(JC](>D\:-5$!#[H]49Q G2KE4-H>*A+AJ;P8%\9[=D'
M/J=/FS7.6P\8P%A@+6  VV3K\<(2&/86V6J@L!2%NCWV*J+]X54!$>S6V.N,
MH'1<LM,$I\F W6AZG1&6DUPR<8(#"7>3:05(4(T;[ ;3ZXR;H",L)PEW:ZDX
M2ENVL;0!F+ \)>SMK]5 82D*?^MK==@W^J:PNM^H^]Z*WQ3FM>JVA+ED)!-F
M0U8QUN&%L"@PXUWZ5CKK_7:1$^A^Q@P1ZKK[JX0 ^I<9X[*U=B@Z@EYDGY<2
MV/+Z71)BYRY\3!P1$(8YC9VKS[WNP9'KN4X&KE-UK3U]YB7?>??\LO=OU_4*
M'U=W;7WB:XE^7DD_.'RY?O62?K8>1U6M7[VD'QR^7+]&23];3R^IYFN6^&P]
MTJ2:KU7BL_6$B&J^=HG/UC,CJOEV2GRV'A+SDJ_[6_?B2KOG[@-A$IIWGM+5
MBW1P?,N4KE.DL_6PJ 66=_*O[I'I>.D3":'5[)2N7J2#4[/37LTMC0I<2X\O
MJL8K=;J Y+O\=-H]O-*=6O9U>- ZM5R_1DD_.(."7+]623\XG6ZN7[.D'YSZ
MS?5KE_2#,RC(]6N5](-3O[E^.R7]X Q:<OW:)?W@U&^NWVY)/UO/XJO6;Z>D
M'YSZS?7KE/2#,[3*]=LMZ;=N_5;N,[2:?KVYXCY#QP6B1:>D!9RZ.NX=G'?U
M2.Z8XS&!-@R>TM6+='#&<5.Z1I%NW5%2Q7/MC?5>_EJ9A#27FN?=;[5<K_(Z
MA!*]=AQN><WJA_,@-, T4A=5-Q:$".<QW]IJMI9<(^YIDJAT&NZRS%)VS^)'
MMB2WHYB1&NH3@N3(:($X26(N$64F)*1<N;V83RI3V'+(D[[#285^QDL0J/\?
M14J5;LYM2J/0496:1E),JW=I70E$GDB0ZB]&1Y*.B;_E>GZS[3<\A%F(ZLWV
M>$D"NHZRVY"G.N$Q9:FB0,TV$B2(65B^M73RZ>O)V1$Z/C@YZQZ5(I:4SEA&
M;K3?<5;:VM,X\KUVQT>GZGZEIDR5^87*F[9:U=E7HN\^H[^[4M4Q4R=#1?I;
MUTQ%#>(HBA\I&Z+G1X7YYI9"A+8K% =!RKGRW(\C98EYBBI:CJA $67$?[>D
MT#C$B;*'YW)/S[-BNZYJ6O_G/+WV7Y*G"#A-5/4.M,-YC/G]M(0+:M9[M^?@
M_3TGX43]O8W#B7H9R7&T_S]02P$"% ,*    "  %%P(W3Y<$&O0*  "BB0  
M$@              I($     97AE8W5T:6]N7VQO9RYH=&UL4$L%!@     !
-  $ 0    "0+      $! 
end

Mime
View raw message