harmony-alerts mailing list archives

Site index · List index
Message view « Date » · « Thread »
Top « Date » · « Thread »
From nom...@intel.com
Subject [build-test alert] BUILD FAILED Windows 2003 x86: jedit_test
Date Wed, 01 Aug 2007 19:23:43 GMT
BUILD FAILED:
	Ant Error Message:
C:\cc\cc-suites\scripts\cc-exec-adaptor.xml:101: The following error occurred while executing
this line: C:\cc\cc-suites\adaptors\jedit_test\adaptor.xml:122: Some of JEdit tests failed.

Date of build:	08/02/2007 02:23:25
Time to build:	15 seconds
Last changed:	08/01/2007 21:44:56
Last log entry:	snapshot

***********************************************************
Errors/Warnings:	(16)
            
Java Result: 1
Java Result: 1
[junit] Test org.apache.harmony.guitests.JEditLaunchTest FAILED
BUILD FAILED
C:\cc\cc-suites\tests\jedit_test\build.xml:118: if=test.not.passed
Total time: 7 seconds
[junit] Test org.apache.harmony.guitests.JEditFunctionalTest FAILED
BUILD FAILED
C:\cc\cc-suites\tests\jedit_test\build.xml:122: if=test.not.passed
Total time: 3 seconds
[junit] Test org.apache.harmony.guitests.JEditStressTest FAILED
BUILD FAILED
C:\cc\cc-suites\tests\jedit_test\build.xml:126: if=test.not.passed
Total time: 3 seconds
The execution FAILED with the following exception:
The following error occurred while executing this line:
C:\cc\cc-suites\adaptors\jedit_test\adaptor.xml:122: Some of JEdit tests failed.

***********************************************************
Unit Tests: (3)
        
error: C:\cc\cc-suites\tests\jedit_test/scripts/jedit_fn_00.xml org.apache.harmony.guitests.JEditFunctionalTest
error: C:\cc\cc-suites\tests\jedit_test/scripts/jedit_ln_00.xml org.apache.harmony.guitests.JEditLaunchTest
error: test org.apache.harmony.guitests.JEditStressTest
Unit Test Error Details:	(3)
                
Test: C:\cc\cc-suites\tests\jedit_test/scripts/jedit_fn_00.xmlClass: org.apache.harmony.guitests.JEditFunctionalTestjava.lang.NoSuchMethodError:
java/awt/Toolkit.getEventMonitor()Ljava/lang/Object; while resolving constant pool entry at
index 107 in class java/awt/EventQueueCore
	at java.awt.EventQueueCore.postEvent(EventQueueCore.java:91)
	at java.awt.EventQueue.postEvent(EventQueue.java:116)
	at java.awt.EventQueue.invokeAndWait(EventQueue.java:67)
	at abbot.util.AWT.invokeAndWait(AWT.java:96)
	at abbot.script.AppClassLoader$AppEventQueue.install(AppClassLoader.java:235)
	at abbot.script.AppClassLoader.install(AppClassLoader.java:185)
	at abbot.script.Launch.install(Launch.java:112)
	at abbot.script.Launch.runStep(Launch.java:180)
	at abbot.script.Step.run(Step.java:92)
	at abbot.script.StepRunner.runStep(StepRunner.java:277)
	at abbot.script.Sequence.runStep(Sequence.java:110)
	at abbot.script.Script.runStep(Script.java:499)
	at abbot.script.StepRunner.runStep(StepRunner.java:274)
	at abbot.script.StepRunner.run(StepRunner.java:194)
	at junit.extensions.abbot.ScriptFixture.runTest(ScriptFixture.java:60)
Test: C:\cc\cc-suites\tests\jedit_test/scripts/jedit_ln_00.xmlClass: org.apache.harmony.guitests.JEditLaunchTestjava.util.NoSuchElementException
	at java.util.LinkedList.getLast(LinkedList.java:476)
	at java.awt.EventQueueCore.pop(EventQueueCore.java:215)
	at java.awt.EventQueue.pop(EventQueue.java:140)
	at abbot.script.AppClassLoader$AppEventQueue.uninstall(AppClassLoader.java:250)
	at abbot.script.AppClassLoader.uninstall(AppClassLoader.java:206)
	at abbot.script.Launch.terminate(Launch.java:153)
	at abbot.script.StepRunner.terminate(StepRunner.java:341)
	at abbot.script.StepRunner.run(StepRunner.java:209)
	at junit.extensions.abbot.ScriptFixture.runTest(ScriptFixture.java:60)
Test: testClass: org.apache.harmony.guitests.JEditStressTestjava.util.NoSuchElementException
	at java.util.LinkedList.getLast(LinkedList.java:476)
	at java.awt.EventQueueCore.pop(EventQueueCore.java:215)
	at java.awt.EventQueue.pop(EventQueue.java:140)
	at abbot.script.AppClassLoader$AppEventQueue.uninstall(AppClassLoader.java:250)
	at abbot.script.AppClassLoader.uninstall(AppClassLoader.java:206)
	at abbot.script.Launch.terminate(Launch.java:153)
	at abbot.script.Fixture.terminate(Fixture.java:61)
	at abbot.script.StepRunner.terminate(StepRunner.java:341)
	at abbot.script.StepRunner.run(StepRunner.java:209)
	at junit.extensions.abbot.ScriptFixture.runTest(ScriptFixture.java:60)
	at org.apache.harmony.guitests.JEditStressTest$RepeatableScript.runTest(Unknown Source)
	at org.apache.harmony.guitests.JEditStressTest.test(Unknown Source)
	at java.lang.reflect.VMReflection.invokeMethod(VMReflection.java)

***********************************************************
Modifications since last successful build:	(2)
            
add cc-snapshot log20070801214456Lbuild.6 08/01/2007 21:44:56snapshot
add cc-snapshot log20070726133349Lbuild.5 07/26/2007 13:33:49snapshot

begin 644 execution_log.zip
M4$L#! H    ( /42 C?'6>:\B00  &D>   2    97AE8W5T:6]N7VQO9RYH
M=&UL[5EM;R(W$/[<2/D/\Z6Z1,IN@+S1+1?IFI#JHEP_7)(/U8&0V1W P6MO
M;6\2^NL[]I(7""QPE[17'2A:O+;GF=GQO#QA&P.;BN-&5R6CXT:F\;C!P-B1
MP/?O>DK:P/"_,8)ZY>=?WQUO;NA<1IL;X#Y?;M@M:\-O.1=)CPO:U'7#\#X5
MDSLF[P*#-LBTNA]%I=MZ:.-!D&"&,C'E6[DTE@D1W&#"[0I;@TSD?9I93D1I
M3IN9"%BWJQ:HR9@S?A6)6*49.;&0Q&09D1NF5]G^\!PK;%W*^V/+PP'3J9*C
MT)M4*D(1D&?EH(;=XOB0:+?ELK]*#+CXRE!;CM-2?I@.$Z[;<**164R ;B(X
MB5JG*LY3E-8 DPE<CM6V!.LF6G3^8JW0@Y>9$0MD,M28*3WM8C=*4*#%-IRZ
M;P)WJC&V2H^<_CBFO\#DW*)I^5QJT=G&0Y5;T_*J.[1B6P5\>?S1'J8Q0$9A
M^#)G7\^6.Z6')+R\D_]SX"6\1PX+!,OEBS NAKGDM@V?<RF=VY3NARPC/S]E
M0-\;84UXWB2U%Q[IBB;F@UT-$'X_H6=)0"H+%+ZW/$'HQQV6))T[9,..5LIV
M*!<Z%*%ZM+5= N9T@SMUJ.[ &>,BUY0(4-F!IM9*&S]_Q5,$%"PSF-!:>%BO
M4V+&\V&O9<SR_L "WL>86:XD< DIXS.BZU'(%YNP><]M\T$J@@]9)GC,/ 32
M$B0H.1WE5FT;:.IJ0$>;?''(.P<[[JL]7\%/S(Z5_*&<FDN,<\WMZ!.3K(\Z
M]#'@%K9FKSO$:+]2XDZGP<V&@LE^2,=NR7.ALWOKX:8 .=A?&N5R9"RF!<AX
M[#&JE466/ LWJY0P(9,VM,P,$^R94'D/,Q%ZB?#\FJXN'%RPTL,Z7VY-3WK%
M!T?5[;*<F(ZO5<(>SCY\O&B>3B59'TDY97 PLUH6NHHETJB9-#VE4W#NCF#O
MZ" U9>;.S-XIWG+]\>)TIFG3Q<0_U/,2\LASHFJU'@'OO7?3(64N-3]#^52F
M]TI1GQH_QY'+.$4==G++.5WA,YI<6$K5A[5892,RCJZN[%3!<2ZP:D[MTUY\
MPNQ:I7(45.I!I=:IU&I[:QJWIG$O+?^W:5PQ3M4M49%/U/6F0WM)4A9V63S,
MLUG8& ]4&_Y4N0;BA,:51[AQ%0H>3((!F0E=1 D.ACI1GE%OFP_V_+.$C;LE
M-JYI;%G^K6GL-]+8'O7!@A*\!I4]>T3[[NELO;: SB['8B:?>"9=>$5>LU^K
MEO.:N<?Y%MRF5OL6;K.WYC;SZOJ:V_P8W.:K>_N"KO95'=X/UY1A31D6409#
M[<G,))RKTH5+C_3=4X7#H]KZEZ]Y&G[ 7[ZF(VJ50']KAKCWRP*&.#-[WX0=
M'OZ_V>'J;6 &L&!/M6W2RCUOI5G)S )MPY5$O*=L]66B.">XXW8 EE9Z2@AU
MYU0\5J/(BSQ;<+4.5$SYKJFXW V<O\:(M&P'W(#@$BE*IFUC"<O(!1-FC>>>
M_BFX5%1 50]\[(,/$NA1L<4DW-C<:.RRX\:N?Y.\6[Q5WO6OF/\!4$L! A0#
M"@    @ ]1("-\=9YKR)!   :1X  !(              *2!     &5X96-U
C=&EO;E]L;V<N:'1M;%!+!08      0 ! $    "Y!      ! 
end

Mime
View raw message