harmony-alerts mailing list archives

Site index · List index
Message view « Date » · « Thread »
Top « Date » · « Thread »
From nom...@intel.com
Subject [build-test alert] BUILD FAILED Linux x86: JettyScenario
Date Wed, 01 Aug 2007 18:09:12 GMT
Jetty server JRE:

Apache Harmony Launcher : (c) Copyright 1991, 2006 The Apache Software Foundation or its licensors,
as applicable.
java version "1.5.0" 
pre-alpha : not complete or compatible
svn = r560888, (Jul 30 2007), Linux/ia32/gcc 3.3.3, release build
http://harmony.apache.org

Scenario framework JRE:

Apache Harmony Launcher : (c) Copyright 1991, 2006 The Apache Software Foundation or its licensors,
as applicable.
java version "1.5.0" 
pre-alpha : not complete or compatible
svn = r560888, (Jul 30 2007), Linux/ia32/gcc 3.3.3, release build
http://harmony.apache.org

================================================================================
Scenario results:

Testsuite: org.apache.harmony.test.jetty.JettyScenario
Tests run: 5, Failures: 1, Errors: 0, Time elapsed: 29.155 sec
------------- Standard Output ---------------
Setup completed.

==============================================================testInitialPage===
Starting initial page test case.
Loading page from server: http://localhost:7070/test/
Getting resource with name: initial_page.html
Found resource: /export/users/cc/cc-suites/tests/JettyScenario/resources/JettyScenario/initial_page.html
Saving content of downloaded page to: /export/users/cc/cc-suites/build/results/JettyScenario/JettyScenario/initial_page.html
Comparing page content with etalon: initial_page.html
Page is equal to etalon.
Initial page test case passed.

============================================================testStaticContent===
Starting static content page test case.
Loading page from server: http://localhost:7070/test/data.txt
Getting resource with name: static_content.txt
Found resource: /export/users/cc/cc-suites/tests/JettyScenario/resources/JettyScenario/static_content.txt
Saving content of downloaded page to: /export/users/cc/cc-suites/build/results/JettyScenario/JettyScenario/static_content.txt
Comparing page content with etalon: static_content.txt
Page have different number of lines than etalon.

=======================================================testSessionDumpServlet===
Starting servlet test case.
Loading page from server: http://localhost:7070/test/session/
Getting resource with name: session_dump.html
Found resource: /export/users/cc/cc-suites/tests/JettyScenario/resources/JettyScenario/session_dump.html
Saving content of downloaded page to: /export/users/cc/cc-suites/build/results/JettyScenario/JettyScenario/session_dump.html
Comparing page content with etalon: session_dump.html
Page is equal to etalon.
Session dump servlet page is OK.
Getting resource with name: session_dump_new.html
Found resource: /export/users/cc/cc-suites/tests/JettyScenario/resources/JettyScenario/session_dump_new.html
Saving content of downloaded page to: /export/users/cc/cc-suites/build/results/JettyScenario/JettyScenario/session_dump_new.html
Comparing page content with etalon: session_dump_new.html
Page is equal to etalon.
Session create page is OK.
Getting resource with name: session_dump_set.html
Found resource: /export/users/cc/cc-suites/tests/JettyScenario/resources/JettyScenario/session_dump_set.html
Saving content of downloaded page to: /export/users/cc/cc-suites/build/results/JettyScenario/JettyScenario/session_dump_set.html
Comparing page content with etalon: session_dump_set.html
Page is equal to etalon.
Session set page is OK.
Getting resource with name: session_dump_remove.html
Found resource: /export/users/cc/cc-suites/tests/JettyScenario/resources/JettyScenario/session_dump_remove.html
Saving content of downloaded page to: /export/users/cc/cc-suites/build/results/JettyScenario/JettyScenario/session_dump_remove.html
Comparing page content with etalon: session_dump_remove.html
Page is equal to etalon.
Session remove page is OK.
Getting resource with name: session_dump_invalidate.html
Found resource: /export/users/cc/cc-suites/tests/JettyScenario/resources/JettyScenario/session_dump_invalidate.html
Saving content of downloaded page to: /export/users/cc/cc-suites/build/results/JettyScenario/JettyScenario/session_dump_invalidate.html
Comparing page content with etalon: session_dump_invalidate.html
Page is equal to etalon.
Session invalidate page is OK.
Servlet test case passed.

===========================================================testRequestDumpJSP===
Starting JSP test case.
Loading page from server: http://localhost:7070/test/snoop.jsp
Getting resource with name: request_dump_JSP.html
Found resource: /export/users/cc/cc-suites/tests/JettyScenario/resources/JettyScenario/request_dump_JSP.html
Saving content of downloaded page to: /export/users/cc/cc-suites/build/results/JettyScenario/JettyScenario/request_dump_JSP.html
Comparing page content with etalon: request_dump_JSP.html
Page is equal to etalon.
JSP test case passed.

=====================================================testGZippedStaticContent===
Starting gzipped static content test case.
Loading page from server: http://localhost:7070/test/data.txt.gz
Unpacking content from archive.
Getting resource with name: static_content_ungzipped.txt
Found resource: /export/users/cc/cc-suites/tests/JettyScenario/resources/JettyScenario/static_content_ungzipped.txt
Saving content of downloaded page to: /export/users/cc/cc-suites/build/results/JettyScenario/JettyScenario/static_content_ungzipped.txt
Comparing page content with etalon: static_content_ungzipped.txt
Page is equal to etalon.
Gzipped static content test case passed.
------------- ---------------- ---------------

Testcase: testInitialPage took 6.308 sec
Testcase: testStaticContent took 4.517 sec
	FAILED
Content is not correct.
junit.framework.AssertionFailedError: Content is not correct.
	at org.apache.harmony.test.jetty.JettyScenario.testStaticContent(Unknown Source)
	at java.lang.reflect.VMReflection.invokeMethod(VMReflection.java)

Testcase: testSessionDumpServlet took 0.971 sec
Testcase: testRequestDumpJSP took 8.531 sec
Testcase: testGZippedStaticContent took 8.532 sec

================================================================================
Jetty server output:

2007-08-02 01:08:10.013::INFO:  Logging to STDERR via org.mortbay.log.StdErrLog
2007-08-02 01:08:10.976::INFO:  Statistics on = false for SelectChannelConnector @ 0.0.0.0:7070
2007-08-02 01:08:11.122::INFO:  jetty-6.1.2rc1
2007-08-02 01:08:11.248::INFO:  Deploy /export/users/cc/cc-suites/build/libs/jetty-6.1.2rc1/contexts/javadoc.xml
-> org.mortbay.jetty.servlet.Context@10aaeb2d{/javadoc,file:/export/users/cc/cc-suites/build/libs/jetty-6.1.2rc1/javadoc/}
2007-08-02 01:08:11.387::INFO:  Deploy /export/users/cc/cc-suites/build/libs/jetty-6.1.2rc1/contexts/test.xml
-> org.mortbay.jetty.webapp.WebAppContext@10ace089{/test,/export/users/cc/cc-suites/build/libs/jetty-6.1.2rc1/webapps/test}
The GC did not provide gc_add_weak_root_set_entry()
2007-08-02 01:08:21.671::WARN:  Unknown realm: Test JAAS Realm
2007-08-02 01:08:31.625::INFO:  Started SelectChannelConnector @ 0.0.0.0:7070

================================================================================
BUILD FAILED:
	Ant Error Message:
/export/users/cc/cc-suites/scripts/cc-exec-adaptor.xml:101: The following error occurred while
executing this line: /export/users/cc/cc-suites/adaptors/JettyScenario/adaptor.xml:186: Jetty
scenario failed

Date of build:	08/02/2007 01:08:05
Time to build:	1 minute 2 seconds
Last changed:	07/30/2007 19:01:30
Last log entry:	snapshot

***********************************************************
Errors/Warnings:	(3)
            
The GC did not provide gc_add_weak_root_set_entry()
The execution FAILED with the following exception:
The following error occurred while executing this line:
/export/users/cc/cc-suites/adaptors/JettyScenario/adaptor.xml:186: Jetty scenario failed

***********************************************************
Unit Tests: (5)
        
failure: testStaticContent org.apache.harmony.test.jetty.JettyScenario
Unit Test Error Details:	(1)
                
Test: testStaticContentClass: org.apache.harmony.test.jetty.JettyScenariojunit.framework.AssertionFailedError:
Content is not correct.
	at org.apache.harmony.test.jetty.JettyScenario.testStaticContent(Unknown Source)
	at java.lang.reflect.VMReflection.invokeMethod(VMReflection.java)

***********************************************************
Modifications since last successful build:	(1)
            
add cc-snapshot log20070730190130Lbuild.7 07/30/2007 19:01:30snapshot

begin 644 execution_log.zip
M4$L#! H    ( "0) C=TVG"DQ $  $8#   2    97AE8W5T:6]N7VQO9RYH
M=&ULE5/O:]LP$/WNO^*^C&X06\T@6^>Y@;*V8V.?EGP+(:C2.58GZXQT;N+]
M]9/B!N86!A,V_G%Z[^[>/54-MW99/9 >EE7G<5E)"#Q8O+ZHR7$>S&\LX>KR
MS>>+998K:CMC,3=U[A UZC++?._*#-+:H&IH"]=_+[C1LF/R4,?[.S(/*X5.
M>D,E_.P=%$7";C1:9-S";7H:MR]!X+$CSZ(/Z(-0*EYYZ UC$ ^]L5IX#+WE
M(":DXC%]%9;VDY)6+'VB'2N 2/F$_K1C\]@[P]M4BTL;R.\+V4G58-%(WY(;
MBIB2BY%WDFN"7S<(7[^ -AH<,72>GHQ&V*N=U'IW0/EKYXEX%Y!WZ-@/;]]-
M\3%)@*0E+&9P+XWM8X,ES&=PYSWY^'HY@[5I$=#*+D3IX?VG8KY8Q&[4*ZK_
MZ0/N;[[]N+O-1KS')'MD\=*%.+06.":-%O@X;T,V6H "YK%+4QLEV="+^:^8
MNNZ5V%E2"(^H^H1XS@D'PPUPC-1D+1T2"H\*NY%U/0TD'8"4ZKU'#8<F.O',
M&,/<F #6."RS?WA'CG9\:9OGW\6QM>7\ZD-YKOTL41T'@CJKA%Q6XG1,Q'AD
MQ.G\_ %02P$"% ,*    "  D"0(W=-IPI,0!  !& P  $@              
MI($     97AE8W5T:6]N7VQO9RYH=&UL4$L%!@     !  $ 0    /0!    
!  $! 
end

Mime
View raw message