harmony-alerts mailing list archives

Site index · List index
Message view « Date » · « Thread »
Top « Date » · « Thread »
From nom...@intel.com
Subject [build-test alert] BUILD FAILED Linux x86: classlib-test
Date Wed, 01 Aug 2007 10:13:28 GMT
BUILD FAILED:
	Ant Error Message:
/export/users/cc/cc-common/scripts/cc-exec-adaptor.xml:101: The following error occurred while executing this line: /export/users/cc/cc-common/adaptors/classlib-test/adaptor.xml:80: There were CLASSLIB Unit Test failures.

Date of build:	08/01/2007 16:38:40
Time to build:	33 minutes 56 seconds
Last changed:	08/01/2007 16:16:25
Last log entry:	hdk

***********************************************************
Errors/Warnings:	(10)
            
[junit] Tests FAILED
[junit] Tests FAILED
[junit] Tests FAILED
[junit] Tests FAILED
BUILD FAILED
/export/users/cc/cc-common/build/checkouts/hdk/working_classlib/build.xml:169: The following error occurred while executing this line:
/export/users/cc/cc-common/build/checkouts/hdk/working_classlib/make/build-test.xml:147: There were test errors.
Total time: 33 minutes 48 seconds
The execution FAILED with the following exception:
The following error occurred while executing this line:
/export/users/cc/cc-common/adaptors/classlib-test/adaptor.xml:80: There were CLASSLIB Unit Test failures.

***********************************************************
Unit Tests: (15394)
        
error: testInstantiate_Normal java.beans.ArrayPersistenceDelegateTest
error: testInstantiate_Normal java.beans.ClassPersistenceDelegateTest
error: testInstantiate_Primitive java.beans.ClassPersistenceDelegateTest
error: testInstantiate_Class java.beans.ClassPersistenceDelegateTest
error: testInstantiate_Normal java.beans.StringPersistenceDelegateTest
error: test_instantiate_with_applet org.apache.harmony.beans.tests.java.beans.BeansTest
error: testStringPD org.apache.harmony.beans.tests.java.beans.CustomizedPersistenceDelegateTest
error: testArrayPD org.apache.harmony.beans.tests.java.beans.CustomizedPersistenceDelegateTest
error: testClassPD org.apache.harmony.beans.tests.java.beans.CustomizedPersistenceDelegateTest
error: testProxyPD org.apache.harmony.beans.tests.java.beans.CustomizedPersistenceDelegateTest
error: testPrimitivePD org.apache.harmony.beans.tests.java.beans.CustomizedPersistenceDelegateTest
error: testMethodPD org.apache.harmony.beans.tests.java.beans.CustomizedPersistenceDelegateTest
error: testFieldPD org.apache.harmony.beans.tests.java.beans.CustomizedPersistenceDelegateTest
error: testInstantiate_Normal org.apache.harmony.beans.tests.java.beans.DefaultPersistenceDelegateTest
error: testInstantiate_NullInstance org.apache.harmony.beans.tests.java.beans.DefaultPersistenceDelegateTest
error: testInstantiate_NullProperty org.apache.harmony.beans.tests.java.beans.DefaultPersistenceDelegateTest
error: testInstantiate_NoProperty org.apache.harmony.beans.tests.java.beans.DefaultPersistenceDelegateTest
error: testInstantiate_NonExistingGetter org.apache.harmony.beans.tests.java.beans.DefaultPersistenceDelegateTest
error: testInstantiate_InvalidGetter org.apache.harmony.beans.tests.java.beans.DefaultPersistenceDelegateTest
error: testInstantiate_ExceptionalGetter org.apache.harmony.beans.tests.java.beans.DefaultPersistenceDelegateTest
error: testInstantiate_ErrorGetter org.apache.harmony.beans.tests.java.beans.DefaultPersistenceDelegateTest
error: testInstantiate_PrivateGetter org.apache.harmony.beans.tests.java.beans.DefaultPersistenceDelegateTest
error: testInstantiate_InitialUpperCasePropName org.apache.harmony.beans.tests.java.beans.DefaultPersistenceDelegateTest
error: testInstantiate_NoGetter org.apache.harmony.beans.tests.java.beans.DefaultPersistenceDelegateTest
error: testInstantiate_NotRegularGetter org.apache.harmony.beans.tests.java.beans.DefaultPersistenceDelegateTest
error: test_initialize org.apache.harmony.beans.tests.java.beans.DefaultPersistenceDelegateTest
error: testInitialize_Normal org.apache.harmony.beans.tests.java.beans.DefaultPersistenceDelegateTest
error: testInitialize_NormalBeanInfo org.apache.harmony.beans.tests.java.beans.DefaultPersistenceDelegateTest
error: testInitialize_TransientProperty org.apache.harmony.beans.tests.java.beans.DefaultPersistenceDelegateTest
error: testInitialize_NoSetter org.apache.harmony.beans.tests.java.beans.DefaultPersistenceDelegateTest
error: testInitialize_NoGetter org.apache.harmony.beans.tests.java.beans.DefaultPersistenceDelegateTest
error: testInitialize_NullClass org.apache.harmony.beans.tests.java.beans.DefaultPersistenceDelegateTest
error: testInitialize_NullInstances org.apache.harmony.beans.tests.java.beans.DefaultPersistenceDelegateTest
error: testArrayPD_Normal org.apache.harmony.beans.tests.java.beans.DefaultPersistenceDelegateTest
error: testGetExceptionListener org.apache.harmony.beans.tests.java.beans.EncoderTest
error: testSetExceptionListener_Null org.apache.harmony.beans.tests.java.beans.EncoderTest
error: testSetExceptionListener org.apache.harmony.beans.tests.java.beans.EncoderTest
error: testWriteExpression_Null org.apache.harmony.beans.tests.java.beans.EncoderTest
error: testWriteStatement_Null org.apache.harmony.beans.tests.java.beans.EncoderTest
error: testWriteObject_Null org.apache.harmony.beans.tests.java.beans.EncoderTest
error: testWriteObject org.apache.harmony.beans.tests.java.beans.EncoderTest
error: testGetPersistenceDelegate_Null org.apache.harmony.beans.tests.java.beans.EncoderTest
error: testGetPersistenceDelegate_ArrayClass org.apache.harmony.beans.tests.java.beans.EncoderTest
error: testGetPersistenceDelegate_ProxyClass org.apache.harmony.beans.tests.java.beans.EncoderTest
error: testGetPersistenceDelegate_BeanInfo org.apache.harmony.beans.tests.java.beans.EncoderTest
error: testGetPersistenceDelegate_Default org.apache.harmony.beans.tests.java.beans.EncoderTest
error: testSetPersistenceDelegate_Null org.apache.harmony.beans.tests.java.beans.EncoderTest
error: testSetPersistenceDelegate org.apache.harmony.beans.tests.java.beans.EncoderTest
error: testGet_NullParam org.apache.harmony.beans.tests.java.beans.EncoderTest
error: testGet_String org.apache.harmony.beans.tests.java.beans.EncoderTest
error: testGet_Integer org.apache.harmony.beans.tests.java.beans.EncoderTest
error: testRemove_Null org.apache.harmony.beans.tests.java.beans.EncoderTest
error: testRemove_String org.apache.harmony.beans.tests.java.beans.EncoderTest
error: testRemove_Integer org.apache.harmony.beans.tests.java.beans.EncoderTest
error: testWriteObject_NormalMutatesToTrue org.apache.harmony.beans.tests.java.beans.PersistenceDelegateTest
error: testWriteObject_NormalMutatesToFalse org.apache.harmony.beans.tests.java.beans.PersistenceDelegateTest
error: testWriteObject_NullObject org.apache.harmony.beans.tests.java.beans.PersistenceDelegateTest
error: testInitialize_Normal org.apache.harmony.beans.tests.java.beans.PersistenceDelegateTest
error: testInitialize_NullClass org.apache.harmony.beans.tests.java.beans.PersistenceDelegateTest
error: testInitialize_NullInstances org.apache.harmony.beans.tests.java.beans.PersistenceDelegateTest
error: testInitialize_circularRedundancy org.apache.harmony.beans.tests.java.beans.PersistenceDelegateTest
error: test_writeObject_Null_LXMLEncoder org.apache.harmony.beans.tests.java.beans.PersistenceDelegateTest
error: test_writeObject_java_lang_reflect_Field org.apache.harmony.beans.tests.java.beans.PersistenceDelegateTest
error: test_writeObject_java_lang_reflect_Method org.apache.harmony.beans.tests.java.beans.PersistenceDelegateTest
error: test_writeObject_java_util_Collection org.apache.harmony.beans.tests.java.beans.PersistenceDelegateTest
error: test_writeObject_java_awt_Choice org.apache.harmony.beans.tests.java.beans.PersistenceDelegateTest
error: test_writeObject_java_awt_SystemColor org.apache.harmony.beans.tests.java.beans.PersistenceDelegateTest
error: test_writeObject_java_awt_font_TextAttribute org.apache.harmony.beans.tests.java.beans.PersistenceDelegateTest
error: test_writeObject_java_awt_MenuShortcut org.apache.harmony.beans.tests.java.beans.PersistenceDelegateTest
error: test_writeObject_java_awt_Component org.apache.harmony.beans.tests.java.beans.PersistenceDelegateTest
error: test_writeObject_java_awt_Container org.apache.harmony.beans.tests.java.beans.PersistenceDelegateTest
error: test_writeObject_java_awt_Menu org.apache.harmony.beans.tests.java.beans.PersistenceDelegateTest
error: test_writeObject_java_awt_MenuBar org.apache.harmony.beans.tests.java.beans.PersistenceDelegateTest
error: test_writeObject_java_awt_List org.apache.harmony.beans.tests.java.beans.PersistenceDelegateTest
error: test_writeObject_java_awt_BorderLayout org.apache.harmony.beans.tests.java.beans.PersistenceDelegateTest
error: test_writeObject_java_awt_CardLayout org.apache.harmony.beans.tests.java.beans.PersistenceDelegateTest
error: test_writeObject_java_awt_GridBagLayout org.apache.harmony.beans.tests.java.beans.PersistenceDelegateTest
error: test_writeObject_java_awt_Cursor org.apache.harmony.beans.tests.java.beans.PersistenceDelegateTest
error: test_writeObject_java_awt_Insets org.apache.harmony.beans.tests.java.beans.PersistenceDelegateTest
error: test_writeObject_java_awt_point org.apache.harmony.beans.tests.java.beans.PersistenceDelegateTest
error: test_writeObject_java_awt_ScrollPane org.apache.harmony.beans.tests.java.beans.PersistenceDelegateTest
error: test_writeObject_java_util_Map org.apache.harmony.beans.tests.java.beans.PersistenceDelegateTest
error: test_writeObject_java_util_List org.apache.harmony.beans.tests.java.beans.PersistenceDelegateTest
error: test_writeObject_java_util_AbstractList org.apache.harmony.beans.tests.java.beans.PersistenceDelegateTest
error: test_writeObject_java_util_AbstractMap org.apache.harmony.beans.tests.java.beans.PersistenceDelegateTest
error: test_writeObject_javax_swing_JFrame org.apache.harmony.beans.tests.java.beans.PersistenceDelegateTest
error: test_writeObject_javax_swing_DefaultListModel org.apache.harmony.beans.tests.java.beans.PersistenceDelegateTest
error: test_writeObject_javax_swing_DefaultComboBoxModel org.apache.harmony.beans.tests.java.beans.PersistenceDelegateTest
error: test_writeObject_javax_swing_tree_DefaultMutableTreeNode org.apache.harmony.beans.tests.java.beans.PersistenceDelegateTest
error: test_writeObject_javax_swing_ToolTipManager org.apache.harmony.beans.tests.java.beans.PersistenceDelegateTest
error: test_writeExpression_writeObject org.apache.harmony.beans.tests.java.beans.PersistenceDelegateTest
error: testFontEditor org.apache.harmony.beans.tests.java.beans.PropertyEditorManagerTest
error: testLoadImage org.apache.harmony.beans.tests.java.beans.SimpleBeanInfoTest
error: testAvoidGui org.apache.harmony.beans.tests.java.beans.beancontext.BeanContextSupportTest
error: test_ConstructorLjava_lang_StringZ tests.api.java.io.FileOutputStreamTest
failure: testDefaultValue org.apache.harmony.logging.tests.java.util.logging.FileHandlerTest
Unit Test Error Details:	(96)
                
Test: testInstantiate_NormalClass: java.beans.ArrayPersistenceDelegateTestjava.lang.ExceptionInInitializerError
	at java.lang.reflect.VMField.getObject(VMField.java)
	at java.lang.reflect.Field.get(Field.java:163)
	at java.beans.StaticFieldPersistenceDelegate.init(StaticFieldPersistenceDelegate.java:36)
	at java.beans.AwtSystemColorPersistenceDelegate.<clinit>(AwtSystemColorPersistenceDelegate.java:28)
	at java.beans.Encoder.<clinit>(Encoder.java:104)
	at java.beans.ArrayPersistenceDelegateTest.testInstantiate_Normal(ArrayPersistenceDelegateTest.java:53)
	at java.lang.reflect.VMReflection.invokeMethod(VMReflection.java)
Caused by: java.lang.NullPointerException
	at java.awt.Toolkit.init(Toolkit.java:565)
	at java.awt.Toolkit.<init>(Toolkit.java:539)
	at java.awt.ToolkitImpl.<init>(ToolkitImpl.java:39)
	at java.awt.Toolkit.getDefaultToolkit(Toolkit.java:471)
	at java.awt.SystemColor.<init>(SystemColor.java:143)
	at java.awt.SystemColor.<clinit>(SystemColor.java:91)
	at java.lang.reflect.VMField.getObject(VMField.java)
	... 18 more
Test: testInstantiate_NormalClass: java.beans.ClassPersistenceDelegateTestjava.lang.NoClassDefFoundError: java/beans/Encoder
	at java.beans.ClassPersistenceDelegateTest.testInstantiate_Normal(ClassPersistenceDelegateTest.java:51)
	at java.lang.reflect.VMReflection.invokeMethod(VMReflection.java)
Test: testInstantiate_PrimitiveClass: java.beans.ClassPersistenceDelegateTestjava.lang.NoClassDefFoundError: java/beans/Encoder
	at java.beans.ClassPersistenceDelegateTest.testInstantiate_Primitive(ClassPersistenceDelegateTest.java:61)
	at java.lang.reflect.VMReflection.invokeMethod(VMReflection.java)
Test: testInstantiate_ClassClass: java.beans.ClassPersistenceDelegateTestjava.lang.NoClassDefFoundError: java/beans/Encoder
	at java.beans.ClassPersistenceDelegateTest.testInstantiate_Class(ClassPersistenceDelegateTest.java:71)
	at java.lang.reflect.VMReflection.invokeMethod(VMReflection.java)
Test: testInstantiate_NormalClass: java.beans.StringPersistenceDelegateTestjava.lang.NoClassDefFoundError: java/beans/Encoder
	at java.beans.StringPersistenceDelegateTest.testInstantiate_Normal(StringPersistenceDelegateTest.java:51)
	at java.lang.reflect.VMReflection.invokeMethod(VMReflection.java)
Test: test_instantiate_with_appletClass: org.apache.harmony.beans.tests.java.beans.BeansTestjava.lang.NullPointerException
	at java.awt.Toolkit.init(Toolkit.java:565)
	at java.awt.Toolkit.<init>(Toolkit.java:539)
	at java.awt.ToolkitImpl.<init>(ToolkitImpl.java:39)
	at java.awt.Toolkit.getDefaultToolkit(Toolkit.java:471)
	at java.awt.FlowLayout.<init>(FlowLayout.java:42)
	at java.awt.FlowLayout.<init>(FlowLayout.java:60)
	at java.awt.Panel.<init>(Panel.java:48)
	at java.applet.Applet.<init>(Applet.java:90)
	at java.lang.reflect.VMReflection.newClassInstance(VMReflection.java)
	at java.lang.reflect.Constructor.newInstance(Constructor.java:283)
	at java.lang.Class.newInstance(Class.java:694)
	at java.beans.Beans.instantiate(Beans.java:183)
	at java.beans.Beans.instantiate(Beans.java:75)
	at org.apache.harmony.beans.tests.java.beans.BeansTest.test_instantiate_with_applet(BeansTest.java:451)
	at java.lang.reflect.VMReflection.invokeMethod(VMReflection.java)
Test: testStringPDClass: org.apache.harmony.beans.tests.java.beans.CustomizedPersistenceDelegateTestjava.lang.ExceptionInInitializerError
	at java.lang.reflect.VMField.getObject(VMField.java)
	at java.lang.reflect.Field.get(Field.java:163)
	at java.beans.StaticFieldPersistenceDelegate.init(StaticFieldPersistenceDelegate.java:36)
	at java.beans.AwtSystemColorPersistenceDelegate.<clinit>(AwtSystemColorPersistenceDelegate.java:28)
	at java.beans.Encoder.<clinit>(Encoder.java:104)
	at org.apache.harmony.beans.tests.java.beans.CustomizedPersistenceDelegateTest.setUp(CustomizedPersistenceDelegateTest.java:43)
Caused by: java.lang.NullPointerException
	at java.awt.Toolkit.init(Toolkit.java:565)
	at java.awt.Toolkit.<init>(Toolkit.java:539)
	at java.awt.ToolkitImpl.<init>(ToolkitImpl.java:39)
	at java.awt.Toolkit.getDefaultToolkit(Toolkit.java:471)
	at java.awt.SystemColor.<init>(SystemColor.java:143)
	at java.awt.SystemColor.<clinit>(SystemColor.java:91)
	at java.lang.reflect.VMField.getObject(VMField.java)
	... 15 more
Test: testArrayPDClass: org.apache.harmony.beans.tests.java.beans.CustomizedPersistenceDelegateTestjava.lang.NoClassDefFoundError: org/apache/harmony/beans/tests/java/beans/CustomizedPersistenceDelegateTest$MockEncoder
	at org.apache.harmony.beans.tests.java.beans.CustomizedPersistenceDelegateTest.setUp(CustomizedPersistenceDelegateTest.java:43)
Test: testClassPDClass: org.apache.harmony.beans.tests.java.beans.CustomizedPersistenceDelegateTestjava.lang.NoClassDefFoundError: org/apache/harmony/beans/tests/java/beans/CustomizedPersistenceDelegateTest$MockEncoder
	at org.apache.harmony.beans.tests.java.beans.CustomizedPersistenceDelegateTest.setUp(CustomizedPersistenceDelegateTest.java:43)
Test: testProxyPDClass: org.apache.harmony.beans.tests.java.beans.CustomizedPersistenceDelegateTestjava.lang.NoClassDefFoundError: org/apache/harmony/beans/tests/java/beans/CustomizedPersistenceDelegateTest$MockEncoder
	at org.apache.harmony.beans.tests.java.beans.CustomizedPersistenceDelegateTest.setUp(CustomizedPersistenceDelegateTest.java:43)
Test: testPrimitivePDClass: org.apache.harmony.beans.tests.java.beans.CustomizedPersistenceDelegateTestjava.lang.NoClassDefFoundError: org/apache/harmony/beans/tests/java/beans/CustomizedPersistenceDelegateTest$MockEncoder
	at org.apache.harmony.beans.tests.java.beans.CustomizedPersistenceDelegateTest.setUp(CustomizedPersistenceDelegateTest.java:43)
Test: testMethodPDClass: org.apache.harmony.beans.tests.java.beans.CustomizedPersistenceDelegateTestjava.lang.NoClassDefFoundError: org/apache/harmony/beans/tests/java/beans/CustomizedPersistenceDelegateTest$MockEncoder
	at org.apache.harmony.beans.tests.java.beans.CustomizedPersistenceDelegateTest.setUp(CustomizedPersistenceDelegateTest.java:43)
Test: testFieldPDClass: org.apache.harmony.beans.tests.java.beans.CustomizedPersistenceDelegateTestjava.lang.NoClassDefFoundError: org/apache/harmony/beans/tests/java/beans/CustomizedPersistenceDelegateTest$MockEncoder
	at org.apache.harmony.beans.tests.java.beans.CustomizedPersistenceDelegateTest.setUp(CustomizedPersistenceDelegateTest.java:43)
Test: testInstantiate_NormalClass: org.apache.harmony.beans.tests.java.beans.DefaultPersistenceDelegateTestjava.lang.NoClassDefFoundError: java/beans/Encoder
	at org.apache.harmony.beans.tests.java.beans.DefaultPersistenceDelegateTest.testInstantiate_Normal(DefaultPersistenceDelegateTest.java:111)
	at java.lang.reflect.VMReflection.invokeMethod(VMReflection.java)
Test: testInstantiate_NullInstanceClass: org.apache.harmony.beans.tests.java.beans.DefaultPersistenceDelegateTestjava.lang.NoClassDefFoundError: java/beans/Encoder
	at org.apache.harmony.beans.tests.java.beans.DefaultPersistenceDelegateTest.testInstantiate_NullInstance(DefaultPersistenceDelegateTest.java:127)
	at java.lang.reflect.VMReflection.invokeMethod(VMReflection.java)
Test: testInstantiate_NullPropertyClass: org.apache.harmony.beans.tests.java.beans.DefaultPersistenceDelegateTestjava.lang.NoClassDefFoundError: java/beans/Encoder
	at org.apache.harmony.beans.tests.java.beans.DefaultPersistenceDelegateTest.testInstantiate_NullProperty(DefaultPersistenceDelegateTest.java:161)
	at java.lang.reflect.VMReflection.invokeMethod(VMReflection.java)
Test: testInstantiate_NoPropertyClass: org.apache.harmony.beans.tests.java.beans.DefaultPersistenceDelegateTestjava.lang.NoClassDefFoundError: java/beans/Encoder
	at org.apache.harmony.beans.tests.java.beans.DefaultPersistenceDelegateTest.testInstantiate_NoProperty(DefaultPersistenceDelegateTest.java:188)
	at java.lang.reflect.VMReflection.invokeMethod(VMReflection.java)
Test: testInstantiate_NonExistingGetterClass: org.apache.harmony.beans.tests.java.beans.DefaultPersistenceDelegateTestjava.lang.NoClassDefFoundError: java/beans/Encoder
	at org.apache.harmony.beans.tests.java.beans.DefaultPersistenceDelegateTest.testInstantiate_NonExistingGetter(DefaultPersistenceDelegateTest.java:204)
	at java.lang.reflect.VMReflection.invokeMethod(VMReflection.java)
Test: testInstantiate_InvalidGetterClass: org.apache.harmony.beans.tests.java.beans.DefaultPersistenceDelegateTestjava.lang.NoClassDefFoundError: java/beans/Encoder
	at org.apache.harmony.beans.tests.java.beans.DefaultPersistenceDelegateTest.testInstantiate_InvalidGetter(DefaultPersistenceDelegateTest.java:257)
	at java.lang.reflect.VMReflection.invokeMethod(VMReflection.java)
Test: testInstantiate_ExceptionalGetterClass: org.apache.harmony.beans.tests.java.beans.DefaultPersistenceDelegateTestjava.lang.NoClassDefFoundError: java/beans/Encoder
	at org.apache.harmony.beans.tests.java.beans.DefaultPersistenceDelegateTest.testInstantiate_ExceptionalGetter(DefaultPersistenceDelegateTest.java:275)
	at java.lang.reflect.VMReflection.invokeMethod(VMReflection.java)
Test: testInstantiate_ErrorGetterClass: org.apache.harmony.beans.tests.java.beans.DefaultPersistenceDelegateTestjava.lang.NoClassDefFoundError: java/beans/Encoder
	at org.apache.harmony.beans.tests.java.beans.DefaultPersistenceDelegateTest.testInstantiate_ErrorGetter(DefaultPersistenceDelegateTest.java:293)
	at java.lang.reflect.VMReflection.invokeMethod(VMReflection.java)
Test: testInstantiate_PrivateGetterClass: org.apache.harmony.beans.tests.java.beans.DefaultPersistenceDelegateTestjava.lang.NoClassDefFoundError: java/beans/Encoder
	at org.apache.harmony.beans.tests.java.beans.DefaultPersistenceDelegateTest.testInstantiate_PrivateGetter(DefaultPersistenceDelegateTest.java:311)
	at java.lang.reflect.VMReflection.invokeMethod(VMReflection.java)
Test: testInstantiate_InitialUpperCasePropNameClass: org.apache.harmony.beans.tests.java.beans.DefaultPersistenceDelegateTestjava.lang.NoClassDefFoundError: java/beans/Encoder
	at org.apache.harmony.beans.tests.java.beans.DefaultPersistenceDelegateTest.testInstantiate_InitialUpperCasePropName(DefaultPersistenceDelegateTest.java:329)
	at java.lang.reflect.VMReflection.invokeMethod(VMReflection.java)
Test: testInstantiate_NoGetterClass: org.apache.harmony.beans.tests.java.beans.DefaultPersistenceDelegateTestjava.lang.NoClassDefFoundError: java/beans/Encoder
	at org.apache.harmony.beans.tests.java.beans.DefaultPersistenceDelegateTest.testInstantiate_NoGetter(DefaultPersistenceDelegateTest.java:342)
	at java.lang.reflect.VMReflection.invokeMethod(VMReflection.java)
Test: testInstantiate_NotRegularGetterClass: org.apache.harmony.beans.tests.java.beans.DefaultPersistenceDelegateTestjava.lang.NoClassDefFoundError: java/beans/Encoder
	at org.apache.harmony.beans.tests.java.beans.DefaultPersistenceDelegateTest.testInstantiate_NotRegularGetter(DefaultPersistenceDelegateTest.java:368)
	at java.lang.reflect.VMReflection.invokeMethod(VMReflection.java)
Test: test_initializeClass: org.apache.harmony.beans.tests.java.beans.DefaultPersistenceDelegateTestjava.lang.NoClassDefFoundError: java/beans/Encoder
	at org.apache.harmony.beans.tests.java.beans.DefaultPersistenceDelegateTest.test_initialize(DefaultPersistenceDelegateTest.java:503)
	at java.lang.reflect.VMReflection.invokeMethod(VMReflection.java)
Test: testInitialize_NormalClass: org.apache.harmony.beans.tests.java.beans.DefaultPersistenceDelegateTestjava.lang.NoClassDefFoundError: java/beans/Encoder
	at org.apache.harmony.beans.tests.java.beans.DefaultPersistenceDelegateTest.testInitialize_Normal(DefaultPersistenceDelegateTest.java:595)
	at java.lang.reflect.VMReflection.invokeMethod(VMReflection.java)
Test: testInitialize_NormalBeanInfoClass: org.apache.harmony.beans.tests.java.beans.DefaultPersistenceDelegateTestjava.lang.NoClassDefFoundError: org/apache/harmony/beans/tests/java/beans/DefaultPersistenceDelegateTest$CollectingEncoder
	at org.apache.harmony.beans.tests.java.beans.DefaultPersistenceDelegateTest.testInitialize_NormalBeanInfo(DefaultPersistenceDelegateTest.java:624)
	at java.lang.reflect.VMReflection.invokeMethod(VMReflection.java)
Test: testInitialize_TransientPropertyClass: org.apache.harmony.beans.tests.java.beans.DefaultPersistenceDelegateTestjava.lang.NoClassDefFoundError: org/apache/harmony/beans/tests/java/beans/DefaultPersistenceDelegateTest$CollectingEncoder
	at org.apache.harmony.beans.tests.java.beans.DefaultPersistenceDelegateTest.testInitialize_TransientProperty(DefaultPersistenceDelegateTest.java:666)
	at java.lang.reflect.VMReflection.invokeMethod(VMReflection.java)
Test: testInitialize_NoSetterClass: org.apache.harmony.beans.tests.java.beans.DefaultPersistenceDelegateTestjava.lang.NoClassDefFoundError: org/apache/harmony/beans/tests/java/beans/DefaultPersistenceDelegateTest$MockEncoder
	at org.apache.harmony.beans.tests.java.beans.DefaultPersistenceDelegateTest.testInitialize_NoSetter(DefaultPersistenceDelegateTest.java:688)
	at java.lang.reflect.VMReflection.invokeMethod(VMReflection.java)
Test: testInitialize_NoGetterClass: org.apache.harmony.beans.tests.java.beans.DefaultPersistenceDelegateTestjava.lang.NoClassDefFoundError: org/apache/harmony/beans/tests/java/beans/DefaultPersistenceDelegateTest$MockEncoder
	at org.apache.harmony.beans.tests.java.beans.DefaultPersistenceDelegateTest.testInitialize_NoGetter(DefaultPersistenceDelegateTest.java:715)
	at java.lang.reflect.VMReflection.invokeMethod(VMReflection.java)
Test: testInitialize_NullClassClass: org.apache.harmony.beans.tests.java.beans.DefaultPersistenceDelegateTestjava.lang.NoClassDefFoundError: java/beans/Encoder
	at org.apache.harmony.beans.tests.java.beans.DefaultPersistenceDelegateTest.testInitialize_NullClass(DefaultPersistenceDelegateTest.java:739)
	at java.lang.reflect.VMReflection.invokeMethod(VMReflection.java)
Test: testInitialize_NullInstancesClass: org.apache.harmony.beans.tests.java.beans.DefaultPersistenceDelegateTestjava.lang.NoClassDefFoundError: java/beans/Encoder
	at org.apache.harmony.beans.tests.java.beans.DefaultPersistenceDelegateTest.testInitialize_NullInstances(DefaultPersistenceDelegateTest.java:763)
	at java.lang.reflect.VMReflection.invokeMethod(VMReflection.java)
Test: testArrayPD_NormalClass: org.apache.harmony.beans.tests.java.beans.DefaultPersistenceDelegateTestjava.lang.NoClassDefFoundError: org/apache/harmony/beans/tests/java/beans/DefaultPersistenceDelegateTest$MockEncoder
	at org.apache.harmony.beans.tests.java.beans.DefaultPersistenceDelegateTest.testArrayPD_Normal(DefaultPersistenceDelegateTest.java:803)
	at java.lang.reflect.VMReflection.invokeMethod(VMReflection.java)
Test: testGetExceptionListenerClass: org.apache.harmony.beans.tests.java.beans.EncoderTestjava.lang.NoClassDefFoundError: java/beans/Encoder
	at org.apache.harmony.beans.tests.java.beans.EncoderTest.testGetExceptionListener(EncoderTest.java:228)
	at java.lang.reflect.VMReflection.invokeMethod(VMReflection.java)
Test: testSetExceptionListener_NullClass: org.apache.harmony.beans.tests.java.beans.EncoderTestjava.lang.NoClassDefFoundError: org/apache/harmony/beans/tests/java/beans/EncoderTest$MockEncoder
	at org.apache.harmony.beans.tests.java.beans.EncoderTest.testSetExceptionListener_Null(EncoderTest.java:240)
	at java.lang.reflect.VMReflection.invokeMethod(VMReflection.java)
Test: testSetExceptionListenerClass: org.apache.harmony.beans.tests.java.beans.EncoderTestjava.lang.NoClassDefFoundError: org/apache/harmony/beans/tests/java/beans/EncoderTest$MockEncoder
	at org.apache.harmony.beans.tests.java.beans.EncoderTest.testSetExceptionListener(EncoderTest.java:252)
	at java.lang.reflect.VMReflection.invokeMethod(VMReflection.java)
Test: testWriteExpression_NullClass: org.apache.harmony.beans.tests.java.beans.EncoderTestjava.lang.NoClassDefFoundError: java/beans/Encoder
	at org.apache.harmony.beans.tests.java.beans.EncoderTest.testWriteExpression_Null(EncoderTest.java:268)
	at java.lang.reflect.VMReflection.invokeMethod(VMReflection.java)
Test: testWriteStatement_NullClass: org.apache.harmony.beans.tests.java.beans.EncoderTestjava.lang.NoClassDefFoundError: java/beans/Encoder
	at org.apache.harmony.beans.tests.java.beans.EncoderTest.testWriteStatement_Null(EncoderTest.java:282)
	at java.lang.reflect.VMReflection.invokeMethod(VMReflection.java)
Test: testWriteObject_NullClass: org.apache.harmony.beans.tests.java.beans.EncoderTestjava.lang.NoClassDefFoundError: java/beans/Encoder
	at org.apache.harmony.beans.tests.java.beans.EncoderTest.testWriteObject_Null(EncoderTest.java:293)
	at java.lang.reflect.VMReflection.invokeMethod(VMReflection.java)
Test: testWriteObjectClass: org.apache.harmony.beans.tests.java.beans.EncoderTestjava.lang.NoClassDefFoundError: org/apache/harmony/beans/tests/java/beans/EncoderTest$VerboseEncoder
	at org.apache.harmony.beans.tests.java.beans.EncoderTest.testWriteObject(EncoderTest.java:304)
	at java.lang.reflect.VMReflection.invokeMethod(VMReflection.java)
Test: testGetPersistenceDelegate_NullClass: org.apache.harmony.beans.tests.java.beans.EncoderTestjava.lang.NoClassDefFoundError: java/beans/Encoder
	at org.apache.harmony.beans.tests.java.beans.EncoderTest.testGetPersistenceDelegate_Null(EncoderTest.java:363)
	at java.lang.reflect.VMReflection.invokeMethod(VMReflection.java)
Test: testGetPersistenceDelegate_ArrayClassClass: org.apache.harmony.beans.tests.java.beans.EncoderTestjava.lang.NoClassDefFoundError: java/beans/Encoder
	at org.apache.harmony.beans.tests.java.beans.EncoderTest.testGetPersistenceDelegate_ArrayClass(EncoderTest.java:369)
	at java.lang.reflect.VMReflection.invokeMethod(VMReflection.java)
Test: testGetPersistenceDelegate_ProxyClassClass: org.apache.harmony.beans.tests.java.beans.EncoderTestjava.lang.NoClassDefFoundError: java/beans/Encoder
	at org.apache.harmony.beans.tests.java.beans.EncoderTest.testGetPersistenceDelegate_ProxyClass(EncoderTest.java:375)
	at java.lang.reflect.VMReflection.invokeMethod(VMReflection.java)
Test: testGetPersistenceDelegate_BeanInfoClass: org.apache.harmony.beans.tests.java.beans.EncoderTestjava.lang.NoClassDefFoundError: java/beans/Encoder
	at org.apache.harmony.beans.tests.java.beans.EncoderTest.testGetPersistenceDelegate_BeanInfo(EncoderTest.java:381)
	at java.lang.reflect.VMReflection.invokeMethod(VMReflection.java)
Test: testGetPersistenceDelegate_DefaultClass: org.apache.harmony.beans.tests.java.beans.EncoderTestjava.lang.NoClassDefFoundError: java/beans/Encoder
	at org.apache.harmony.beans.tests.java.beans.EncoderTest.testGetPersistenceDelegate_Default(EncoderTest.java:388)
	at java.lang.reflect.VMReflection.invokeMethod(VMReflection.java)
Test: testSetPersistenceDelegate_NullClass: org.apache.harmony.beans.tests.java.beans.EncoderTestjava.lang.NoClassDefFoundError: java/beans/Encoder
	at org.apache.harmony.beans.tests.java.beans.EncoderTest.testSetPersistenceDelegate_Null(EncoderTest.java:407)
	at java.lang.reflect.VMReflection.invokeMethod(VMReflection.java)
Test: testSetPersistenceDelegateClass: org.apache.harmony.beans.tests.java.beans.EncoderTestjava.lang.NoClassDefFoundError: java/beans/Encoder
	at org.apache.harmony.beans.tests.java.beans.EncoderTest.testSetPersistenceDelegate(EncoderTest.java:426)
	at java.lang.reflect.VMReflection.invokeMethod(VMReflection.java)
Test: testGet_NullParamClass: org.apache.harmony.beans.tests.java.beans.EncoderTestjava.lang.NoClassDefFoundError: java/beans/Encoder
	at org.apache.harmony.beans.tests.java.beans.EncoderTest.testGet_NullParam(EncoderTest.java:438)
	at java.lang.reflect.VMReflection.invokeMethod(VMReflection.java)
Test: testGet_StringClass: org.apache.harmony.beans.tests.java.beans.EncoderTestjava.lang.NoClassDefFoundError: java/beans/Encoder
	at org.apache.harmony.beans.tests.java.beans.EncoderTest.testGet_String(EncoderTest.java:444)
	at java.lang.reflect.VMReflection.invokeMethod(VMReflection.java)
Test: testGet_IntegerClass: org.apache.harmony.beans.tests.java.beans.EncoderTestjava.lang.NoClassDefFoundError: org/apache/harmony/beans/tests/java/beans/EncoderTest$MockEncoder
	at org.apache.harmony.beans.tests.java.beans.EncoderTest.testGet_Integer(EncoderTest.java:451)
	at java.lang.reflect.VMReflection.invokeMethod(VMReflection.java)
Test: testRemove_NullClass: org.apache.harmony.beans.tests.java.beans.EncoderTestjava.lang.NoClassDefFoundError: java/beans/Encoder
	at org.apache.harmony.beans.tests.java.beans.EncoderTest.testRemove_Null(EncoderTest.java:466)
	at java.lang.reflect.VMReflection.invokeMethod(VMReflection.java)
Test: testRemove_StringClass: org.apache.harmony.beans.tests.java.beans.EncoderTestjava.lang.NoClassDefFoundError: org/apache/harmony/beans/tests/java/beans/EncoderTest$MockEncoder
	at org.apache.harmony.beans.tests.java.beans.EncoderTest.testRemove_String(EncoderTest.java:472)
	at java.lang.reflect.VMReflection.invokeMethod(VMReflection.java)
Test: testRemove_IntegerClass: org.apache.harmony.beans.tests.java.beans.EncoderTestjava.lang.NoClassDefFoundError: org/apache/harmony/beans/tests/java/beans/EncoderTest$MockEncoder
	at org.apache.harmony.beans.tests.java.beans.EncoderTest.testRemove_Integer(EncoderTest.java:484)
	at java.lang.reflect.VMReflection.invokeMethod(VMReflection.java)
Test: testWriteObject_NormalMutatesToTrueClass: org.apache.harmony.beans.tests.java.beans.PersistenceDelegateTestjava.lang.NoClassDefFoundError: java/beans/Encoder
	at org.apache.harmony.beans.tests.java.beans.PersistenceDelegateTest.testWriteObject_NormalMutatesToTrue(PersistenceDelegateTest.java:56)
	at java.lang.reflect.VMReflection.invokeMethod(VMReflection.java)
Test: testWriteObject_NormalMutatesToFalseClass: org.apache.harmony.beans.tests.java.beans.PersistenceDelegateTestjava.lang.NoClassDefFoundError: org/apache/harmony/beans/tests/java/beans/PersistenceDelegateTest$MockEncoder2
	at org.apache.harmony.beans.tests.java.beans.PersistenceDelegateTest.testWriteObject_NormalMutatesToFalse(PersistenceDelegateTest.java:71)
	at java.lang.reflect.VMReflection.invokeMethod(VMReflection.java)
Test: testWriteObject_NullObjectClass: org.apache.harmony.beans.tests.java.beans.PersistenceDelegateTestjava.lang.NoClassDefFoundError: java/beans/Encoder
	at org.apache.harmony.beans.tests.java.beans.PersistenceDelegateTest.testWriteObject_NullObject(PersistenceDelegateTest.java:86)
	at java.lang.reflect.VMReflection.invokeMethod(VMReflection.java)
Test: testInitialize_NormalClass: org.apache.harmony.beans.tests.java.beans.PersistenceDelegateTestjava.lang.NoClassDefFoundError: java/beans/Encoder
	at org.apache.harmony.beans.tests.java.beans.PersistenceDelegateTest.testInitialize_Normal(PersistenceDelegateTest.java:116)
	at java.lang.reflect.VMReflection.invokeMethod(VMReflection.java)
Test: testInitialize_NullClassClass: org.apache.harmony.beans.tests.java.beans.PersistenceDelegateTestjava.lang.NoClassDefFoundError: java/beans/Encoder
	at org.apache.harmony.beans.tests.java.beans.PersistenceDelegateTest.testInitialize_NullClass(PersistenceDelegateTest.java:137)
	at java.lang.reflect.VMReflection.invokeMethod(VMReflection.java)
Test: testInitialize_NullInstancesClass: org.apache.harmony.beans.tests.java.beans.PersistenceDelegateTestjava.lang.NoClassDefFoundError: java/beans/Encoder
	at org.apache.harmony.beans.tests.java.beans.PersistenceDelegateTest.testInitialize_NullInstances(PersistenceDelegateTest.java:156)
	at java.lang.reflect.VMReflection.invokeMethod(VMReflection.java)
Test: testInitialize_circularRedundancyClass: org.apache.harmony.beans.tests.java.beans.PersistenceDelegateTestjava.lang.NoClassDefFoundError: java/beans/Encoder
	at org.apache.harmony.beans.tests.java.beans.PersistenceDelegateTest.testInitialize_circularRedundancy(PersistenceDelegateTest.java:182)
	at java.lang.reflect.VMReflection.invokeMethod(VMReflection.java)
Test: test_writeObject_Null_LXMLEncoderClass: org.apache.harmony.beans.tests.java.beans.PersistenceDelegateTestjava.lang.NoClassDefFoundError: java/beans/Encoder
	at org.apache.harmony.beans.tests.java.beans.PersistenceDelegateTest.test_writeObject_Null_LXMLEncoder(PersistenceDelegateTest.java:217)
	at java.lang.reflect.VMReflection.invokeMethod(VMReflection.java)
Test: test_writeObject_java_lang_reflect_FieldClass: org.apache.harmony.beans.tests.java.beans.PersistenceDelegateTestjava.lang.NoClassDefFoundError: java/beans/XMLEncoder
	at org.apache.harmony.beans.tests.java.beans.PersistenceDelegateTest.test_writeObject_java_lang_reflect_Field(PersistenceDelegateTest.java:243)
	at java.lang.reflect.VMReflection.invokeMethod(VMReflection.java)
Test: test_writeObject_java_lang_reflect_MethodClass: org.apache.harmony.beans.tests.java.beans.PersistenceDelegateTestjava.lang.NoClassDefFoundError: java/beans/XMLEncoder
	at org.apache.harmony.beans.tests.java.beans.PersistenceDelegateTest.test_writeObject_java_lang_reflect_Method(PersistenceDelegateTest.java:262)
	at java.lang.reflect.VMReflection.invokeMethod(VMReflection.java)
Test: test_writeObject_java_util_CollectionClass: org.apache.harmony.beans.tests.java.beans.PersistenceDelegateTestjava.lang.NoClassDefFoundError: java/beans/XMLEncoder
	at org.apache.harmony.beans.tests.java.beans.PersistenceDelegateTest.test_writeObject_java_util_Collection(PersistenceDelegateTest.java:280)
	at java.lang.reflect.VMReflection.invokeMethod(VMReflection.java)
Test: test_writeObject_java_awt_ChoiceClass: org.apache.harmony.beans.tests.java.beans.PersistenceDelegateTestjava.lang.NoClassDefFoundError: java/beans/XMLEncoder
	at org.apache.harmony.beans.tests.java.beans.PersistenceDelegateTest.test_writeObject_java_awt_Choice(PersistenceDelegateTest.java:301)
	at java.lang.reflect.VMReflection.invokeMethod(VMReflection.java)
Test: test_writeObject_java_awt_SystemColorClass: org.apache.harmony.beans.tests.java.beans.PersistenceDelegateTestjava.lang.NoClassDefFoundError: java/beans/XMLEncoder
	at org.apache.harmony.beans.tests.java.beans.PersistenceDelegateTest.test_writeObject_java_awt_SystemColor(PersistenceDelegateTest.java:433)
	at java.lang.reflect.VMReflection.invokeMethod(VMReflection.java)
Test: test_writeObject_java_awt_font_TextAttributeClass: org.apache.harmony.beans.tests.java.beans.PersistenceDelegateTestjava.lang.NoClassDefFoundError: java/beans/XMLEncoder
	at org.apache.harmony.beans.tests.java.beans.PersistenceDelegateTest.test_writeObject_java_awt_font_TextAttribute(PersistenceDelegateTest.java:447)
	at java.lang.reflect.VMReflection.invokeMethod(VMReflection.java)
Test: test_writeObject_java_awt_MenuShortcutClass: org.apache.harmony.beans.tests.java.beans.PersistenceDelegateTestjava.lang.NoClassDefFoundError: java/beans/XMLEncoder
	at org.apache.harmony.beans.tests.java.beans.PersistenceDelegateTest.test_writeObject_java_awt_MenuShortcut(PersistenceDelegateTest.java:461)
	at java.lang.reflect.VMReflection.invokeMethod(VMReflection.java)
Test: test_writeObject_java_awt_ComponentClass: org.apache.harmony.beans.tests.java.beans.PersistenceDelegateTestjava.lang.NoClassDefFoundError: java/beans/XMLEncoder
	at org.apache.harmony.beans.tests.java.beans.PersistenceDelegateTest.test_writeObject_java_awt_Component(PersistenceDelegateTest.java:484)
	at java.lang.reflect.VMReflection.invokeMethod(VMReflection.java)
Test: test_writeObject_java_awt_ContainerClass: org.apache.harmony.beans.tests.java.beans.PersistenceDelegateTestjava.lang.NoClassDefFoundError: java/beans/XMLEncoder
	at org.apache.harmony.beans.tests.java.beans.PersistenceDelegateTest.test_writeObject_java_awt_Container(PersistenceDelegateTest.java:520)
	at java.lang.reflect.VMReflection.invokeMethod(VMReflection.java)
Test: test_writeObject_java_awt_MenuClass: org.apache.harmony.beans.tests.java.beans.PersistenceDelegateTestjava.lang.NoClassDefFoundError: java/beans/XMLEncoder
	at org.apache.harmony.beans.tests.java.beans.PersistenceDelegateTest.test_writeObject_java_awt_Menu(PersistenceDelegateTest.java:593)
	at java.lang.reflect.VMReflection.invokeMethod(VMReflection.java)
Test: test_writeObject_java_awt_MenuBarClass: org.apache.harmony.beans.tests.java.beans.PersistenceDelegateTestjava.lang.NoClassDefFoundError: java/beans/XMLEncoder
	at org.apache.harmony.beans.tests.java.beans.PersistenceDelegateTest.test_writeObject_java_awt_MenuBar(PersistenceDelegateTest.java:628)
	at java.lang.reflect.VMReflection.invokeMethod(VMReflection.java)
Test: test_writeObject_java_awt_ListClass: org.apache.harmony.beans.tests.java.beans.PersistenceDelegateTestjava.lang.NoClassDefFoundError: java/beans/XMLEncoder
	at org.apache.harmony.beans.tests.java.beans.PersistenceDelegateTest.test_writeObject_java_awt_List(PersistenceDelegateTest.java:646)
	at java.lang.reflect.VMReflection.invokeMethod(VMReflection.java)
Test: test_writeObject_java_awt_BorderLayoutClass: org.apache.harmony.beans.tests.java.beans.PersistenceDelegateTestjava.lang.NoClassDefFoundError: java/beans/XMLEncoder
	at org.apache.harmony.beans.tests.java.beans.PersistenceDelegateTest.test_writeObject_java_awt_BorderLayout(PersistenceDelegateTest.java:668)
	at java.lang.reflect.VMReflection.invokeMethod(VMReflection.java)
Test: test_writeObject_java_awt_CardLayoutClass: org.apache.harmony.beans.tests.java.beans.PersistenceDelegateTestjava.lang.NoClassDefFoundError: java/beans/XMLEncoder
	at org.apache.harmony.beans.tests.java.beans.PersistenceDelegateTest.test_writeObject_java_awt_CardLayout(PersistenceDelegateTest.java:686)
	at java.lang.reflect.VMReflection.invokeMethod(VMReflection.java)
Test: test_writeObject_java_awt_GridBagLayoutClass: org.apache.harmony.beans.tests.java.beans.PersistenceDelegateTestjava.lang.NoClassDefFoundError: java/beans/XMLEncoder
	at org.apache.harmony.beans.tests.java.beans.PersistenceDelegateTest.test_writeObject_java_awt_GridBagLayout(PersistenceDelegateTest.java:705)
	at java.lang.reflect.VMReflection.invokeMethod(VMReflection.java)
Test: test_writeObject_java_awt_CursorClass: org.apache.harmony.beans.tests.java.beans.PersistenceDelegateTestjava.lang.NoClassDefFoundError: java/beans/XMLEncoder
	at org.apache.harmony.beans.tests.java.beans.PersistenceDelegateTest.test_writeObject_java_awt_Cursor(PersistenceDelegateTest.java:726)
	at java.lang.reflect.VMReflection.invokeMethod(VMReflection.java)
Test: test_writeObject_java_awt_InsetsClass: org.apache.harmony.beans.tests.java.beans.PersistenceDelegateTestjava.lang.NoClassDefFoundError: java/beans/XMLEncoder
	at org.apache.harmony.beans.tests.java.beans.PersistenceDelegateTest.test_writeObject_java_awt_Insets(PersistenceDelegateTest.java:743)
	at java.lang.reflect.VMReflection.invokeMethod(VMReflection.java)
Test: test_writeObject_java_awt_pointClass: org.apache.harmony.beans.tests.java.beans.PersistenceDelegateTestjava.lang.NoClassDefFoundError: java/beans/XMLEncoder
	at org.apache.harmony.beans.tests.java.beans.PersistenceDelegateTest.test_writeObject_java_awt_point(PersistenceDelegateTest.java:759)
	at java.lang.reflect.VMReflection.invokeMethod(VMReflection.java)
Test: test_writeObject_java_awt_ScrollPaneClass: org.apache.harmony.beans.tests.java.beans.PersistenceDelegateTestjava.lang.NoClassDefFoundError: java/beans/XMLEncoder
	at org.apache.harmony.beans.tests.java.beans.PersistenceDelegateTest.test_writeObject_java_awt_ScrollPane(PersistenceDelegateTest.java:775)
	at java.lang.reflect.VMReflection.invokeMethod(VMReflection.java)
Test: test_writeObject_java_util_MapClass: org.apache.harmony.beans.tests.java.beans.PersistenceDelegateTestjava.lang.NoClassDefFoundError: java/beans/XMLEncoder
	at org.apache.harmony.beans.tests.java.beans.PersistenceDelegateTest.test_writeObject_java_util_Map(PersistenceDelegateTest.java:794)
	at java.lang.reflect.VMReflection.invokeMethod(VMReflection.java)
Test: test_writeObject_java_util_ListClass: org.apache.harmony.beans.tests.java.beans.PersistenceDelegateTestjava.lang.NoClassDefFoundError: java/beans/XMLEncoder
	at org.apache.harmony.beans.tests.java.beans.PersistenceDelegateTest.test_writeObject_java_util_List(PersistenceDelegateTest.java:811)
	at java.lang.reflect.VMReflection.invokeMethod(VMReflection.java)
Test: test_writeObject_java_util_AbstractListClass: org.apache.harmony.beans.tests.java.beans.PersistenceDelegateTestjava.lang.NoClassDefFoundError: java/beans/XMLEncoder
	at org.apache.harmony.beans.tests.java.beans.PersistenceDelegateTest.test_writeObject_java_util_AbstractList(PersistenceDelegateTest.java:853)
	at java.lang.reflect.VMReflection.invokeMethod(VMReflection.java)
Test: test_writeObject_java_util_AbstractMapClass: org.apache.harmony.beans.tests.java.beans.PersistenceDelegateTestjava.lang.NoClassDefFoundError: java/beans/XMLEncoder
	at org.apache.harmony.beans.tests.java.beans.PersistenceDelegateTest.test_writeObject_java_util_AbstractMap(PersistenceDelegateTest.java:870)
	at java.lang.reflect.VMReflection.invokeMethod(VMReflection.java)
Test: test_writeObject_javax_swing_JFrameClass: org.apache.harmony.beans.tests.java.beans.PersistenceDelegateTestjava.lang.NoClassDefFoundError: java/beans/XMLEncoder
	at org.apache.harmony.beans.tests.java.beans.PersistenceDelegateTest.test_writeObject_javax_swing_JFrame(PersistenceDelegateTest.java:890)
	at java.lang.reflect.VMReflection.invokeMethod(VMReflection.java)
Test: test_writeObject_javax_swing_DefaultListModelClass: org.apache.harmony.beans.tests.java.beans.PersistenceDelegateTestjava.lang.NoClassDefFoundError: java/beans/XMLEncoder
	at org.apache.harmony.beans.tests.java.beans.PersistenceDelegateTest.test_writeObject_javax_swing_DefaultListModel(PersistenceDelegateTest.java:909)
	at java.lang.reflect.VMReflection.invokeMethod(VMReflection.java)
Test: test_writeObject_javax_swing_DefaultComboBoxModelClass: org.apache.harmony.beans.tests.java.beans.PersistenceDelegateTestjava.lang.NoClassDefFoundError: java/beans/XMLEncoder
	at org.apache.harmony.beans.tests.java.beans.PersistenceDelegateTest.test_writeObject_javax_swing_DefaultComboBoxModel(PersistenceDelegateTest.java:929)
	at java.lang.reflect.VMReflection.invokeMethod(VMReflection.java)
Test: test_writeObject_javax_swing_tree_DefaultMutableTreeNodeClass: org.apache.harmony.beans.tests.java.beans.PersistenceDelegateTestjava.lang.NoClassDefFoundError: java/beans/XMLEncoder
	at org.apache.harmony.beans.tests.java.beans.PersistenceDelegateTest.test_writeObject_javax_swing_tree_DefaultMutableTreeNode(PersistenceDelegateTest.java:947)
	at java.lang.reflect.VMReflection.invokeMethod(VMReflection.java)
Test: test_writeObject_javax_swing_ToolTipManagerClass: org.apache.harmony.beans.tests.java.beans.PersistenceDelegateTestjava.lang.NoClassDefFoundError: java/beans/XMLEncoder
	at org.apache.harmony.beans.tests.java.beans.PersistenceDelegateTest.test_writeObject_javax_swing_ToolTipManager(PersistenceDelegateTest.java:962)
	at java.lang.reflect.VMReflection.invokeMethod(VMReflection.java)
Test: test_writeExpression_writeObjectClass: org.apache.harmony.beans.tests.java.beans.PersistenceDelegateTestjava.lang.NoClassDefFoundError: java/beans/XMLEncoder
	at org.apache.harmony.beans.tests.java.beans.PersistenceDelegateTest.test_writeExpression_writeObject(PersistenceDelegateTest.java:1013)
	at java.lang.reflect.VMReflection.invokeMethod(VMReflection.java)
Test: testFontEditorClass: org.apache.harmony.beans.tests.java.beans.PropertyEditorManagerTestjava.lang.NullPointerException
	at org.apache.harmony.beans.tests.java.beans.PropertyEditorManagerTest.testFontEditor(PropertyEditorManagerTest.java:733)
	at java.lang.reflect.VMReflection.invokeMethod(VMReflection.java)
Test: testLoadImageClass: org.apache.harmony.beans.tests.java.beans.SimpleBeanInfoTestjava.lang.NullPointerException
	at java.awt.Toolkit.init(Toolkit.java:565)
	at java.awt.Toolkit.<init>(Toolkit.java:539)
	at java.awt.ToolkitImpl.<init>(ToolkitImpl.java:39)
	at java.awt.Toolkit.getDefaultToolkit(Toolkit.java:471)
	at java.beans.SimpleBeanInfo.loadImage(SimpleBeanInfo.java:38)
	at org.apache.harmony.beans.tests.java.beans.SimpleBeanInfoTest.testLoadImage(SimpleBeanInfoTest.java:84)
	at java.lang.reflect.VMReflection.invokeMethod(VMReflection.java)
Test: testAvoidGuiClass: org.apache.harmony.beans.tests.java.beans.beancontext.BeanContextSupportTestjava.lang.NullPointerException
	at java.awt.Toolkit.init(Toolkit.java:565)
	at java.awt.Toolkit.<init>(Toolkit.java:539)
	at java.awt.ToolkitImpl.<init>(ToolkitImpl.java:39)
	at java.awt.Toolkit.getDefaultToolkit(Toolkit.java:471)
	at java.awt.Component.<init>(Component.java:109)
	at java.awt.Button.<init>(Button.java:141)
	at java.awt.Button.<init>(Button.java:158)
	at org.apache.harmony.beans.tests.java.beans.beancontext.BeanContextSupportTest.testAvoidGui(BeanContextSupportTest.java:2207)
	at java.lang.reflect.VMReflection.invokeMethod(VMReflection.java)
Test: test_ConstructorLjava_lang_StringZClass: tests.api.java.io.FileOutputStreamTestjava.io.IOException
	at org.apache.harmony.luni.platform.OSFileSystem.close(OSFileSystem.java:208)
	at java.io.FileOutputStream.close(FileOutputStream.java:191)
	at org.apache.harmony.nio.internal.FileChannelImpl.implCloseChannel(FileChannelImpl.java:102)
	at java.nio.channels.spi.AbstractInterruptibleChannel.close(AbstractInterruptibleChannel.java:99)
	at java.io.FileOutputStream.close(FileOutputStream.java:184)
	at tests.api.java.io.FileOutputStreamTest.test_ConstructorLjava_lang_StringZ(FileOutputStreamTest.java:89)
	at java.lang.reflect.VMReflection.invokeMethod(VMReflection.java)
Test: testDefaultValueClass: org.apache.harmony.logging.tests.java.util.logging.FileHandlerTestjunit.framework.ComparisonFailure: expected:<<?xml version="1.0" encoding="8859_1" standalone="no"?>
<!DOCTYPE log SYSTEM "logger.dtd">
<log><record>
    <date>Aug 1, 2007 4:45:34 PM</date>
    <millis>1185961534305</millis>
    <sequence>13</sequence>
    <level>CONFIG</level>
    <thread>0</thread>
    <message>msg</message>
</record>
</log>> but was:<>
	at org.apache.harmony.logging.tests.java.util.logging.FileHandlerTest.assertFileContent(FileHandlerTest.java:223)
	at org.apache.harmony.logging.tests.java.util.logging.FileHandlerTest.assertFileContent(FileHandlerTest.java:188)
	at org.apache.harmony.logging.tests.java.util.logging.FileHandlerTest.testDefaultValue(FileHandlerTest.java:183)
	at java.lang.reflect.VMReflection.invokeMethod(VMReflection.java)

***********************************************************
Modifications since last successful build:	(2)
            
add cc-hdk log20070801161625Lbuild.66 08/01/2007 16:16:25hdk
modified hindessm  /harmony/enhanced/classlib/trunk/modules/awt/src/main/native/win32wrapper/windows/org_apache_harmony_awt_nativebridge_windows_WGL.h 08/01/2007 16:15:45 Fixing inconsistent end-of-line characters

begin 644 execution_log.zip
M4$L#! H    ( *F) 3?A^<*M,D$  ):A P 2    97AE8W5T:6]N7VQO9RYH
M=&UL[7UK4^-(LNC]NOLK=$_,B>V)& L];=EG9NZA@>YA%V@.AIW9Z.A+"+D,
M:F3)*\FT/1'WO]\J238VUB/3=F*[$3/0?DBIJJRLK'SGSP_QP/OUY[N@-_GU
MYV'(?OW9EJ)XXK%?_M8/_+@1N7^RCF0I__E??_OUK^'([_Q5DJ3//>:QF'V1
MCL6_KG\OJ7I3E_JNQR*I'P8#Z8"-AT$8'XPB%D8'CL/_;SC!8!#X!W<CU^L=
MA"P:>3'_RK.CR'/O&C&+8@&;0_]J/]E?I/?B.@&R(R6WR..!MW#!PIN&Z[MQ
MXZ'WV"F^1CQB\>OT-7,>@A>7SG_Q"_"G$, U?ZY 4C)7B4\VM$.71;(L;_:9
M"V\<C]E^@M5&,(J'H^69+Z]BSPV9$P?AI'K]G ?F/'+ T0''^<&W('SD &ZG
MJYE=))Y^&S(!J62@P7"2CI/31# *'1:5K&'RW$8T&@J@C:]V6'9Q([FZ>,F/
MQ-=BXOT@E'ILR/Q>="!@'DR"Q^#V7&MHBM)25%U)/I#Y5YN"Q;$9LHT"# =N
MPQT,O8T#C8;,61'HG<.\ABEKLQ<KPAG;'B?FK[>:W)*5]-VJD)@@, ZH+0 E
M;^0_W>$*D+Z..,>YU66+3R]YO3*.AF'PU/C:>U3-AJJWL@]6A.8Z(^,K'Y4A
M&]/7M\:ML2*TP3@!IO IBI>K8HK%\23]VVAR8,J*HYF',XI=;P/ .'M[XLRO
M80_=AB:;JT+L,7[AJ"%.S-F;..YSD*K54)?0MLBD(LY^G;CQS?4;'%[4&%O-
MVZ91QM9R[BB[/&2VYTU29BANJN28L(LXS8^S0P')8OD)$65'A.<,!-$ZNB$_
M5$_!<WTL.W_Y+/&'_E%#_U[\.H'??[6'T3_HZY#='WP5DW+O9<\?O\[S^!_^
MV6O-;L#/9:?_:LAD81B$JSVL<$\NL0/\)G'ODGW"'SH:RQS>:Y P?RNH^-6>
MF2P ?R_^7>^I92M1P<KG+G9MZ*5E5[%Q'-K\<. RQ+!4-LYF,[U>G.\ N%6B
M>=GWP6#(U;FI\%YRY9QX7S:D>WYP)XK#TR!7QUE2_AI?0R8N=OU^4$PW#Q-9
M7"P_#63?'C#I%ZD7EFB>">!!T!MYY8I+-GOQKH1FDZL$T1X>'9UTNZ?O3\].
MK_^5JHXLJM"B( I4].3GS'_A3;(]*I"?7 .8KL!.A)]O<MO27<E+9_XN2TIG
MG-D>XF!MS35;R0/;X7B,W#O^'"XGWKG^P9*%8GY(7=<7H^#0)#>2^K87L9\D
M]]X/0C', >/'RN3<'KN#T:#K_LFDB(N?_)MB! ZYWFQS<F5CQQOUV++VSH]A
MQXZ_2!>!Q,9N:F%(L6#[/<D/))^/E_4X*L?Q3U(O$-_[0?Q0^M1TE[Q<^>3E
MX+'GAASWG&\(L/Q-9VUD<Z[L!5RDY]\]6PR6B46\"3.+D)B&&"#-LQ>7_38A
MPR5U8.%-./*+B)P$9>66E?2ET$:_2%<CWT^Q]62/Y86)R8?9.X]U8SZVZWS2
M3N&(+R,QSXZD_B1]L%UOQ!E-1U)^DDZ$])*^O'8YJV2>/8Q8CW\@6U:+$[D#
M@6K H:H*&*H%AZJT+"A4'0'5T*%0$7A5-),"*GRL+0Q>51(,+-/ (A,+1LY#
MHY^!:R0VY*JK$SF\\MK&W&&_R;/^XN+3]>'UZ:>+MW#0/T\6>LJ;=*>\SX]$
M.W;%?:]QQ,_#:\Q^"B]19>GWPZN+TXN/DNM33#H*G?3<$P\\",+[ WMH<S '
M#W;(X4[FKTU6*[W0L[F^-O?5J2_(0'@3#F<?GHP=-A0OQ"Z7Q6V%TY3>V;'$
M5YI)IOYCX55_X1/Y\\^?."M@ ^;'%UPV__&_BJ_^O^*G\.OKR9"OD-UG\:0C
M73]P!C/F$A<_$@-?"OI2++X^2OPU/F.]2!KY"7+Y*<[EKB>.?W$A)T1A# G"
M@7B97/[S_^&08J%J2L^H^'4M&N"B8, /ZH'T3I6^V:$XTW\LWH_;D1O+I* 7
MX@@G,CDE,CDC,OF9DN2IQ/5DRX+(YK^ZXN3EBU>7@><Z$ZC,@CBQ6VV2$[L%
M/K$UDA,; U4C@:HO8V#/3^S+R[.3Z[=P6J<3A9[4ZOQ)O=&#>BB.ES>CAQ?P
MTSW?-%='OYW^\V0?=PTJ1 &]QS*\0#>91FCU"IT']XGMVC[;I*R1SE 6#F3Y
MAO\AL'VT6@98CD"8*52S"05K0J'JLJJU293T99-*X2-.QLQ!6\9B.[SG)X)X
M*6QX7\.4:@5TJ>$,R;9$9W,6O&AM6)D1<\Z F?E.A-%R&7JZ%QJV'S=4N2F;
MPOWU'+P"O%Z\\^Q$(0IQMR$?,AN8)/BW=! /A@</DSBZ;;9,8SF4J":OFKPV
M1E[+$5,U>=7D59-735[[25X+$MT#DSX>23U7J*>Q,"\^N3TFW3NW=J]W^XW9
MC[=A$,2W7&:_97X<3MZ5V!MK4JU)=1U2M;;("?M!(-_9H<PX8#Z*).KG0Q!L
MD=@["\@Q$R%W7X:YO+BF7LZ'5@@!T'19AWOKU284+J=7<UEIKSE=S>DVQ>E:
M^7D%,ZH]Z5[7M%?3'@WMY2=>%=+>NO8_4S85N%418594]=JL6&\4NHUBM<N3
MM6KRJLEK#?)J5^0"UN15DU=-7C5YU>15D]?;(Z_:*5*3%R%YM6KN59,7%7DU
ME>7#L<#> 8[-4MNRI8/CL<&F;A$[#HY(QT#5-8HL.A-L2$+D$2K@ #U$NALB
MDDY#C%53P?X.,&F)K 2P?0X3Z=\&TX#:1F"V#<>L@L$L/-\# U8'ISUBDBDM
M, XPF&V"B0NSO;Z_%,V;Z]_V,7 =&XHNI@F-0V\;=''HH_CA>PE"3U/:[*&;
MI+6-9;XQ1J%(PA>3E,>FHLA_\#^7?-"..[3! >D(9F]98$:'.4*:X%,4 554
M$H5"1; D4Z\X\-8,BBH88M,$,V.=3QWN--,1I[*5PXX+X&*J)A@DV?WPX Z,
M6 +.G, X(^'+A4J6!(\5E=@)'BNJQ 4%!U!:-+*I!99-$5!UN'2.6BXP8E'+
M19*)K($)%B5"@H\!# 8H2$!ITJ"5 FB+!"I-UCB<KK8_5AHND),W7P 55>V(
M8K\:1H7*-_^(W;:O"MUC5ACE69LCT6V^'Y-H7JZM4'">*WJ\5'T>67C'PB"2
M_Y&]6%"!?CAF?7ODQ5?,]@:W%R//^Z?MC5A-8#6!41!8=Q+%;' 9!D,6QI.:
MRFHJHZ"RHZ1V]@?78Y#C%^Q\L63+@BOC" E$54DL!_#!HBHBD8CA8 2@AKHO
M0#6+1+ U:-00$K3"MP **LU8MPP58^4QEBU2]4G[AD[:QK&X6GX(!NR7))2"
M_][P3W[C'WP(PO2H'(7VM(8DOT$LW?/I.TR%-9=%Z?WB6T,WFZWI%2L<YEYP
M[_KRTK-_N B>C^[KX#WCQWFO)MVW2[HP2FP34&(WN^IR]LQ<>ER703=E&G&*
MZ(2B,>J1C!7NC#,0QZF14QRLYDEOBB>5'J=G@IUP;B+*4&).TY:R-@][^>CJ
MP[1@/^A@YZPNZXB0,0Q+(%%<]LA] @_'I/%.HZ#2^.5JJ"241>2<II$,]L@U
M211/0N*:)+(+T00H@.4X3( "W.5+0P.8>K1PJ1MC%X);'#%037A<&2:PS*18
M+A4^6!K%8_M030I&H,)#Z#&,@&2QFG#NHF "(>&KA4K2(3ECX$$UJ.0GN/,)
M@UEX6RY4[Q"2+;N,@84W>Y>=\?[D\**[C^D9%7T%TM?B,C';X43,E9/OQM,M
M[ICM1_GY%KGK LXGR9(_ITN3M.)-%RL_R609@NO'+/1M#WE;V=7)RX5,%D,E
MRV0I0>W\6'8SE66*UVDJ"V@Q7N:_)&:F! W)7R<U!,GO^>O,*-1-J>0Z'T$I
MM#\X4CNBW9;/G#AKOO4??A3W0F_L6;++H8O1>3)?I(ZNR\I_2"'K\]7K27<3
MCJ[PB1470$N!7P0B[2,.G,"3HB%SW+[+@$Z>&]^Q1_</L<2F7<]$P[;#WZ\;
M%W;L/K&3)^;'UP\ALWO%"4,)HI*N5Z<9GA,FWI&.DBY84C!DOM1SHZ%G3Z2_
M_:T0SE_L.-=6]RV6O\6/6:OK/[H)2HYF")5_=OG=O[Y;_B+APH92G.\">N"9
M^/N[Z_>";Q]L)^;T/'UBSC?I(YL;>>3U/Q8?Q-\GX-M:.?CGY>"$Y'%<R/\\
MOTI?":SX[%O2\>V4$R&G:O9NX5MQ,Q8\1WD4AR.! 0%]!GC^\V3DFI7;)B\/
M=C+$16C))PF<9ML P!$XO0X"[]&-92=I9<M1^&[Z28I*JV*IE@"E[6A_4%_"
M@4QL#LX/JBR6=A&*:9HK$\[2=I4Y>WRW_&E*H*WBYQ1SA 3,,=_&=NP\P'F"
MB("]#!(./&NMB,/Y/8OG)O(_(S9BBXA353#^<R:18"KO\Q17)6L",)6H2\41
MY"HY_J1[/7_V'(:A/;GDA[D;Q8QOA&/FL7L[[7TL?3@\/3LY7L?FH*]@''@Q
MPF1GKC]", H!301?C+ ;"W%D_2&JF*H*<'L01A-6FQ"5M6!*+^4BC#B4PWQ2
MY#Z[T=:7EE8SZ%DYU57GH>ZV##9/"$7:<,X>L*I,36(/P!=-+%0$V0[U 0$_
M(&KQNA:O:_$: >B[%Z]W^RBJ^57-KVI^5?.K6MI;TQQ0I">V\FK$52AT.#G^
M:!3%P<#]D_765W>-(KU4R]%'(&8-^#2R[,/UYZ 5J53:*I$AFRRVA$/("5>I
M>RS$6GTPQ;;@Y6M,A,%"A_N"383K7D/TJL94*VS#"Y=BBH/!PT_A95;E=D7H
M83<8L$_Q PN%<B]^3_U^(/CG='=E6>.G?H^-W_TH.;;GL9XLRR 6!UXL35;A
ML0NHRI(4U;'@]6N,(M:BY[!YK:J4'8X=K,\84>&-X" 15,@@/ P/41G4A"=I
M8[BC!@]VQ\1@59C::W6Q5A=7>V2M+M;J8JTN[HFZ:!0=&3EZEEX59(T4)#(9
M\*3G\IUV;OOV/5K+4#'!]_!R'QL,CJW/T?H<7>V1]3E:GZ/U.;HGYVB1FI@;
M0E1AD<$=HUUW,/38U,:"M;,B-$:U15*##)$4B#CLM:HXK=7R]^#9EBK&'@$W
M_6&,5"98WD$8.123Q':BTQ2XJZAO5@MGM7"VVB-KX:P6SEY?.%O(B41$+3=;
M@+CJ38;9UJ&<FY8R<Q"Z\&;K&:BEZ7/B%:<8Q^;SX2<B&[N12,;+D@=M7WBU
M)9\_AY^L@I1^DGJ!^)Z?4 ^E27M$Z;%'5_^ZO/ZTC_FQR'33;*+B^EGJ:;(H
M\'OMH0M.&Q4MI8C21IUP,HR#6=[H 1]6X8 VD3M:B1/7_\H/X(2@8<A1E==$
MCCP=W_:P)#37%= TCR5*)(GA[0J6=I"&Q+A(L;(#Q\LLT[O!=TQUMC> (Z9G
M>DEJ4XKFA1*!V4="?92[C(O+\3_8I,O?03.:$+8(2]F\(JYA&CYA F:J.A3.
M047%<53XN6@:'QK@F7-\FB2EM.!&,TRD297RL=I8-7AY*O!@-=E0X82*ZJ0'
M+TN#Z36 J'F$V5;P4E*HJD_PW8I)2VW!6U)OO58=O 8@:JPD&#!)FI62=)PP
MX$W4,8TJFR2U%4D*M]*4$X.W*T9%'M)TZB2A5I(X7Q7>M)B$8Z&@@KD 3?4[
M5'\4\%@Q(<CP 'H:\045C$3A]807ZL-X)PM<J<4JE5QI*5C4K99UI\MNHAI3
MU(& 5]\$0]4P_9<Q1&*1""$&21MRN)Z#TAMIQKH-K1&QY=IP[H!:>)):T<O'
M^2NY.YY-/L+ !;;YE%KIUC#ZS.P]F1?[]I0_",K!P+*>6BWNTY OO+0K'R*\
M;C#B)&["PYH04!&5OC%[K4DBC2'J19$43L;@52&1R%LD,EX!U#(.@I1QBEG)
MM/!HXAD_<H</+.P.72CCP-BVK!PM\;5Y]>L74#X=V/?L="]=Q"N44-8V[TYR
M!0+=.7_2;#@;=&]/5VGKOL67LWTSCK/BX)U%/2U#D)RM&)A1P<4'/4>7>"4^
M1<6#+KK75S?G)Q?7;X0-J08!'TKB( =<9J4HYSZW1% >U"3SX%=-=7M\:%7>
MD2/_S$4K)I&!SY.6;WR.";?OVG<>2R)69Z&">^-(UVAZI^1X_/:;-?[]XOCT
MK3#%]N8YQ5>_YU*PPV19P,*8H$HB5E@\P?FQ["T3%--;L";Y]H!?*D=#5[[B
MI.4],?[/R /71 :;[G0N:,%]O#3!/BC'Z7;;,,&C/319A:=>H;P[)-8?N)L?
M8176X-$Y%B*$Q*QJ]D=D^\10%$W!*9I>?#2N>+ K#.$+,VA<(C1A/O#MC^%5
M+1(?(QPJ*IT3C%;,6-LDJ:?P,P#3VD&'AXX@&*!*TT^;)*>7II\XO"LI*F5>
MIXFA V, 00-*<\M]GU$R"_PX5#"" )QBFQB2;</=2P@ZT."!U1AV"(_XPH3[
MP*5W5! 1/) #U?J8)$(1KA:AFFJ#EPL#%=3K!QE=+\X9.#]L(C(VFO!(712?
M!5-7&Q-6#.<&&,E (T$!_+3%D &-AJ#"Q0T$6!4>+(;98"H\L VU;VE$9+AL
MH*.D69)# :Y]H?@LW/P$=TJ*XO5P0L!0K0K>8J@(:QK+'HD2#K<5T<BSJ/PP
M>)UK#!' M1H-M6W!3 8C'B$R[TB,)J@,.1+K!MQFBJI57X[7%;T(%\G+N:JM
M(#4$$:[1K+!+;V+<[X7+"#Y\Q&*V*Z*B5QS]L1NR) P8B7CXJ:QR^709\?OM
M##X[O/C8.#^\./QX @N6V7ZUEN+KRBL1%$_Z\!+A>37)'*\B)J,Q2*AW%HA"
M7:JE!)GE,?[%V!11^,D$[+1N(!2Q=,$]>8C=H1(=$.=V_C7Y!/^2D<Z%_8QB
MUY.]X/Y><,VS]-_S/T2ALHU[NSFCI[%'DU1B*->/CY(R?#WI7& JK=<H?7/C
M!^GTN"/=G!Y_5A6[:;?57H<K%YK24RRKSSH-2U&4+YU9T<R.NFD$-S??P AE
M.41E+=$(AG#]""/&PS/1$:8"%;X?4+5L*58+CE8,9<'I%979NPSUE82RJH0X
M@$B;!&(^GTUR6OIP6J^Z$.+GL\#N<8XDOCD07/W@*/"R8JC1#]V)[SR$@2\Z
M#G99+/7#8( ]36,[O&=Q\O*K^ W9@3A3[X(@/O#X(/B!$GY!C.\W.WJ(17CI
M#_JVQR-P?I!5@3TX#$-[LJD1"<FBE_9Q.SAX9*'/O-7Q)%Z=QBRTN5:S;92]
M7,(?U"V/:'PP)] =QG'HWHUB=N9&FZ?VP=CX>JO+BJPE+\O'N H35SD/(S'W
MPHN48 ['BH1^B+#4,E2M/Q66[#O#6E%80CC&VZWM1+(A+'(Z7)I!"0A@"0'A
M5T34^Z?Q6F,HMFKIYY8+T^UT>YGX5-:@3Q\_GEY\!&8'<#[XFAD"X(P$DE0"
M@DR"3 ^G2":8+B34^*+1U48MG>7\:-Y>>F>>.I#99HIL-G^<GWT(PH$=QQ46
M;L@IW-8-BTU/X1YKMU8\A3&1^NTVW)>%4 )UH@X\%8<<D<RP< BIY;ET5<&T
M!?T+J@CM ]\'O_%MX#%TXT&,@ HF!AHS@X8RW\!)#!-G#^_P#C=AJ;+9AL<C
MP ,V54R5$8S7&+YD&(%:LT@,I'!> U\QS6QB//*&@N"-\(([J%II$"SL?&\.
MM(A\<_%6LF>;"H$TR(F#1. 5R_+W&TYY*>$!9%Y=I>NX43S-^;'LGIMQ'KE3
M*16 VCQ_HRA+^2Q6_,YE(6$^/+>'4$\CHOZ9)JM5);6()#7XB<R/3IIT4G@Q
M:E1]8Y)H1I) ;)VF:"=%!@D\1PV5IT@1T$HDZ%5U>*6."<#(>22U4!&&4U1!
M/9IT.II<59JN%S35XS=?O1C70 "3/@.WGJ-R$1 IA331$ B]UT D(V BL"D4
M29V@#A(J)@9!!!J\EPA-SH".V0CP+"J:?MR84P:^7#HX@H<+FPA>0'(@8!B7
M!B<#%''1Y*J2G(F(L2(&JR/27##"!@4*-+@<CS+6T>0ZD;0#(SJ[:#@W36D0
MFLU%(AIN&Z\F1MJB\8_!N=8^(195QP1>#@ '=LMLBT;@W/Y8B2B6AFW1[-E]
M@@JWP"A@V;@MJW#G* UM80+MX-8]5!8\31DRFHU0#O33*):"?N8OD7JCQ'O2
M#QD[3S\I\,&LHPT;<+,0QJ6:4VRQ\!$G8^9T-A2R+J!+#6=(X__J;!1J%#HO
MFB*L#3^]*'6'K0NKQX9>,)D#>?"5Q?&DT93Y^HK0<;(G"#\;Z6,XH">/Q2+I
ML*'))NVS1D,!,1]Z&LK4L/VXH<I-V4Q"]9-M@;A>O//LD<^_"7&W(1\R&YC4
M.$X<HGR+<QX53[*TG_"7O/ LD0PQ%YN5I EULQNS#'=-<)D?SB<O/LZ-]@*#
M$W\^!&%W$L5L<!D&0Q;&DXV:?C79RM'):SY7\[F:SWTO?$Y<+3\$ _;+03P8
MBM\;_LEO_ /!6Q;Y3A)>NB+/2EA6@O1+%@[<*'(#_TQ<?3MELK?/7XB+7X;/
M% FG8%E0ES6X!4!#^ A5FG86B*IUJ.KC8"6E"39?F[*%\)735&G"E(FMC$&:
M,]UA/&\T02,(30V! Z4-]Q4C<*##K?BH.FA@H&"%76W*>A-,!ZB4?)H4T2V[
M=7? (KA/KIPMV]M187DD-( HB(@I0PT_;!&L0-7XP0AFLZ@2+2102;I5TS1\
MH!DJ^#Q V&\1E$5C;L=(,!8)+X27^L<(R!JBPCD)VT*%DH*/ Y2]F.20H:G4
M1-)&FB8<2:5)&X,?72@: .\"S%A)@,(1@()*48==T2G*.9L5!6=W"Z]P20ME
MUB 178A00*-U4HC;&J(2'F*L<+:-P@ )5)H$ +C*A7&_(Z1"C/4%7O )58+=
M*I>)'"^(V.;G C_;,6#A,A.F%E!>J\C"9QSV8Q9*'"J+W_W867DF<.:$,@AM
M>1=I&*S#^0A&I(+GNVP_&AUA&$4U*:0)/UQ?7%?S8B4KCCY1 B5U),V2DMT@
MJ7#R:10/1W$W#ID]2/Q0\#(G-#(ZJM,"@N747O3:BUY[T??*BYYRK.G4NNF_
MM\>,(Y5]\D_&;M*A?+.;L.>&ABB&$9-"YNMUQ]^#5':PI567=9K&3O#Z3!BK
ML %OI[EU@R#"[X:07ULTAO%M9^=AH-)0%EP'1&D;-!+AE@/QX2FUBJPA>M5B
M\A[AKF),B0&$ 1.5^DD3E00G+D2MNC9".0+S&(.?URTP(: V+L%HN>1ED30"
MMN ^$AU3=08>[&0@",Q -.W%,$5X-1N4#:8-3U7$.$SAYSBJ9#>-M00>^8=8
M, /.%??)NH7J84Z1I(;PFJ,:QL!=T30.F!V(>:.!2E.!J4[KJ U2M4'J.S5(
M;9H+Y\0PUMRBYA8UM_@NN$6!^?KPB;,'P3#J?5_O^WK?OYE]?QD&G(BC*V;W
M?@_=F"VQ@'65FB8F$!1A0X2'*Z*B2RG"%76X)0;EI=B\!JIB?!^HL<*#ES"U
M<N#M<#$6>CA>$42@T60:D%0V0J0&T:2;(#"@P9,Z:2R'&),LG+W0F*)0:B!-
M*A=)\+I&4[ 9P0O!G$!MRD9%A*BF**V&8C7XI-1FQS0[BBIK1KO3.;WX\*DC
M26=I*S#1%Z5[?7QR=24]N792J6' C_0[.VDB)G?C'A\$OQ;U')._FC[G678<
MHV!86FL&H\N%?M'NKALXCRP^"GR?.:)M\G\+_(K_.J;*06SV9.#H0C1*QW06
MA=>](W)3@'TJ@LYH@D4)'!6JP@F/!K7P(MXT;G&:C 94GBM)+A[5^?!*2;FU
M9:.V;-26C>_)LC%+(?!9+ M&D3;7306/4WXMB%V#-8^6;!I;#NI$\=7-UT4U
M90.>V8>*A "?K@;BT#8J>H\L2;*&*:NFLIXTG,!HHJ1A_@.:.L+VT(;WB$&%
M%6PA3C@/PY:NKKU*EJXC5PFDLV#"6$UX5C/"H&?"@V-I; ZH'/0M)PI@8J!4
M&H5%@T/%**YPGMI"X," VW5U3#F&JL3!U:@+7I<&?JYP@:U)4I,#00<877#S
MG;(XBR'I%898+M3Y K=M8PR0+;C3 "$*F19-?@L)9N%AL2;X5+1D#1XFKR':
ML+7AH=P88XMFP@//4=GD<%4#3+6JK+7AA(#9# @DD*@P\%P4188[I7#I./"#
M$6S2%9ZY+;MZX%M,D5N('I(TKF02K1OC28:GH1@8*D#P+D2'UB:-SQ.>4$L3
M_("J_H,0$1'K!4_):H(QVY0U>/4*5'8+W%^ <GV#Y2Z,;P,N):/*BX$W J;Q
M*X4?1M7D]K:=49@SP6C#!XOAB/#C%IZ8I\E-^&@QC%8%J;<Y%6\6WL3!R'EH
M]+-G-D0-AT[5U2P95-6U#6%0;Z3>H?4O<X+!D#^O(=YUEN8L?6;.0_!%.DJN
M$E$-YX?7OTF)"X-%95"'D\:SJZKXPNC);[A^/RBY)/&/-(3WH>(:P"Q3;Q=T
MFLG5.73 7SKS%PN7>S)322Q=)"(_-N7\&]CQP\RE6#B4KNN+AW,@DAM)?=N+
MV$^2>^\'24^WM,/;N3UV!Z-!U_V3<?*.EUIZ++P9AFQHAZS!QHXWZK$EC'UV
M M^Q^6:X""0V=I,&(=GD;;\G^8'D\_&R'D?A./Y)Z@7B>S^('TJ?RK=JT0I-
M-]_5R/>3X)I%IY) D_S>O3_U8Y;U-P$)B_ 0"-F *S@8LS*,VZ"3EE5$,P5,
M["%< L.<.U65$E>4E51X30]47"L<+*;IN K/VC4P$9CP)3,Q! :/7D*9%>&%
M,E"^,))B#BK<M(JJ]5LE,CXPZ>.1U',%HXTYKPZ>W!Z3[IU;N]>[_<;LQ]LP
M".);SN5OF1^'DW<_;EJPAPO+%DTD/JX\/URJ186,D^BX<'\%*LP,WLA<!S,7
MT:>#( 17;N7T&=XMX1HM-9]VC]Z"U"RF"96:U7FA>:,RLQLYM<R\+#/G- L4
MJ,J:!=J.R#3C6T3NQ@(%A]E[J"R-X'%6SB&_W_O[XO33/FYO/IX$'P6#2EX.
M'GMNR.<:,EL0)W^#CK\MW*F^&Q1O5+%AAA.!Y>$DT;*US:O7A0-8CP\*<@"S
M054ELQZ4XG<[C'"#S(O/;K[1J7CK/-B^S[Q(CH:NW&5>$AEVF0K(8$Z&4*[:
MB"@(E)%_\_6V-(P9%A6R0=.P#HS8)F*]C"9-S@T\M@+5FP2. TQ3T)R>"PM@
M:=1+S,P5N&4?KJT(HQC<A(<Q \"K)*+ (L*"46!I1HL(,T-U5"!PS@JC&#S=
M&P.69K0JG&MAE@R>28\9K()HUH4Z$. A.S0YWRBRA?NH46#AN,6 U2MR+U8=
M+0FC@:<.T\1UX\9*4HB3II@TC1"#L&>B6*)%8,\4Y=H)#)H"+,EQ@R $U)+1
ML$2XO1RWQ0BJ0"B(+F&[ !7.OE$Y#C28)9'!$64/4&P&'HN/VPLTQPT56!I"
M0(A>-(UMB4:+(C!$W2D4W9)8#N G Y'&@!+MX2P!MW=)9'!$HQC<:&F00-(/
M ,YG4)50*(#"VWUBO/0FO+\M34D@%%22HEYP*9$& RH\!$15VS(\10MCIX2K
M8BHFL*B)R%,C02XF.8>F+34-><'-?J@8_SWB!21HA2?_;1\#-!UR$#HSAK!(
M2H/ 3V],2V450028T@CPTPO3@DJM0&U6K<0-?"ED_1&_"\0VX=DKJB;#_3NH
M\K"(($H2ZPUJV\!50 K#!:I[W9;;@-%8+5!C_0Z#P6Z/?CN\^DXCPE[&9;5(
MXI9NG0<[)(K-2E<'&J!ED,9GE<QS?CAO+UHUBTJ=E0U,H[M"/C'YYOK#4?KR
MQ'<"1&07)@;+(BCN(@+F2>JRPA4[5$7X"J@T@4+@$TF5+43*%,841R(^Y#3N
MVEFH<'\E:JPDWO *S>O(]@5U]EW.M4;^P!X.[3N/27>3F$EV&-H3P56EFV[C
ML'MT>@H2;C"Y@B2%2ZHB^%8;*P8L)L,57N(0GBBE8K*Z,'%&B#(KJ+0N>-&E
M#=I@8;3_\;UJ*;JR<7*J2#E;'AR7)L01S\74?I^%H+%M!,BJA%UA\8!A_[3[
MJ6%99KM17%=V'M# ]OA=@Q6@K+J,;7AA+Y2_BX0S;F1#</FRH3;?GZRS()4P
M5EV.Y@9V%6J"JT-9T3:'*(.)(8V*4 X,::Q/&""<;5 .1"PH*8Q520+N'4>1
M1+DRAB&)LPUPBQ(8JW(+HQQOB"4%3G!U*"N2A@[WD: .$GB% PS!;417X9BT
M-DXIY5@$+W'QP#8 8E7NL2Q[[[>%^?+PZ!^:HKP1 [.^></KT'8>.0(I[,O3
MM8&:EX6%@,B\7#K+^=%\_];EZ3I-K<M5J[1HB\Y)/LYPFR4@"PXM+-'R4>!'
ML>W'ET&PW*]['O1JQBZ+H@&N J\5AK(A$A@\$!66,57-: (BX-4I2<*0$6A%
MU A#15Z2V'O;)+U-B"S>RX2U6Y)'8V _,GX8B_.F(6I[E%PZ/0I].W:?<D_$
MQ>L%.X9>2R0G79U\Z+X1*<DBD!]"UH](9*1D7< 2DDDG(17/<'XL>ULB)9G?
M?)$4T2XQ^_22_V4AXS.+H)(*V#BNR6UX@B9&5$&4WH2[DMHT30O@)@0:YS0J
M>),F@+<"ZI8+6:JRE6/VV*T#&G_DG5Y<[^.1ASU"..N-X3%<A$JV&,AW?83P
M^<T=(>/LDV0!3L8.&XIP9K"NJR"4W8IR/;_,_TC=Z\.K:^DL"!Y'P_.1%[O'
M@9.,432:=;-#;O$>_E,(/,KN2CA3/QCYQ9':B^,XN3C>W"A6X^9JBZ;W)T7W
M%0/>A&>#W:@.XSAT[T8QZ[+XAHM$;NP*KL 20Y0LRZ#AH/(%RT_"8SMFXI[N
MQ(_M,7(@F&+@%36E3GS.?E89 V9?5XDPO]G1PVR!(.-()%O15SI+KYAQI8[D
M!8[M/011?*!JK:0]K-IIZJK4P*1B_,6.\SBC:,R>//;2LUT_ZV0]&'JRDX)^
M]_+SY S7M':Q%+/1)YE*Q9-F>$OOG$'+WB9 VKJVVG YSV.A;WO) [Y]^\:/
MC2 .G,"3'^)X*/_&_SPO@?RSRP'^^N[%I\D(FJ\Q@'/;M^]9^,/S)\*"*]^S
M>/&Z=[FWI0-5C5<<J1@:;%C-%MFH;J[.YE9+(.OZ^O+%J!:O24=DKK@%T$.:
M4G310 P3/9"I_.,.A_+I<'CDN5PUD4/V[Q%G5.^>/TE)0E5I'V#A%W<*WQD-
M(_GHYK([+Y],:Z7*PDU[S/HVEV'FOW]7>$,R'*.U^GS+Q\.)"S\<M0G@@ L"
M;08F%>!D+_DG[[DY%Z=/U!%/M*>'G+QPY(EC-1&X#WL][=WR5^F#- O W#V;
MGYS\>!.%<.5_GE^EKP3]N_Y3\,C.6?P0]-XM?"-NQ().X61 WV7ODG'J:@6%
M)B_E?F@/F-"Q9#'%(SMB,I<KQ.MWLP_2>9O&ZO#><X7I)3QMA?%=L8@3Q ]J
MPG\$?WG^,(.J-%>%*L9YF8)EO67 V@K3?P:<,] J>BU!YTM4JE4DF0.K.W+C
MQ;5./TEE)64=B,O0=#!SBOGI'\FVT'SMZ+$G[*5!(E+RPR=]Z-]O^-\$G5QW
MY@Q'//#E9^ECVW >C7^L9X]\YR'_R<T67"#!/WG 1<[\YYI&"?7_;H?"U-"1
M>BE;E1)>.-6WI6]VY/\MT[C_=R&02X]QLI,2$XWD]J5),)(>["<FV?XD!<C"
M2,I.?Q%&$(A+PL3,Q-EH6*L2M2I1JQ*U*E&K$K4J\294B9-_CVPO*E(F-*M*
MJJR5B5J9J)6)6IF@>O(^*Q,@!PDFF4M3RH,1LR['*SEJ,-DJ%?&;?.L'WD@L
MZVHN(Y3_K#SNI\OB3WTT6H2C73O&#'X<PZ^^N3J%7_R!*RV1B&X'>2'_'MQU
M8SMF5YQP W^%6R!WG+.>:X,OO.!<$WQQ(O*(U*;#D,$?(98+^IC+=-MBL;1\
M6^U_K(T&M=&@-AK41H/::/#6C :U_[$V&=0F@Y4AHDT&NSZ^VJ3Q5DP:M:I3
MJSJUJE.K.K6J4ZLZ;T+5J?VCM;)3*SNULE,K.V]/V8%Y*TU,HS5XLWI4$6EX
M]2-4/AX<+*; [W:2_U&E%&CF35+V =Y[!]71!TRGJ+&2%.FJ"(J8C[7 )#7#
M:U2AMA1)8PH57%(,!15<4P73?9>FT4D.:2V\V;MZ'5<G'T_^> /U.M)Y)I?G
MT(3]HEY'FZQ<1\CNV7C7RG6(5]ONMY1C+DCNG*L;E>!.[@Z]5,K;\-ZVJGKI
M$@D,X-/";*.:(9 4=<2T^S7;FZ] J6(:08(+>VFR"N^/@A'$6Q7U+N; HCI!
MDIQM.4K#GI]MYZ=OX63CL[2'+OAL$_VJJ ZW@3L[V@[XF';D>,L_DAI\@-6%
MFJNP6WF(<9PL5*\2[SG6Y&[D<=C"KLS"U OWP79B/F_HT89@\!:\VS#FV#!I
M.EG3E (L/]S%"AV[(7/B="UN.87>>^R?YU(4V^$2[<W?VLTN2& DIJ,2__7)
M>"@L[XE >GC\+ZD?!H.J>ZZ?X::C8;UBD]&GNZ_\ 1WI?'+%=U',TO>?;WS7
ML:,X);<KUO_,_-Z0RW!QY_-G5=2U-OFO)NM6QU1;JOKER[O$G?[C3P+@Z?'G
MIFGJ7+&_X2]5I6WU[PRMHZJ&IC#5-@VGT[ 41?G"?R0G9+:0$X74F+*5LN$>
MCN[%X:\I7+LV.XK>,5O2Y7G1/DJ1(/-]<S6M'2J) L+=. Q*5NC#Z<7)54<2
M-L*.E%[K3:19^=&>=,7NN<0;3H1#O7B/9Q=-9UBU!M*=,!M*KB_%7'(,L[N+
M[YK!%YA'(JU=@C0G]2&FKL2Y4(B(D\#QQZ-#YQ&(.'Z[Q&^0;.=1'!J?9P$7
MPK'0_I+VSR@DD%:_W_M2^*34L28%*>9<OHDOPV \^9P83_N=SR6,59Z2^FER
MK>WPHR31&<0%Z3=??I+F=\.I_R10S)'P&Z=2CX73[0':&&$"";\SBB=_G8;X
M)PSDEM.G.%O_&;B]LIC_X\!G<O$I5PA>P,V>40;^BL6CT!>\<Y&1R"^!;'R 
M?!5I)\\? )MYVVHU34/7BEO:K3J.%*-DTYP#+WUSXP<I)=GI[N(*/"=R<;4M
M%'A^JBQ\3X;X=%AEX'>$L>7M^TKNQJSB#?Y,4VMP-8V.K;7SV5J[C*WQ&;?+
MV=JJQ'+&S^?D#W";MBVKU6KR 1N&KFN:NOG]FO'D==GF ABJ78_>949'4?9F
ME_78WNXR3<_=989:OLMZ?9I=ELX)*&ULTO:YWH#?!I4K>TOENI)/Y68%E:LT
M5/X^"#QF^RF9$XM=R7J003\4_1=I)>/D$70"Z2O,8.Y!.-Z@[@UON"O1HE?%
MW2R+H@QIY0QF+A$C3_29?;WYL0NC7V5VO!AI:OQ*KN^DMD(I<)Q1&#*N)CVX
M'IOJ08,DI%5R9SSPOZ;.3S:=AC!1%#[Q+\DCDYC9[&FY*!%?;7ZKC?S8'3#0
MBCX/\^5=.2,>+\,FXA/PL<^MZO/(7P A7>/G\[,*=8L7;0IS4[.P<!IY+&8E
M$MS\U5X0"46F\.(;/[7<BH79FB%Y0X=$\5Q4Y&3,W,FTR@6;OO$ZDS&0DVGE
M3L:JT/C[.[DR6BZ9&4K%9'2JR<R[$W8/648NLK0*^;RWFRO?S)V,7C$9ZW4F
MHR,GD[LG#:-B,JV=7!D]?T^6LOY6W]E-!J/KN9.I8/W.*[%^[&3R&4 %ZW<V
MRBWGI1$V=N-2:>39-R]R3A&>^6-^8Q@DW4DK7.S?GP]?;V-$KUY+43;EP^?:
M=)G7IO;AYR--W8H) NK#3PGD>_#AZP7.+M#.J'WXH '6/OQ-@M]K'SYG;-I.
MV%9U '?;8Q^^T4+Y\&<SKGWX.+:YJS[\/=IE>^S#-_,# (M\^+,9US[\S?CP
M57U_J'Q_??BFA?+ASV9<^_ KH-<^?+"(B??A[Q%OJ'WXM0^_]N'7/OQ]\.&O
M94C>-=^'D>O(*?+ASXR>N^G#-_(#$@H<.3.-?S==;$8NF17Y\&>3>9L^?%/#
M^/!G\OEN^O#-?']D@0]_-IG=].&;N7NRR(<_F\QN^O#-_#U9ROIWUH??S ](
MJ&#].^K#;^8S@ K6OT4?/MP5__OAU<7IQ<=.(DTFZOBBU]^-I.C1'0ZYE'?'
M''L4,6'*&D^D=Z*HHIR\EA./IBYZA(CKA;G+=AP61>Z=5R)?+3_ZZ./IJSQY
MKJ@!N&*+UI2U%K@6S@8K,*@-OO#W+):&HK1*B8];:_@]T(5SXP27P>%;H06N
M:H$I<KF=NI&H$9)4\]!(ZAN6 YW%2W!-[>BF>_WI7!+\47IG\I\?JZ,T$AY4
MK3C-/^;XY,/AS=EU]AP1]0!]3NI:C0 1,5.%^,GV.)E<V /!&^]<44?-'K"H
MB@$7:ZSBY^!@,6CC8.$<6?U6;?5;]=5O-5:_U5S]UN;JM[96O]4JO/5(U%<2
M%),0"<P2L$1@(=L<B3VW4$&36,FM5216<FL5B97<6D5B);=6D5C)K54D5G)K
M%8F5W H@L8Q,5B2RM$]"-9&MX=A2R1Q;S8(@B9E&8[->4V-3N;G?;^F)_:=5
M[MC:S;GF._&>;5T%<VWNXUP+8OJLBKF:>SC75GZ"]7.@3\%<C7V<:T&XA5(Q
M5WT?YZI5A)84S%7;Q[D6E,+0*N9:$6"PFW,U\N>J5\RU(MX8(L3Y4=P+O;%G
MX86XDENKA+B26ZN$N));JX2XDENKA+B26ZN$N));JX2XDEL!0EPFAJTHQ(W\
M36@*L\%DX'!Z^(*ZW^(_0#7\5?1J,9X5]>JE6^%Z]=*M<+UZZ5:X7KUT:_%^
MV6$U%;UB);?"U53TBI7<"E=35UFQ6NNKM;Y:ZZNUOGV8*XW65TL FY0 ]E, 
MG7? 9^Z<=7U+J_C%=+FBC\OF @7RZ[R CK[=BWJPRJ/WRLZVW9M,?EPEZ/#:
MN<DDQ]/R9$"GT^Y-IJ*<4-GQLWN3R8\4 ED5=V\R^7580&;#W9M,1=QCF5UP
MDS%<!"$R)&%'JXV5XYQDK"0A.!5-:E:%2M+[!SS4-1L,;S1H3 R<HCVNH9*L
M')QV,1B TRZJF3')6 UPBRD,F<&[***(EV2L.KC7'X*R6DT2_F64-U$\"^Z[
M<<CLP><XBK]T_E?Q/J=K-5C0D73A#5$[PN[)T<W5Z?6_WD!/PME4TWIJHV'B
MYDGZ#>90A_VB0Z&AD74HY.0Y"MUX\MRF,!M<X; VT:JP DF8[HV:_IK(H>[A
M"$",ZPO9.FD\#,.0];KXD:<#W":B7)&EAL:4Z#W_:J@20]P=7(&)Z35WFYM?
MNG!SF%D\-<4AMW0N2-,WX1?IO9B.@"ZN6GO>/3;T@DEV;<IZ,PS<)JMQ*S83
M?](.#>?6]7=I1,D6VK'Q[!B*LM-\:4C+XE5R?9&0E;P<//9</H.CK!@J?T,Q
M@=D(9E/)869BQ((M#9,,.DUI;XX=H4>T\(:L[S)(.,JBBK);DJODE(L\V?)T
M\/(E"P=N%+F!?Q1X7EKX12@X&]95+95& UZ&6OB(DS%ST#0:V^$]BY.77\5O
MR)(324"7&L[PU?A^YS69 \'#EK<-Q8S*II#Z[ANV'S=4N2F;!P)&0AJ(Z\4[
MSQ[Y_)L0=QOR(;.!28UC<;7\$ S8+P?Q8"A^;_@GO_$//@3A89) >Q3X<2CV
M;ZBEV7C+P0JS'9]R@D4ND OEAUYP&;I/G)?>L]Z9N.%V1C//7QS.6$99S<=5
M[#NZK%4U42=*-P6;=319 QN0$7Q-5<'IIFTH5%4VU'(+U#P&$,9-'6PO;&(X
M.]@&UR*Q;R/&JE98]E;$0!-L,=7 *#!D'0X58]T%6_C!]"KP2D)93;#-6,60
M5AONH+,P'CH26S18&$,L%P*Q*-*",RT3#K8)YP3PTP#E^4.Q+0K$PB5R#!'0
M\!<53%JHL9(0+/SLQF@Z\+,;-58:1S68!A"<4#'!G!"#5SA_14$E"2O0P#R+
M9L>"5TMMR4V:@VO;3$L%4X$J"TL4P1FC*YL/IVC*%IS!@#&K*;(&EPPQ'$8E
MD0SA$268L<*I ,,-X;(QBL-L]YA%F?[ :$5(6DV$<D#"M>#\A>L&8$$#)<+"
M"X=A(J!HHB)5,%04P9*H7#1B(?CD0BA'"*$(M0M(1"VX"(L*V*,PZR%,.HC5
MTN&F,IHCEF;#HFB A+\J\ *2&&5>)RDE2,0)298+8=+![%F+)' 5O@\P4',<
MET50,6 ISAC5I#$];'FU$-M @Y\&&).QVJ3A!#1"/,4AHS?!8T692\%C10E%
M6^;;.W#,@J%BV#9<B\$,=7^. I*A(DQ/)!(\"0)0_(HBDRG/ME_'&]7Q1M]3
MO!$V=,AA' -'_,^E'3\D :TL5)/PH6/6MT=>?#T9LDU'W5@6R0%'$<6 X$0T
MIP8J1PTNZ"+ :O#4790%F,2UT(*C '-R-&G\("148&T^^HQN'Y#X;$C<C"I-
M7CR-Y0=NHR$RU"$4/@UN!<>X ]M@7Q!&C6S!]1T$?['@ C\J&Y[&:4'CQ"<Y
MNQ!J/\JVC#  HLI9@'<"QJ "/VDQ+NPV&"K*3$-B6#7@O ##N!!JND(2'( A
M+M4BJ>& V& DCE&:ZB"8@T8'\P+,1B!Q-BI-DEC4%D74J&I1Q'>J<",81C^@
M0( &'RH& 7!5!@,5'L^#(@&2TD,TS> HH*IM$FI%>'"W;U\G.;6V[;[< :@4
M%>FHH)($LY"D#Y!P5X3GAB2-B"0&%352"GNQ1G.ZM$D. KAIET8@1F& 0A;0
M2 Y8FD!LE28U"6[1PHP5GNZ#HE>21#*2#4N34DMC+":)Y:()[C9IJ)4FX(;B
M*%3AR3,HJ#2!3"3"0%4!B!4W+,E8X5!1P;(D@2Q$(7(40!$L"Q7<#7?(H@0B
M$B) Z+ *B;M?PX EL!,W97@P_@ZXHL ;@88(4*8<DCT+WUP8O,+IE8C!T$1\
M8)QF</$%Y=\BHEB:($P2OSR\1#M*XZ)1.$@R:HD*5Y XXN TL -0M]QD R6_
MP*O_HPB61.6@,97"384H#- H,B1XI?'N+*.U\ EUZ'P=.K]_H?/T"S^C,%$'
M]&'"/]$MS="S.J&"TI_C\H>!YSJ37Y*.'XO7:]EW64W@Z5)TTW]O\RH"2RF8
M5Z"U@[S''T3NO<]Z[__1S2VG/64;:=WW^;\;%1);LE:0=E!6GUFN[#R0CFAZ
M[^(J=OG$[9B/30QXHQQ9DYOP. :4:8E$346<]:@2*F 4('0)E4:I1F0A8WK 
M(8I?88JBYN0F++QYA2Y&#5&#'U%-O;3YQ>(NK<Z2&IM*6XZCH2PPTXWMP?"*
M14/H-D:4&6O!O7J89 6X582FK@I*9*_0L&C*1&-\S_#:%!@^0]-8#VY=P/ #
M>" :@G^WX1XR,)6V9 M>'!9E"Z)I6$ABM2&Q,"%B/%%5E6C\;N"QHK)_2%1K
M@B*+*J)2..( 0$1/(YB+091-0Q*)140#\*:5:_:<+8"*2'O1X7FK"#G(1%1@
M!P]6EW42 [9*4_8$KLZ@2MN3Y-C" QM0B5HT@:XTF4\D'D)XLCU-5W/4+MA\
MT6&5'P=P;R9"(S+@\=Z8!@^(D@L(0<.$EQNE28-$U>LBJ2L%YR^H$">:BODD
M60_PPGVH,X:D1#(17FDR7TCV5HY#M_ 1-]W3BX^=M%=VJ2TJLW6$:9F>/TRE
M?71U=IK?2C4%?<_BB\ _XG>[CNV=C&/F"V/\I]-C/N[/FFS*6EO6^9;)7FK*
MES)8%8 TJ_CN!SNZ\3/O!.LM >I(<3@"51;2,-5T6V"2@;=#D"UX:7D=P^41
MJB_B6-;A00"HDO4TB=YP'8W&*HY ;!/!CQ1,P"5)Z0L54:D885?0"$3TEL[5
M/YH T6W4Y_SU5RD4##OJ?,Y8]HDP2PN^W2EE]XG3X?I]5]1C.W.C^(<K]A0\
M<N;)W[M]SCYC]M]6SVES.8H \)W38A2 FSU+L=16O_BH^'\<8T28*GWFIU_$
M]=*G\-[VW3]MX:LNO=X?><4G+Q9@%;P5)5P$,R'91YBQPO41FJIJ&"8-3Y-#
M5<^E*<FZ/-;"1WRZ.NSU.-"\+N'9)<I85_@?19N]4B08\(_,9Z'M7=@#5@;>
MUM<&#QB^L<:35E6X-Q\V:,H&O-P*2MFB*<6W[?K[&!L\B5Y(HAD7(* \-@(9
MRE1V_F;%82^32+2N8_M\(T*#(S!U\>#8P^A=\()HX+&J<@MNKT&=YS11TA0Q
M A2!!P@G'HUC;)-5 8GZG2/0B>@V!*^$IV$*-:$Z;, #.1"B7%[CCM>.;2NY
M)KF@,0AZHU)0P,N<8##D8VJ(=\6Q=$?)5<F)\>GFXCBU3+*H#.QPTIB%_Y8\
M/WKR&Z[?#THN20**&R(PNN(:P#1SD%LVSZ*#D+]TYJ\6YNUDJDDD=<37?.U\
MA'3EH@,.U^\EJ0YQ_OF9CJ7K^N+I'(KD1EFHM.3>^T$HQC=@@R"<G-MC=S :
M=-T_&2?P..;?%&-L&+*A';(&&SO>J+<LGG]V I^KT5^DBT!B8ZYBB^>DL[=]
MP< DGX\W$2;&\4]2+Q#?<[;V4/K4A&[2Z$X(]13LEWDF4":M"-3.5;T?9Y]$
M-I>&&/]WZ,KG[IB%EYF9?>/AG:*R+URJQ/"P;>L F".<(D@;CE94U!A%+"ZF
M3"PF%@M>JP"5/492@MBJ0 &-9(0*SZ?Q"M+T^2715&D:Q=&HZO"R71CG(8T)
MA";/E:9]!DWN***@]7H>]_6A(B)<43N6)@9ORU")"O%C>-;6TI2H]*__.7L+
MVA>?)53W$MD<5+K7O[TWHWFMJ4K]VUM0I.+0]B,[R>Z5Q[;\A]N#ZD[@D!,=
M4]0%Q=_ $BXF$!0>RT-T<F+RV7("%@N?L9/5'/)V\-H)[O- H]!YD>/^VF44
MD-"?P>:,=$]+,@A.E%UVD'&B9'&262;$E+P5N^#<=OT/07@<ND^LN,3 BDDD
M!DDX&9'X5F46(')";%T41*@NJ$+&)*6<X8-%)7UO.<\%4ZH*464!4[>O21-1
M X^E1%7%(%DO.%>AR?PT$(/5$#GPB-%J\"P'#%A$O1%4=U&$CQOA(U 0&968
MC0OG7=OO&T'"#.!Y\"0MI% 1EB18)3%HPF4L!%2X_1V%59I4")H>P\N<<-<L
M9$!C%MJ4-O*3=W9<;5';64/9S<71I_/+P^L<<]GN&I5VC<!P='-]\L?U/MI@
ML\B*HD%)&1D,)V*RPTD2U[)YFZJ@GWRCZGH[(5D5<+Q.D\QF7#R_^:&\KM%X
M@X9>,;TY2V_ZOAN+81_Q:VPG9N$I_[7C@")<IH7HZX 0A1':"TV/5@W35AA>
M=5Q'X,"$-Z52$89OL\I$361O0LR\">\;A2H&M7D_@BJWX2([)NP7K@YC?.5P
M3PK<VJHIL@%/8,9L  U14 %59FK+$0-;;S"O$96%!"\7JKX.W*.&"( WX?UM
M,"U3VG"P&LJHO<P0]UMF_Z-Q<;*70CM2"D[G*2Z7,N=A*N&";[6'+ER*;I-)
MT>.&SY[%Z ,^*E)1N@PCL-2X[>%&C&]6A7R[6((BI_6:N-D1'4PBM[$T^"ZI
M+H==O<TK=< QQ_%"M(]XS]=!YHOGVEY6V$#N=L^Z+"GU_][U>QS6R1,7X*%*
M(4+.;,$=&6#Y79.;\,8^&/D"KF2AG*5;<>JCB@Y11$B0U(6E*0Y$8V)0<_KN
M;(">$#H+AO9)_$(T_6YIH-*D4%@T& !O+HP7DZ;< =S0@-I;</9"L[<04#62
MAN+P% H,4 K+A484(+!';:]IW.XDX6U;\SF'R.8Q .4&(R[/ZG5^C2(F7X<C
M$9CJV_<L_& [<9!6-MNXA&R@S$^;HXWM1Y*2=,] ],[!9$'3%"&'6_91(5ZY
M0$LVS_JEA9)=5+Q_,!L'P:DLDH:I*OQ<184=@74!5/GNS1]6FJS3E/:#UU/;
M)!?9>O\I3-PIB<:Z9DIF$514Z"V)8M$D89\(I1WC;R;8IQI<6$<XL56+1 !&
M],A!N.X0[2;@+1Q4N077VE']PL"#197G (\5+/&H&L:/#]X'.JJ> GB]3+E%
M4U2#1&N%;R_44"GL%D0=?7)"\%];P]Q ";?$Z=7H!V&##8;QI.Q2+G4X+(HJ
M+X1>UQ]Y7B-DPBFW>%6Z,.DW?'E$GC<?X$"*^1*(>!O-4@?%[F8A*R7>Z12 
M<+RY_MK>O^?<UML4[L%#// .7+_'QK)X6>+(?^"7YTYTX<T]\ZLO2I=K&F,[
M\LJN?7]S>G8L?3@\/3LY7OAB([B0QP.OHS;;G03A_<#S@F]"KTI(6 H<9Q2&
M7!G[]L!I66)CYHP27V3\P-?#<_T71+FV<]9^9.F5"7+2P1FM9' AD[Z)/PE1
MI#M,+L;:=1#;WI34=&G@^B-^HY2&JP1^;Y'P_L[_2E?I2DAJ]M5B@+.J-W6$
M%SI=5OY5-K7&<Y"O]/E/=\C755PG(/-W@*SX7("WFJ*T%$M1;]6FWI8YI+_^
M5:QCME"!G]&-],V-'_BB+:SPV&%#<4WGKZLN?<F@[9X]C(/PQ7BG'R<+:RD+
MZWIT=MCMGIV^EVXXUTBXN33ENO)??SZP?_WY8!@R_O<NZ$WX/V*W_OK_ 5!+
M 0(4 PH    ( *F) 3?A^<*M,D$  ):A P 2              "D@0    !E
G>&5C=71I;VY?;&]G+FAT;6Q02P4&      $  0!     8D$      
end

Mime
View raw message