harmony-alerts mailing list archives

Site index · List index
Message view « Date » · « Thread »
Top « Date » · « Thread »
From nom...@intel.com
Subject [build-test alert] BUILD FAILED Windows 2003 x86: stress
Date Wed, 01 Aug 2007 08:59:41 GMT
BUILD FAILED:
	Ant Error Message:
C:\cc\cc-suites\scripts\cc-exec-adaptor.xml:101: The following error occurred while executing
this line: C:\cc\cc-suites\adaptors\stress\adaptor.xml:100: The following error occurred while
executing this line: C:\cc\cc-suites\adaptors\stress\adaptor.xml:116: The following error
occurred while executing this line: C:\cc\cc-suites\scripts\framework.xml:1069: Java returned:
1

Date of build:	08/01/2007 15:26:21
Time to build:	33 minutes 14 seconds
Last changed:	08/01/2007 15:25:51
Last log entry:	snapshot

***********************************************************
Errors/Warnings:	(4)
            
BUILD FAILED
C:\cc\cc-suites\tests\stress\qa\build.xml:169: Java returned: -1
Total time: 33 minutes 12 seconds
The execution FAILED with the following exception:
The following error occurred while executing this line:
C:\cc\cc-suites\adaptors\stress\adaptor.xml:100: The following error occurred while executing
this line:
C:\cc\cc-suites\adaptors\stress\adaptor.xml:116: The following error occurred while executing
this line:
C:\cc\cc-suites\scripts\framework.xml:1069: Java returned: 1

***********************************************************
Unit Tests: (193)
        
error: test stress.org.apache.harmony.test.stress.classloader.OneThread.SupIntf.testManySupIntf1
error: test stress.org.apache.harmony.test.stress.exceptions.catcher.StackUnwindingInsideInitTests.StackUnwindingInsideInitTest5
error: test stress.org.apache.harmony.test.stress.exceptions.catcher.StackUnwindingManyObjectsTests.StackUnwindingManyObjectsTest7
error: test stress.org.apache.harmony.test.stress.exceptions.catcher.StackUnwindingTests.StackUnwindingTest5
Unit Test Error Details:	(4)
                
Test: testClass: stress.org.apache.harmony.test.stress.classloader.OneThread.SupIntf.testManySupIntf1java
version "1.5.0" 
pre-alpha : not complete or compatible
svn = r561336, (Aug  1 2007), Windows/ia32/msvc 1310, release build
http://harmony.apache.org

The GC did not provide gc_add_weak_root_set_entry()


Apache Harmony Launcher : (c) Copyright 1991, 2006 The Apache Software Foundation or its licensors,
as applicable.
[debug] started null(org.apache.harmony.test.share.stress.ReliabilityRunner)
[debug] timeToWork = 30, timeToAbort = 30
[debug] started null(org.apache.harmony.test.share.stress.generator.Thread)
[debug] Thread.setContext  { org.apache.harmony.test.stress.classloader.OneThread.SupIntf.testManySupIntf1
{} }
[debug] Starting 1 threads
[debug] ThreadToRun.run()
[debug] completed null(org.apache.harmony.test.share.stress.generator.Thread)
[debug] Generator.execute()
[debug] class = org.apache.harmony.test.stress.classloader.OneThread.SupIntf.testManySupIntf1
[debug] org.apache.harmony.test.stress.classloader.OneThread.SupIntf.testManySupIntf1 { }
...
Test: testClass: stress.org.apache.harmony.test.stress.exceptions.catcher.StackUnwindingInsideInitTests.StackUnwindingInsideInitTest5java
version "1.5.0" 
pre-alpha : not complete or compatible
svn = r561336, (Aug  1 2007), Windows/ia32/msvc 1310, release build
http://harmony.apache.org

The GC did not provide gc_add_weak_root_set_entry()


Apache Harmony Launcher : (c) Copyright 1991, 2006 The Apache Software Foundation or its licensors,
as applicable.
[debug] started null(org.apache.harmony.test.share.stress.ReliabilityRunner)
[debug] timeToWork = 30, timeToAbort = 30
[debug] started null(org.apache.harmony.test.share.stress.generator.Thread)
[debug] Thread.setContext  { generator.Thread { generator.Loop { org.apache.harmony.test.stress.gc.padder.BigObjectPadder{}
}} generator.Thread { org.apache.harmony.test.stress.exceptions.thrower.NullPointerExceptionThrower{}
generator.Loop { org.apache.harmony.test.stress.exceptions.catcher.StackUnwindingInsideInit{}
} } }
[debug] Starting 1 threads
[debug] ThreadToRun.run()
[debug] completed null(org.apache.harmony.test.share.stress.generator.Thread)
[...
Test: testClass: stress.org.apache.harmony.test.stress.exceptions.catcher.StackUnwindingManyObjectsTests.StackUnwindingManyObjectsTest7java
version "1.5.0" 
pre-alpha : not complete or compatible
svn = r561336, (Aug  1 2007), Windows/ia32/msvc 1310, release build
http://harmony.apache.org

The GC did not provide gc_add_weak_root_set_entry()


Apache Harmony Launcher : (c) Copyright 1991, 2006 The Apache Software Foundation or its licensors,
as applicable.
[debug] started null(org.apache.harmony.test.share.stress.ReliabilityRunner)
[debug] timeToWork = 30, timeToAbort = 30
[debug] started null(org.apache.harmony.test.share.stress.generator.Thread)
[debug] Thread.setContext  { generator.Thread { generator.Loop { org.apache.harmony.test.stress.gc.padder.BigObjectPadder{}
}} generator.Thread { org.apache.harmony.test.stress.exceptions.thrower.UnsatisfiedLinkErrorThrower{}
generator.Loop { org.apache.harmony.test.stress.exceptions.catcher.StackUnwindingManyObjects{}
} } }
[debug] Starting 1 threads
[debug] ThreadToRun.run()
[debug] completed null(org.apache.harmony.test.share.stress.generator.Thread)
...
Test: testClass: stress.org.apache.harmony.test.stress.exceptions.catcher.StackUnwindingTests.StackUnwindingTest5java
version "1.5.0" 
pre-alpha : not complete or compatible
svn = r561336, (Aug  1 2007), Windows/ia32/msvc 1310, release build
http://harmony.apache.org

The GC did not provide gc_add_weak_root_set_entry()

Uncaught exception in Thread-12:
java.lang.OutOfMemoryError
	<no stack trace available>

Apache Harmony Launcher : (c) Copyright 1991, 2006 The Apache Software Foundation or its licensors,
as applicable.
[debug] started null(org.apache.harmony.test.share.stress.ReliabilityRunner)
[debug] timeToWork = 30, timeToAbort = 30
[debug] started null(org.apache.harmony.test.share.stress.generator.Thread)
[debug] Thread.setContext  { generator.Thread { generator.Loop { org.apache.harmony.test.stress.gc.padder.BigObjectPadder{}
}} generator.Thread { org.apache.harmony.test.stress.exceptions.thrower.NullPointerExceptionThrower{}
generator.Loop { org.apache.harmony.test.stress.exceptions.catcher.StackUnwinding{} } } }
[debug] Starting 1 threads
[debug] ThreadToRun.run()
...

***********************************************************
Modifications since last successful build:	(6)
            
add cc-snapshot log20070801152551Lbuild.7 08/01/2007 15:25:51snapshot
add cc-snapshot log20070731200802Lbuild.6 07/31/2007 20:08:02snapshot
add cc-snapshot log20070726133349Lbuild.5 07/26/2007 13:33:49snapshot
add cc-snapshot log20070719184806Lbuild.4 07/19/2007 18:48:06snapshot
add cc-snapshot log20070712185838Lbuild.3 07/12/2007 18:58:38snapshot
add cc-snapshot log20070712142711Lbuild.2 07/12/2007 14:27:11snapshot

begin 644 execution_log.zip
M4$L#! H    ( '-_ 3>,3_H"U@H  %B*   2    97AE8W5T:6]N7VQO9RYH
M=&ULW9U_3^,X&L?_!FG>@[6ZTS+23-.TM(4<B\26<L,L/T8ML]SI.D(F<5L/
MB9.Q'4KWM._];+>A34E*&3'GIXMF:&([SL=?/\\3VTG#P4A&X>'!;1Q,#@\2
M3@X/,!)R$I)??A[$3+X7] _BH;WJW__Q\^&;;9XR[\TV0N@_ 0F))%_0L?ZD
M;(C<_3TTH"$1:,#C"+6]ON^K?^]%2B41_=N4AD&?$Y&&4O2%5%O"U*3J^HKO
M\1?TJRZA:_"0*5QYB,)\B?R>/R+^7<6/V8 .O7S6=)OXH_@+:IL"*<>2QLQ#
MV<^8LAN*Z[6;2-S[Y4?_?CZ%07_[[WTT.]F?'@K(;3HL/^J*"$D"]%%E("69
MI!%1%4B36IDE_+F"6?\L">@8#,<T.DZE< 3#B1C%TAD%=\Y7_9\3YY8R1U=7
M(0^DL/H'XG]!1PE6]: /F$<QFZ SG#*USY&'=ORW2K!DPNEP)%67[KOO4*U:
M;:(K57YV6"\>R#'F!)W$*0N,K"CFB$J!0NH3)F(NWB$L$$X2E8!O0U(I9]$I
MZ)YPH:OYR:TT*M6?4'EQ9:'O<9B,L()EL41^'"7:$#6!WE8XZGSEQXM[AGY!
MO-%TZ_7F.[1SE X1<G4;6V_?H6O*@G@L'&T8CC8,Y-;=ZCO$E9%C0::F4%[Y
M2,K$<YS15-<*-GI58K["4E0?,.4)R%^T4N-'RF!&T\R*/QB^T%KZVM8R-^M_
MPXZJ0O^_(>S^J5\M5M9Y\,,T(!G"-VU*)J424B%? R.K3Y]AE7\K/ZF8XPO/
M.=W69JG+H)E4CY9$!:I6M.56&VX3[9SC"7*;4UM^NZ(Z5=6L1[QS3-F68MAY
MZZ$V)UC9F)\/)9>_O: F(3&7O0EKCS!C)-2U]G02$A/E?#QF*LZJD&8RD6I 
M$JN\??6SWCF.*3]1QDOXUD!]Z-J5*XR0C)$@F/LCHY+0LK0]Q_>=>5PQ&<ZT
MBQS518+[)LUYN4Q7YAQCHF*#4![CJVBG54([,I8X5.&DOJ;VQU0H?!V3=-5G
ML8^-8'6OUO3J-=1-&0IU8L4<I5NI'3"5ZM*A3K+>.7HRYJ1+Q)'X^'D+!T'6
M #16H4N=%<TD4>[K3#TY<^RI/+-LG% 3<1T:9TG*6%1'"$=U-3_B'$^Z)F%Y
M_YHK_7G/'&-.C'8^'?5ZG>,U1?KQ#?A$$Q+,X!>VX8,K-C4DF9$O[D!##S$;
M*NJ!T[OIDH%R'.837=]-U2U( D2K!P$%Q$7)L*EK)<F6J/T0"Q'&QG#/Z</5
M2)NT"B4Q4Q<0)C_%<6C*MS^=1=*6M"^"!*;D"25A(!27*?RX!TS*$DI@6IYA
M/B1MG7>!(V*.R"?==('IN@;QQFE\O7$:7P/3^!RSB:&;#8<7]H%INX(4FJ9$
MCN+@B ]GH(^[T!0MXP2IIW:?[*J02P&I:BDM,&U[:7+*Y.#1HV;[P#0MH=P,
M+>L;0;D+B_**$[(8[1?V@=GF"E)@]GG-8S9<1+WHM,]4*6""EF%"5_-Z(\2\
MWB M@47.$DH(D?,BU@OL_FCU>@1 T V91W\'-@07>SDVB!GU=V"_6.W2^RQU
MUZL]O<]B[NQ$F.$A"?1-%_TT *KO@9%HQ>P88(>6SCS!LI;.YP 2 Y[3K8D*
M,7:N&.<#I"T;1&\"ZO6&D4)PK$M&II2;,C1Y"3"(1?,Y,.2KUS(EY.O6G+67
MWBX/7N9)P$A+KZV=;O>R"X$1]I5JS@DW\#_+""'DKS'AWQ!,".$]APGX28EU
M.,'IN2&K/)NXQ+.)ZSL_?''G1S,#?VIB759XND)^<N(EJT*;Q@O.$E;." #2
M@EUQVY3EMG4X(=P/7(<3PAW!==<NP=GH:SY/47Z39\]K[*YWDZ?5A*$+Y*<W
MU@(%%V4V96X/^!F.=3C!16U@SW&0!Y\D^FN5"GD:K)R>Q/[=9S:F+*!L>,H$
M#<@IHU+7+E;FNM6_0BL:=I937[4-S;]"1[2@-D*/MBYOOQ)?BJ)6+&7;"I6O
MW RP$>IES6@!]>XB=!-3H<I>!@PU?);Q@HTR9<![EH"'OC/@>.B<J%\18=*\
MC>&?[1/*<$C_,-_?K:_,A,3=Q2R((Q.>2S-@\M9+,R#Q]JA^/\P<SGTF&S)[
M\YELR.S[SV3#8R^U%J!V4A!#%C)@\A9:-%!;+K5B>/8[?9U%D0$OY$ B+K!=
M<%9;<,VS?+6+2.2<DRCFDRF;V@9%U,R(+'JS)NI%. SU>PSG6Q?$ZJ3F63"+
MEK\:S+)QE8/96A9X%JP!#NR[++_T+M)NR]O=6^\NDNON I( GH_!=##+WI6H
MH_6:A,:9KI]]P.'@DTFU',.?HD'"NJ+9@B,TP>9D]JF^,NI@/DSUH$XX1]F6
MJ<DF$<<3C:,_[,NS#&/K_EHAC:TX7@ACZVI?"&-KW%T(8VN*K&',R(23@7#,
MP$5-@0V2K15LC23T>OIT5=VV?R^CV'2H919;PZ$B%EN#H (60+( 4L5F\%U"
ML1EZEU!L!EYAWKV<O9#9^DBF ,=NL'N"8]>QG^#8]:@G.':]Z@F.K5OV)3C6
MAC-)@)VOP3AQA$\8YC1V.K]W+JZJ5=?IW*O9E*ZS:NU%X.5XM44\:X&@%&]_
M$<]:%'^*=](].N_HSCWA."+@.G>&5UO$ ]2Y,[SZ(IZUJ/\4[[QS?MG]M^[=
M^8V<[^C>TN7B1LVKK?FE [=1@Z)&+:<&(&O* .LY0(#VM)L#M#9I* =LY "M
M#7S* 9LY0&M#H7+ 5@[0VN"H /#T7YUC$]+H PG 7;!F>+5%/$ AYO+7CYWV
ME?;@Z9H]. _. !LY0$ >G $V<X" /#@#;.4  7EP!KB7 P0TX<D ]W. @ ;M
M5Q^ZG2,3!*??  ,7!3/ 6@X04!S, .LY0$!#K0QP-P<(*%!G@(T<(*! G0$V
M<X"  G4&V,H! @K4&>!>#A!0H,X ]W. \ *U6UT$M'?'O1PP=R5QX5U)W-R5
MQ-I=S8@*WVGC,-2O\#''6^0P-X4N[PD?A/'8.LR$^5WBI^8O]MJ&N<947L22
M#B86263V2A6S>\HDX3Q-S&#28?'EY7E'??0N.T4%K(WEUH >4SDJP[;EEWGL
MCS$U)NCX(TQ9D=A9"2 Z%P/GA7Y$!J9Q./W#O*M$MC4H7(NX1&5;X\0\<R\D
M)"F+&(^90*SX"6Q>VCGNZ[WUJ-'RZJTU;T#L5VUJDXJ$L*"T*^?90#IS]FH9
MMV:0"]) 4.8O]$7*YDL $;<8.^\N2^ O]IES=271WI(!BZE;&%^X_*V\#FG*
MRECB<*M1=<L+(I3H%PX%6^[>_JI2 TQ#56J%]R&DAA QW]I:\8T2A,0=31)5
M4;VZXH_4()2R.Q:/V:KS'<>,5%"/$"1'1A'$21)SB2@S*0'EQ%?]/BFO8JOM
M.;ZO_KT7*562.;<I#0-'=5P:2C'K]=4=)1!Y4 -F_=U#)&E$O*UJU:O7/=75
MF 6HU=J-5M6@.VAZ'*K74419JC#0/A+$CUFP=&1^[]?/IV?'Z.3H]*QSG,]I
M>WW?[S^VJF^,H3]M3?\;[IM65AZBT'.;^Q[ZJ Y2VLE4F5S@H??NJK.6$*NY
MW"/R]I52?Z[*E!!IOS#],HA#-=.A;(@>WW/AF4,6,K0AH=A7$Q&N@O]XI&PO
MJU%ERQ$5**2,>&^VE]N* YRH3G]L[FQ_VEK5->C_<R:W^8IG$CZGB>K!@7X\
M81SSNUEK"CK/W7ZS?>#@PP,GX43]OHV#B?H8R2@\_!]02P$"% ,*    " !S
M?P$WC$_Z M8*  !8B@  $@              I($     97AE8W5T:6]N7VQO
<9RYH=&UL4$L%!@     !  $ 0     8+      $! 
end

Mime
View raw message