harmony-alerts mailing list archives: July 2007

Site index · List index
Message list« Previous · 1 · 2 · 3 · 4 · Next »Thread · Author · Date
[build-test alert] BUILD FAILED Linux x86: func
nom...@intel.com   [build-test alert] BUILD FAILED Linux x86: func Thu, 19 Jul, 23:41
nom...@intel.com   [build-test alert] BUILD FAILED Linux x86: func Fri, 20 Jul, 20:24
nom...@intel.com   [build-test alert] BUILD FAILED Linux x86: func Tue, 24 Jul, 20:17
[build-test alert] BUILD FAILED Windows 2003 x86: drlvm-testdebug
nom...@intel.com   [build-test alert] BUILD FAILED Windows 2003 x86: drlvm-testdebug Fri, 20 Jul, 01:20
nom...@intel.com   [build-test alert] BUILD FAILED Windows 2003 x86: drlvm-testdebug Fri, 20 Jul, 21:31
nom...@intel.com   [build-test alert] BUILD FAILED Windows 2003 x86: drlvm-testdebug Sun, 22 Jul, 19:48
nom...@intel.com   [build-test alert] BUILD FAILED Windows 2003 x86: drlvm-testdebug Wed, 25 Jul, 22:17
[build-test alert] BUILD FAILED Windows 2003 x86_64: drlvm-test
nom...@intel.com   [build-test alert] BUILD FAILED Windows 2003 x86_64: drlvm-test Fri, 20 Jul, 04:57
nom...@intel.com   [build-test alert] BUILD FAILED Windows 2003 x86_64: drlvm-test Thu, 26 Jul, 12:07
nom...@intel.com [build-test alert] BUILD SUCCEEDED Windows XP SP2 msvc debug: drlvm reg.test Fri, 20 Jul, 06:06
[build-test alert] BUILD FAILED Linux x86: stress
nom...@intel.com   [build-test alert] BUILD FAILED Linux x86: stress Fri, 20 Jul, 06:27
nom...@intel.com   [build-test alert] BUILD FAILED Linux x86: stress Sat, 21 Jul, 03:03
nom...@intel.com   [build-test alert] BUILD FAILED Linux x86: stress Wed, 25 Jul, 00:08
[build-test alert] BUILD PASSED Linux x86: struts_test
nom...@intel.com   [build-test alert] BUILD PASSED Linux x86: struts_test Fri, 20 Jul, 06:45
nom...@intel.com   [build-test alert] BUILD PASSED Linux x86: struts_test Tue, 24 Jul, 06:36
nom...@intel.com   [build-test alert] BUILD PASSED Linux x86: struts_test Wed, 25 Jul, 00:23
[build-test alert] BUILD PASSED Linux x86: tomcat-scenario
nom...@intel.com   [build-test alert] BUILD PASSED Linux x86: tomcat-scenario Fri, 20 Jul, 06:46
nom...@intel.com   [build-test alert] BUILD PASSED Linux x86: tomcat-scenario Tue, 24 Jul, 06:36
nom...@intel.com   [build-test alert] BUILD PASSED Linux x86: tomcat-scenario Wed, 25 Jul, 00:24
[build-test alert] BUILD FAILED Linux x86: tptp
nom...@intel.com   [build-test alert] BUILD FAILED Linux x86: tptp Fri, 20 Jul, 07:00
nom...@intel.com   [build-test alert] BUILD FAILED Linux x86: tptp Tue, 24 Jul, 06:44
nom...@intel.com   [build-test alert] BUILD FAILED Linux x86: tptp Wed, 25 Jul, 00:36
nom...@intel.com [build-test alert] BUILD FAILED Linux x86: snapshot Fri, 20 Jul, 07:47
[build-test alert] BUILD FAILED Linux x86: vtsvm
nom...@intel.com   [build-test alert] BUILD FAILED Linux x86: vtsvm Fri, 20 Jul, 08:16
nom...@intel.com   [build-test alert] BUILD FAILED Linux x86: vtsvm Tue, 24 Jul, 07:42
nom...@intel.com   [build-test alert] BUILD FAILED Linux x86: vtsvm Wed, 25 Jul, 01:35
nom...@intel.com   [build-test alert] BUILD FAILED Linux x86: vtsvm Wed, 01 Aug, 05:16
nom...@intel.com [build-test alert] BUILD FAILED Linux x86: JettyScenario Fri, 20 Jul, 08:27
nom...@intel.com [build-test alert] BUILD FAILED Linux x86: scimark Fri, 20 Jul, 09:11
[build-test alert] BUILD FAILED Linux x86: ega. (Eclipse x 48h)
nom...@intel.com   [build-test alert] BUILD FAILED Linux x86: ega. (Eclipse x 48h) Fri, 20 Jul, 10:10
nom...@intel.com   [build-test alert] BUILD FAILED Linux x86: ega. (Eclipse x 48h) Tue, 24 Jul, 09:12
nom...@intel.com   [build-test alert] BUILD FAILED Linux x86: ega. (Eclipse x 48h) Tue, 24 Jul, 09:52
nom...@intel.com   [build-test alert] BUILD FAILED Linux x86: ega. (Eclipse x 48h) Mon, 30 Jul, 12:14
nom...@intel.com [build-test alert] BUILD PASSED Linux x86: scimark Fri, 20 Jul, 11:52
[build-test alert] BUILD FAILED Linux x86_64: ehwa-api
nom...@intel.com   [build-test alert] BUILD FAILED Linux x86_64: ehwa-api Fri, 20 Jul, 14:56
nom...@intel.com   [build-test alert] BUILD FAILED Linux x86_64: ehwa-api Wed, 25 Jul, 12:30
[build-test alert] BUILD FAILED Linux x86: jdktools-test
nom...@intel.com   [build-test alert] BUILD FAILED Linux x86: jdktools-test Fri, 20 Jul, 15:02
nom...@intel.com   [build-test alert] BUILD FAILED Linux x86: jdktools-test Sun, 22 Jul, 19:12
nom...@intel.com   [build-test alert] BUILD FAILED Linux x86: jdktools-test Wed, 25 Jul, 18:51
nom...@intel.com   [build-test alert] BUILD FAILED Linux x86: jdktools-test Thu, 26 Jul, 23:33
[build-test alert] BUILD FAILED Linux x86: drlvm-test
nom...@intel.com   [build-test alert] BUILD FAILED Linux x86: drlvm-test Fri, 20 Jul, 19:24
nom...@intel.com   [build-test alert] BUILD FAILED Linux x86: drlvm-test Mon, 23 Jul, 14:40
nom...@intel.com   [build-test alert] BUILD FAILED Linux x86: drlvm-test Tue, 24 Jul, 15:50
nom...@intel.com   [build-test alert] BUILD FAILED Linux x86: drlvm-test Fri, 27 Jul, 19:03
[build-test alert] BUILD PASSED Linux x86: jdktools-test
nom...@intel.com   [build-test alert] BUILD PASSED Linux x86: jdktools-test Fri, 20 Jul, 20:20
nom...@intel.com   [build-test alert] BUILD PASSED Linux x86: jdktools-test Tue, 24 Jul, 23:43
nom...@intel.com   [build-test alert] BUILD PASSED Linux x86: jdktools-test Thu, 26 Jul, 02:37
nom...@intel.com   [build-test alert] BUILD PASSED Linux x86: jdktools-test Fri, 27 Jul, 08:52
[build-test alert] BUILD FAILED Linux x86: gut
nom...@intel.com   [build-test alert] BUILD FAILED Linux x86: gut Fri, 20 Jul, 20:27
nom...@intel.com   [build-test alert] BUILD FAILED Linux x86: gut Tue, 24 Jul, 20:31
nom...@intel.com [build-test alert] BUILD FAILED Linux x86: drlvm-reg-test Sun, 22 Jul, 06:10
[build-test alert] BUILD PASSED Linux x86: drlvm-test
nom...@intel.com   [build-test alert] BUILD PASSED Linux x86: drlvm-test Sun, 22 Jul, 08:39
nom...@intel.com   [build-test alert] BUILD PASSED Linux x86: drlvm-test Mon, 23 Jul, 20:45
nom...@intel.com   [build-test alert] BUILD PASSED Linux x86: drlvm-test Tue, 24 Jul, 22:32
nom...@intel.com   [build-test alert] BUILD PASSED Linux x86: drlvm-test Tue, 31 Jul, 04:17
[build-test alert] BUILD FAILED Linux x86_64: jdktools-test
nom...@intel.com   [build-test alert] BUILD FAILED Linux x86_64: jdktools-test Sun, 22 Jul, 09:04
nom...@intel.com   [build-test alert] BUILD FAILED Linux x86_64: jdktools-test Tue, 24 Jul, 00:41
nom...@intel.com   [build-test alert] BUILD FAILED Linux x86_64: jdktools-test Thu, 26 Jul, 13:48
[build-test alert] BUILD FAILED Windows 2003 x86: jdktools-testdebug
nom...@intel.com   [build-test alert] BUILD FAILED Windows 2003 x86: jdktools-testdebug Sun, 22 Jul, 10:24
nom...@intel.com   [build-test alert] BUILD FAILED Windows 2003 x86: jdktools-testdebug Wed, 25 Jul, 00:16
nom...@intel.com   [build-test alert] BUILD FAILED Windows 2003 x86: jdktools-testdebug Tue, 31 Jul, 21:33
nom...@intel.com [build-test alert] BUILD FAILED Windows 2003 x86_64: classlib Sun, 22 Jul, 11:58
nom...@intel.com [build-test alert] BUILD PASSED Linux x86: drlvm-reg-test Sun, 22 Jul, 15:22
[build-test alert] BUILD FAILED Windows 2003 x86_64: hdk
nom...@intel.com   [build-test alert] BUILD FAILED Windows 2003 x86_64: hdk Sun, 22 Jul, 16:11
nom...@intel.com   [build-test alert] BUILD FAILED Windows 2003 x86_64: hdk Wed, 25 Jul, 10:36
nom...@intel.com   [build-test alert] BUILD FAILED Windows 2003 x86_64: hdk Wed, 25 Jul, 11:54
[build-test alert] BUILD PASSED Linux x86_64: jdktools-test
nom...@intel.com   [build-test alert] BUILD PASSED Linux x86_64: jdktools-test Sun, 22 Jul, 18:35
nom...@intel.com   [build-test alert] BUILD PASSED Linux x86_64: jdktools-test Tue, 24 Jul, 22:28
nom...@intel.com   [build-test alert] BUILD PASSED Linux x86_64: jdktools-test Sat, 28 Jul, 05:43
[build-test alert] BUILD PASSED Windows 2003 x86: jdktools-testdebug
nom...@intel.com   [build-test alert] BUILD PASSED Windows 2003 x86: jdktools-testdebug Sun, 22 Jul, 20:40
nom...@intel.com   [build-test alert] BUILD PASSED Windows 2003 x86: jdktools-testdebug Sat, 28 Jul, 00:29
nom...@intel.com [build-test alert] BUILD FAILED Windows 2003 x86: classlib-gui-testdebug Sun, 22 Jul, 20:52
nom...@intel.com [build-test alert] BUILD FAILED Linux x86_64: classlib-gui-test Mon, 23 Jul, 09:11
[build-test alert] BUILD FAILED Linux x86_64: hdk
nom...@intel.com   [build-test alert] BUILD FAILED Linux x86_64: hdk Mon, 23 Jul, 09:30
nom...@intel.com   [build-test alert] BUILD FAILED Linux x86_64: hdk Wed, 25 Jul, 10:53
[build-test alert] BUILD FAILED Linux x86: ehwa-api
nom...@intel.com   [build-test alert] BUILD FAILED Linux x86: ehwa-api Mon, 23 Jul, 09:39
nom...@intel.com   [build-test alert] BUILD FAILED Linux x86: ehwa-api Tue, 24 Jul, 14:12
nom...@intel.com   [build-test alert] BUILD FAILED Linux x86: ehwa-api Tue, 24 Jul, 18:57
nom...@intel.com   [build-test alert] BUILD FAILED Linux x86: ehwa-api Tue, 31 Jul, 07:25
nom...@intel.com [build-test alert] BUILD PASSED Windows 2003 x86_64: classlib Mon, 23 Jul, 10:00
[build-test alert] BUILD PASSED Linux x86: classlib-test
nom...@intel.com   [build-test alert] BUILD PASSED Linux x86: classlib-test Mon, 23 Jul, 10:16
nom...@intel.com   [build-test alert] BUILD PASSED Linux x86: classlib-test Wed, 25 Jul, 07:58
nom...@intel.com   [build-test alert] BUILD PASSED Linux x86: classlib-test Thu, 26 Jul, 18:57
nom...@intel.com   [build-test alert] BUILD PASSED Linux x86: classlib-test Mon, 30 Jul, 20:09
[build-test alert] BUILD PASSED Linux x86_64: hdk
nom...@intel.com   [build-test alert] BUILD PASSED Linux x86_64: hdk Mon, 23 Jul, 11:01
nom...@intel.com   [build-test alert] BUILD PASSED Linux x86_64: hdk Wed, 25 Jul, 11:31
[build-test alert] BUILD PASSED Linux x86: ehwa-api
nom...@intel.com   [build-test alert] BUILD PASSED Linux x86: ehwa-api Mon, 23 Jul, 12:16
nom...@intel.com   [build-test alert] BUILD PASSED Linux x86: ehwa-api Tue, 24 Jul, 15:07
nom...@intel.com   [build-test alert] BUILD PASSED Linux x86: ehwa-api Wed, 25 Jul, 03:51
nom...@intel.com   [build-test alert] BUILD PASSED Linux x86: ehwa-api Tue, 31 Jul, 08:15
[build-test alert] BUILD FAILED Linux x86: jedit_test
nom...@intel.com   [build-test alert] BUILD FAILED Linux x86: jedit_test Tue, 24 Jul, 06:28
nom...@intel.com   [build-test alert] BUILD FAILED Linux x86: jedit_test Wed, 25 Jul, 00:37
nom...@intel.com   [build-test alert] BUILD FAILED Linux x86: jedit_test Wed, 01 Aug, 04:20
[build-test alert] BUILD PASSED Windows 2003 x86_64: hdk
nom...@intel.com   [build-test alert] BUILD PASSED Windows 2003 x86_64: hdk Tue, 24 Jul, 06:33
nom...@intel.com   [build-test alert] BUILD PASSED Windows 2003 x86_64: hdk Tue, 24 Jul, 09:28
nom...@intel.com   [build-test alert] BUILD PASSED Windows 2003 x86_64: hdk Wed, 25 Jul, 11:43
nom...@intel.com   [build-test alert] BUILD PASSED Windows 2003 x86_64: hdk Wed, 25 Jul, 12:28
nom...@intel.com   [build-test alert] BUILD PASSED Windows 2003 x86_64: hdk Tue, 31 Jul, 15:02
nom...@intel.com [build-test alert] BUILD PASSED Windows 2003 x86_64: dacapo Tue, 24 Jul, 09:15
nom...@intel.com [build-test alert] BUILD FAILED Windows 2003 x86_64: classlib-test Tue, 24 Jul, 10:26
Message list« Previous · 1 · 2 · 3 · 4 · Next »Thread · Author · Date
Box list
Jul 20113
Dec 201029
Nov 20106
Oct 201046
Sep 201035
Aug 201017
Jul 201029
Jun 201041
May 201020
Apr 201040
Mar 2010102
Feb 201043
Jan 201014
Dec 200911
Nov 20099
Oct 200912
Sep 20093
Aug 200915
Jul 200959
Jun 200916
May 200930
Apr 200960
Mar 200919
Feb 200945
Jan 200957
Dec 200827
Nov 200815
Oct 200824
Sep 200854
Aug 200834
Jul 200841
Jun 200899
May 200862
Apr 2008113
Mar 2008133
Feb 2008164
Jan 2008291
Dec 2007335
Nov 2007454
Oct 2007405
Sep 2007259
Aug 2007368
Jul 2007618
Jun 2007607
May 2007672
Apr 2007455
Mar 20071104
Feb 2007389
Jan 2007418
Dec 200692