harmony-alerts mailing list archives: July 2007

Site index · List index
Message list« Previous · 1 · 2 · 3 · 4 · Next »Thread · Author · Date
[build-test alert] BUILD SUCCEEDED Windows XP SP2 x86: jdktools_test
nom...@intel.com   [build-test alert] BUILD SUCCEEDED Windows XP SP2 x86: jdktools_test Wed, 04 Jul, 16:13
nom...@intel.com   [build-test alert] BUILD SUCCEEDED Windows XP SP2 x86: jdktools_test Tue, 10 Jul, 11:41
[build-test alert] BUILD SUCCEEDED Windows server 2003 msvc: jdktools_test
nom...@intel.com   [build-test alert] BUILD SUCCEEDED Windows server 2003 msvc: jdktools_test Thu, 05 Jul, 03:03
nom...@intel.com   [build-test alert] BUILD SUCCEEDED Windows server 2003 msvc: jdktools_test Fri, 13 Jul, 09:17
[build-test alert] BUILD FAILED Windows XP SP2 msvc debug: drlvm tests
nom...@intel.com   [build-test alert] BUILD FAILED Windows XP SP2 msvc debug: drlvm tests Thu, 05 Jul, 11:52
nom...@intel.com   [build-test alert] BUILD FAILED Windows XP SP2 msvc debug: drlvm tests Mon, 09 Jul, 13:07
nom...@intel.com   [build-test alert] BUILD FAILED Windows XP SP2 msvc debug: drlvm tests Tue, 10 Jul, 16:03
nom...@intel.com   [build-test alert] BUILD FAILED Windows XP SP2 msvc debug: drlvm tests Fri, 13 Jul, 07:09
nom...@intel.com   [build-test alert] BUILD FAILED Windows XP SP2 msvc debug: drlvm tests Tue, 17 Jul, 10:02
[build-test alert] BUILD SUCCEEDED Windows 2003 x86_64 msvc debug: drlvm
nom...@intel.com   [build-test alert] BUILD SUCCEEDED Windows 2003 x86_64 msvc debug: drlvm Thu, 05 Jul, 19:31
nom...@intel.com   [build-test alert] BUILD SUCCEEDED Windows 2003 x86_64 msvc debug: drlvm Wed, 25 Jul, 04:58
[build-test alert] BUILD SUCCEEDED Windows XP SP2 msvc debug: drlvm tests
nom...@intel.com   [build-test alert] BUILD SUCCEEDED Windows XP SP2 msvc debug: drlvm tests Thu, 05 Jul, 20:43
nom...@intel.com   [build-test alert] BUILD SUCCEEDED Windows XP SP2 msvc debug: drlvm tests Mon, 09 Jul, 18:00
nom...@intel.com   [build-test alert] BUILD SUCCEEDED Windows XP SP2 msvc debug: drlvm tests Tue, 10 Jul, 20:53
nom...@intel.com   [build-test alert] BUILD SUCCEEDED Windows XP SP2 msvc debug: drlvm tests Fri, 13 Jul, 12:03
[build-test alert] BUILD FAILED win msvc debug: classlib
nom...@intel.com   [build-test alert] BUILD FAILED win msvc debug: classlib Tue, 10 Jul, 10:05
nom...@intel.com   [build-test alert] BUILD FAILED win msvc debug: classlib Wed, 11 Jul, 09:47
nom...@intel.com   [build-test alert] BUILD FAILED win msvc debug: classlib Sun, 22 Jul, 12:01
nom...@intel.com [build-test alert] BUILD FAILED Windows XP ia32 msvc debug: classlib Tue, 10 Jul, 10:12
nom...@intel.com [build-test alert] BUILD FAILED Windows XP ia32 msvc debug: drlvm Tue, 10 Jul, 10:21
[build-test alert] BUILD SUCCEEDED win msvc debug: classlib
nom...@intel.com   [build-test alert] BUILD SUCCEEDED win msvc debug: classlib Tue, 10 Jul, 10:30
nom...@intel.com   [build-test alert] BUILD SUCCEEDED win msvc debug: classlib Wed, 11 Jul, 11:46
[build-test alert] BUILD FAILED Linux SUSE 9 gcc debug: classlib over drlvm
nom...@intel.com   [build-test alert] BUILD FAILED Linux SUSE 9 gcc debug: classlib over drlvm Tue, 10 Jul, 10:39
nom...@intel.com   [build-test alert] BUILD FAILED Linux SUSE 9 gcc debug: classlib over drlvm Tue, 10 Jul, 18:28
nom...@intel.com   [build-test alert] BUILD FAILED Linux SUSE 9 gcc debug: classlib over drlvm Thu, 12 Jul, 14:50
nom...@intel.com   [build-test alert] BUILD FAILED Linux SUSE 9 gcc debug: classlib over drlvm Fri, 20 Jul, 16:20
nom...@intel.com   [build-test alert] BUILD FAILED Linux SUSE 9 gcc debug: classlib over drlvm Sun, 22 Jul, 07:53
nom...@intel.com [build-test alert] BUILD SUCCEEDED Windows XP ia32 msvc debug: classlib Tue, 10 Jul, 10:44
nom...@intel.com [build-test alert] BUILD SUCCEEDED Windows XP ia32 msvc debug: drlvm Tue, 10 Jul, 11:18
[build-test alert] BUILD SUCCEEDED Linux SUSE 9 gcc debug: classlib over drlvm
nom...@intel.com   [build-test alert] BUILD SUCCEEDED Linux SUSE 9 gcc debug: classlib over drlvm Tue, 10 Jul, 14:32
nom...@intel.com   [build-test alert] BUILD SUCCEEDED Linux SUSE 9 gcc debug: classlib over drlvm Tue, 10 Jul, 21:50
nom...@intel.com   [build-test alert] BUILD SUCCEEDED Linux SUSE 9 gcc debug: classlib over drlvm Thu, 19 Jul, 10:11
nom...@intel.com   [build-test alert] BUILD SUCCEEDED Linux SUSE 9 gcc debug: classlib over drlvm Fri, 20 Jul, 21:14
[build-test alert] BUILD FAILED Windows 2003 x86_64 msvc debug: classlib
nom...@intel.com   [build-test alert] BUILD FAILED Windows 2003 x86_64 msvc debug: classlib Wed, 11 Jul, 09:41
nom...@intel.com   [build-test alert] BUILD FAILED Windows 2003 x86_64 msvc debug: classlib Sun, 22 Jul, 21:36
nom...@intel.com [build-test alert] BUILD SUCCEEDED Windows 2003 x86_64 msvc debug: classlib Wed, 11 Jul, 15:42
[build-test alert] BUILD FAILED Windows XP SP2 msvc debug: classlib over drlvm
nom...@intel.com   [build-test alert] BUILD FAILED Windows XP SP2 msvc debug: classlib over drlvm Wed, 11 Jul, 22:46
nom...@intel.com   [build-test alert] BUILD FAILED Windows XP SP2 msvc debug: classlib over drlvm Fri, 13 Jul, 18:08
[build-test alert] BUILD SUCCEEDED Windows XP SP2 msvc debug: classlib over drlvm
nom...@intel.com   [build-test alert] BUILD SUCCEEDED Windows XP SP2 msvc debug: classlib over drlvm Thu, 12 Jul, 02:43
nom...@intel.com   [build-test alert] BUILD SUCCEEDED Windows XP SP2 msvc debug: classlib over drlvm Wed, 18 Jul, 03:10
nom...@intel.com [build-test alert] BUILD FAILED Windows XP SP2 x86: tomcat start Thu, 12 Jul, 03:32
nom...@intel.com [build-test alert] BUILD SUCCEEDED Windows XP SP2 x86: tomcat start Thu, 12 Jul, 07:11
nom...@intel.com [build-test alert] BUILD FAILED Windows XP SP2 msvc debug: drlvm reg.test Mon, 16 Jul, 05:31
nom...@intel.com [build-test alert] BUILD FAILED Windows 2003 x86_64 msvc debug: drlvm Tue, 17 Jul, 07:45
nom...@intel.com [build-test alert] BUILD FAILED Linux SUSE9 64bit gcc debug: classlib Tue, 17 Jul, 10:46
nom...@intel.com [build-test alert] BUILD FAILED Linux SUSE9 64bit gcc debug: drlvm Tue, 17 Jul, 10:57
nom...@intel.com [build-test alert] BUILD SUCCEEDED Linux SUSE9 64bit gcc debug: classlib Tue, 17 Jul, 11:13
nom...@intel.com [build-test alert] BUILD SUCCEEDED Linux SUSE9 64bit gcc debug: drlvm Tue, 17 Jul, 11:41
[build-test alert] BUILD PASSED Windows 2003 x86: JettyScenario
nom...@intel.com   [build-test alert] BUILD PASSED Windows 2003 x86: JettyScenario Thu, 19 Jul, 11:49
nom...@intel.com   [build-test alert] BUILD PASSED Windows 2003 x86: JettyScenario Fri, 27 Jul, 07:26
nom...@intel.com   [build-test alert] BUILD PASSED Windows 2003 x86: JettyScenario Tue, 31 Jul, 13:08
[build-test alert] BUILD PASSED Linux x86: snapshot
nom...@intel.com   [build-test alert] BUILD PASSED Linux x86: snapshot Thu, 19 Jul, 11:50
nom...@intel.com   [build-test alert] BUILD PASSED Linux x86: snapshot Fri, 20 Jul, 10:02
nom...@intel.com   [build-test alert] BUILD PASSED Linux x86: snapshot Tue, 24 Jul, 09:16
nom...@intel.com   [build-test alert] BUILD PASSED Linux x86: snapshot Mon, 30 Jul, 12:05
[build-test alert] BUILD PASSED Windows 2003 x86: axis2_app
nom...@intel.com   [build-test alert] BUILD PASSED Windows 2003 x86: axis2_app Thu, 19 Jul, 11:53
nom...@intel.com   [build-test alert] BUILD PASSED Windows 2003 x86: axis2_app Fri, 27 Jul, 07:30
nom...@intel.com   [build-test alert] BUILD PASSED Windows 2003 x86: axis2_app Tue, 31 Jul, 13:10
[build-test alert] BUILD FAILED Windows 2003 x86: egax48
nom...@intel.com   [build-test alert] BUILD FAILED Windows 2003 x86: egax48 Thu, 19 Jul, 12:05
nom...@intel.com   [build-test alert] BUILD FAILED Windows 2003 x86: egax48 Thu, 19 Jul, 12:49
nom...@intel.com   [build-test alert] BUILD FAILED Windows 2003 x86: egax48 Tue, 24 Jul, 09:55
nom...@intel.com   [build-test alert] BUILD FAILED Windows 2003 x86: egax48 Mon, 30 Jul, 12:23
[build-test alert] BUILD FAILED Linux x86: reliability
nom...@intel.com   [build-test alert] BUILD FAILED Linux x86: reliability Thu, 19 Jul, 12:36
nom...@intel.com   [build-test alert] BUILD FAILED Linux x86: reliability Fri, 20 Jul, 10:48
nom...@intel.com   [build-test alert] BUILD FAILED Linux x86: reliability Tue, 24 Jul, 10:03
nom...@intel.com   [build-test alert] BUILD FAILED Linux x86: reliability Mon, 30 Jul, 12:50
[build-test alert] BUILD PASSED Linux x86: JettyScenario
nom...@intel.com   [build-test alert] BUILD PASSED Linux x86: JettyScenario Thu, 19 Jul, 12:44
nom...@intel.com   [build-test alert] BUILD PASSED Linux x86: JettyScenario Tue, 24 Jul, 22:08
[build-test alert] BUILD PASSED Linux x86: axis2_app
nom...@intel.com   [build-test alert] BUILD PASSED Linux x86: axis2_app Thu, 19 Jul, 12:47
nom...@intel.com   [build-test alert] BUILD PASSED Linux x86: axis2_app Fri, 20 Jul, 08:32
nom...@intel.com   [build-test alert] BUILD PASSED Linux x86: axis2_app Wed, 25 Jul, 01:40
nom...@intel.com   [build-test alert] BUILD PASSED Linux x86: axis2_app Wed, 01 Aug, 05:21
[build-test alert] BUILD FAILED Linux x86: classlib-test
nom...@intel.com   [build-test alert] BUILD FAILED Linux x86: classlib-test Thu, 19 Jul, 13:03
nom...@intel.com   [build-test alert] BUILD FAILED Linux x86: classlib-test Tue, 24 Jul, 10:33
nom...@intel.com   [build-test alert] BUILD FAILED Linux x86: classlib-test Thu, 26 Jul, 17:15
nom...@intel.com   [build-test alert] BUILD FAILED Linux x86: classlib-test Mon, 30 Jul, 17:02
nom...@intel.com [build-test alert] BUILD FAILED Windows 2003 x86_64: classlib-gui-test Thu, 19 Jul, 13:33
nom...@intel.com [build-test alert] BUILD FAILED Windows 2003 x86_64: drlvm-reg-test Thu, 19 Jul, 15:44
[build-test alert] BUILD FAILED Linux x86: eut
nom...@intel.com   [build-test alert] BUILD FAILED Linux x86: eut Thu, 19 Jul, 17:53
nom...@intel.com   [build-test alert] BUILD FAILED Linux x86: eut Fri, 20 Jul, 16:43
nom...@intel.com   [build-test alert] BUILD FAILED Linux x86: eut Tue, 24 Jul, 16:53
[build-test alert] BUILD FAILED Linux x86_64: drlvm-test
nom...@intel.com   [build-test alert] BUILD FAILED Linux x86_64: drlvm-test Thu, 19 Jul, 18:14
nom...@intel.com   [build-test alert] BUILD FAILED Linux x86_64: drlvm-test Wed, 25 Jul, 16:57
[build-test alert] BUILD PASSED Windows 2003 x86: drlvm-testdebug
nom...@intel.com   [build-test alert] BUILD PASSED Windows 2003 x86: drlvm-testdebug Thu, 19 Jul, 19:28
nom...@intel.com   [build-test alert] BUILD PASSED Windows 2003 x86: drlvm-testdebug Fri, 20 Jul, 08:47
nom...@intel.com   [build-test alert] BUILD PASSED Windows 2003 x86: drlvm-testdebug Sun, 22 Jul, 09:30
nom...@intel.com   [build-test alert] BUILD PASSED Windows 2003 x86: drlvm-testdebug Tue, 24 Jul, 16:35
nom...@intel.com [build-test alert] BUILD PASSED Linux x86_64: drlvm-test Thu, 19 Jul, 21:58
nom...@intel.com [build-test alert] BUILD FAILED Linux x86: classlib-gui-test Thu, 19 Jul, 22:23
Message list« Previous · 1 · 2 · 3 · 4 · Next »Thread · Author · Date
Box list
Jul 20113
Dec 201029
Nov 20106
Oct 201046
Sep 201035
Aug 201017
Jul 201029
Jun 201041
May 201020
Apr 201040
Mar 2010102
Feb 201043
Jan 201014
Dec 200911
Nov 20099
Oct 200912
Sep 20093
Aug 200915
Jul 200959
Jun 200916
May 200930
Apr 200960
Mar 200919
Feb 200945
Jan 200957
Dec 200827
Nov 200815
Oct 200824
Sep 200854
Aug 200834
Jul 200841
Jun 200899
May 200862
Apr 2008113
Mar 2008133
Feb 2008164
Jan 2008291
Dec 2007335
Nov 2007454
Oct 2007405
Sep 2007259
Aug 2007368
Jul 2007618
Jun 2007607
May 2007672
Apr 2007455
Mar 20071104
Feb 2007389
Jan 2007418
Dec 200692