harmony-alerts mailing list archives: July 2007

Site index · List index
Message list1 · 2 · 3 · 4 · 5 · 6 · 7 · Next »Thread · Author · Date
nom...@intel.com [build-test alert] BUILD FAILED LINUX SUSE 9 x86_64: harmony_hdk Sun, 01 Jul, 21:29
nbe...@kc.rr.com [build-test alert] BUILD FAILED Windows XP x86: classlib-test Sun, 01 Jul, 22:04
nom...@intel.com [build-test alert] BUILD SUCCEEDED Linux SUSE 9 x86_64: harmony_hdk Sun, 01 Jul, 22:10
nom...@intel.com [build-test alert] BUILD FAILED Linux SUSE 9 gcc debug: drlvm reg.test Mon, 02 Jul, 00:24
nbe...@kc.rr.com [build-test alert] BUILD PASSED Windows XP x86: drlvm-test Mon, 02 Jul, 03:31
nbe...@kc.rr.com [build-test alert] BUILD FAILED Windows XP x86: classlib-test Mon, 02 Jul, 05:06
nbe...@kc.rr.com [build-test alert] BUILD FAILED Windows XP x86: drlvm-test Mon, 02 Jul, 09:19
nom...@intel.com [build-test alert] BUILD FAILED LINUX SUSE 9 x86_64: harmony_hdk Mon, 02 Jul, 13:26
nom...@intel.com [build-test alert] BUILD SUCCEEDED Linux SUSE 9 x86_64: harmony_hdk Mon, 02 Jul, 14:03
nom...@intel.com [build-test alert] BUILD FAILED LINUX SUSE 9 x86: jdktools_test Mon, 02 Jul, 14:23
nom...@intel.com [build-test alert] BUILD FAILED Windows 2003 x86_64 msvc debug: drlvm regression tests Mon, 02 Jul, 14:45
nom...@intel.com [build-test alert] BUILD SUCCEEDED Linux SUSE 9 x86: jdktools_test Mon, 02 Jul, 14:52
nom...@intel.com [build-test alert] BUILD FAILED LINUX SUSE 9 x86_64: harmony_hdk Mon, 02 Jul, 15:31
nom...@intel.com [build-test alert] BUILD SUCCEEDED Linux SUSE 9 x86_64: harmony_hdk Mon, 02 Jul, 16:08
nbe...@kc.rr.com [build-test alert] BUILD FAILED Windows XP x86: drlvm-test Mon, 02 Jul, 17:47
nom...@intel.com [build-test alert] BUILD FAILED Linux SUSE 9 64bit gcc debug: drlvm reg.test Mon, 02 Jul, 18:00
nom...@intel.com [build-test alert] BUILD FAILED Windows 2003 x86_64 msvc debug: classlib tests Mon, 02 Jul, 21:05
nom...@intel.com [build-test alert] BUILD FAILED Windows server 2003 msvc: jdktools_test Mon, 02 Jul, 22:08
nbe...@kc.rr.com [build-test alert] BUILD PASSED Windows XP x86: drlvm-test Tue, 03 Jul, 00:33
nbe...@kc.rr.com [build-test alert] BUILD FAILED Windows XP x86: classlib-test Tue, 03 Jul, 01:42
nom...@intel.com [build-test alert] BUILD FAILED LINUX SUSE 9 x86_64: harmony HDK Tue, 03 Jul, 02:00
nom...@intel.com [build-test alert] BUILD FAILED LINUX SUSE 9 x86_64: tomcat start Tue, 03 Jul, 02:03
nom...@intel.com [build-test alert] BUILD FAILED LINUX SUSE 9 x86: harmony HDK Tue, 03 Jul, 02:30
nom...@intel.com [build-test alert] BUILD FAILED LINUX SUSE 9 x86: tomcat start Tue, 03 Jul, 02:32
nom...@intel.com [build-test alert] BUILD FAILED LINUX SUSE 9 x86: jdktools_test Tue, 03 Jul, 02:33
nom...@intel.com [build-test alert] BUILD FAILED Windows XP SP2 x86: harmony HDK Tue, 03 Jul, 02:41
nom...@intel.com [build-test alert] BUILD FAILED Windows XP SP2 x86: jdktools_test Tue, 03 Jul, 02:42
nom...@intel.com [build-test alert] BUILD FAILED Windows server 2003 msvc: harmony Tue, 03 Jul, 02:47
nom...@intel.com [build-test alert] BUILD FAILED Windows server 2003 x86_64: tomcat start Tue, 03 Jul, 03:08
nom...@intel.com [build-test alert] BUILD SUCCEEDED Linux SUSE 9 x86_64: harmony HDK Tue, 03 Jul, 03:11
nom...@intel.com [build-test alert] BUILD SUCCEEDED Linux SUSE 9 x86_64: tomcat start Tue, 03 Jul, 03:14
nom...@intel.com [build-test alert] BUILD SUCCEEDED Linux SUSE 9 x86: harmony HDK Tue, 03 Jul, 03:22
nom...@intel.com [build-test alert] BUILD SUCCEEDED Windows XP SP2 x86: harmony HDK Tue, 03 Jul, 03:49
nom...@intel.com [build-test alert] BUILD SUCCEEDED Windows server 2003 msvc: harmony Tue, 03 Jul, 03:50
nom...@intel.com [build-test alert] BUILD SUCCEEDED Linux SUSE 9 x86: tomcat start Tue, 03 Jul, 03:53
nom...@intel.com [build-test alert] BUILD SUCCEEDED Windows server 2003 x86_64: tomcat start Tue, 03 Jul, 03:54
nom...@intel.com [build-test alert] BUILD SUCCEEDED Windows 2003 x86_64 msvc debug: classlib tests Tue, 03 Jul, 04:13
nom...@intel.com [build-test alert] BUILD FAILED Linux SUSE 9 gcc debug: drlvm test Tue, 03 Jul, 05:43
nbe...@kc.rr.com [build-test alert] BUILD FAILED Windows XP x86: drlvm-test Tue, 03 Jul, 06:33
nom...@intel.com [build-test alert] BUILD FAILED LINUX SUSE 9 x86_64: harmony_hdk Tue, 03 Jul, 07:18
nom...@intel.com [build-test alert] BUILD SUCCEEDED Linux SUSE 9 x86_64: harmony_hdk Tue, 03 Jul, 08:14
nom...@intel.com [build-test alert] BUILD FAILED LINUX SUSE 9 x86_64: harmony_hdk Tue, 03 Jul, 09:08
nom...@intel.com [build-test alert] BUILD SUCCEEDED Linux SUSE 9 x86_64: harmony_hdk Tue, 03 Jul, 09:59
nom...@intel.com [build-test alert] BUILD SUCCEEDED Linux SUSE 9 64bit gcc debug: classlib over drlvm Tue, 03 Jul, 10:44
nom...@intel.com [build-test alert] BUILD SUCCEEDED Linux SUSE 9 gcc debug: drlvm test Tue, 03 Jul, 11:36
nom...@intel.com [build-test alert] BUILD FAILED Windows 2003 x86_64 msvc debug: classlib tests Tue, 03 Jul, 12:11
nom...@intel.com [build-test alert] BUILD SUCCEEDED Linux SUSE 9 64bit gcc debug: drlvm reg.test Tue, 03 Jul, 12:48
nbe...@kc.rr.com [build-test alert] BUILD FAILED Windows XP x86: drlvm-test Tue, 03 Jul, 13:12
nom...@intel.com [build-test alert] BUILD FAILED Linux SUSE 9 64bit gcc debug: drlvm tests Tue, 03 Jul, 16:01
nbe...@kc.rr.com [build-test alert] BUILD FAILED Windows XP x86: drlvm-test Tue, 03 Jul, 18:03
nom...@intel.com [build-test alert] BUILD SUCCEEDED Linux SUSE 9 64bit gcc debug: drlvm tests Tue, 03 Jul, 18:55
nom...@intel.com [build-test alert] BUILD FAILED Windows 2003 x86_64 msvc debug: drlvm regression tests Tue, 03 Jul, 18:59
nbe...@kc.rr.com [build-test alert] BUILD FAILED Windows XP x86: drlvm-test Tue, 03 Jul, 23:58
nbe...@kc.rr.com [build-test alert] BUILD FAILED Windows XP x86: classlib-test Wed, 04 Jul, 01:13
nom...@intel.com [build-test alert] BUILD FAILED LINUX SUSE 9 x86_64: harmony HDK Wed, 04 Jul, 03:18
nom...@intel.com [build-test alert] BUILD FAILED LINUX SUSE 9 x86_64: tomcat start Wed, 04 Jul, 03:21
nom...@intel.com [build-test alert] BUILD FAILED Linux SUSE 9 64bit gcc debug: classlib over drlvm Wed, 04 Jul, 03:32
nom...@intel.com [build-test alert] BUILD FAILED Linux SUSE 9 64bit gcc debug: drlvm tests Wed, 04 Jul, 03:32
nom...@intel.com [build-test alert] BUILD FAILED Linux SUSE 9 64bit gcc debug: drlvm reg.test Wed, 04 Jul, 03:33
nom...@intel.com [build-test alert] BUILD FAILED win msvc debug: drlvm Wed, 04 Jul, 04:00
nom...@intel.com [build-test alert] BUILD FAILED Windows server 2003 msvc: harmony Wed, 04 Jul, 05:01
nom...@intel.com [build-test alert] BUILD SUCCEEDED win msvc debug: drlvm Wed, 04 Jul, 05:26
nom...@intel.com [build-test alert] BUILD FAILED Windows server 2003 x86_64: tomcat start Wed, 04 Jul, 05:34
nom...@intel.com [build-test alert] BUILD SUCCEEDED Linux SUSE 9 x86_64: harmony HDK Wed, 04 Jul, 05:35
nom...@intel.com [build-test alert] BUILD SUCCEEDED Linux SUSE 9 x86_64: tomcat start Wed, 04 Jul, 05:38
nom...@intel.com [build-test alert] BUILD SUCCEEDED Linux SUSE 9 64bit gcc debug: classlib over drlvm Wed, 04 Jul, 05:43
nom...@intel.com [build-test alert] BUILD SUCCEEDED Linux SUSE 9 gcc debug: drlvm reg.test Wed, 04 Jul, 05:43
nom...@intel.com [build-test alert] BUILD SUCCEEDED Windows server 2003 msvc: harmony Wed, 04 Jul, 06:18
nom...@intel.com [build-test alert] BUILD SUCCEEDED Windows server 2003 x86_64: tomcat start Wed, 04 Jul, 06:20
nbe...@kc.rr.com [build-test alert] BUILD FAILED Windows XP x86: drlvm-test Wed, 04 Jul, 06:52
nom...@intel.com [build-test alert] BUILD SUCCEEDED Linux SUSE 9 64bit gcc debug: drlvm tests Wed, 04 Jul, 07:28
nom...@intel.com [build-test alert] BUILD SUCCEEDED Linux SUSE 9 64bit gcc debug: drlvm reg.test Wed, 04 Jul, 08:47
nom...@intel.com [build-test alert] BUILD SUCCEEDED Windows 2003 x86_64 msvc debug: classlib tests Wed, 04 Jul, 10:03
nom...@hursley.ibm.com [continuum] BUILD FAILURE: Classlib/linux.ia32 Build/Test Wed, 04 Jul, 10:57
nom...@hursley.ibm.com [continuum] BUILD FAILURE: Classlib/linux.ia32 Build/Test Wed, 04 Jul, 12:34
nbe...@kc.rr.com [build-test alert] BUILD FAILED Windows XP x86: drlvm-test Wed, 04 Jul, 12:43
nom...@intel.com [build-test alert] BUILD FAILED LINUX SUSE 9 x86_64: harmony_hdk Wed, 04 Jul, 13:55
nom...@hursley.ibm.com [continuum] BUILD FAILURE: Classlib/linux.ia32 Build/Test Wed, 04 Jul, 14:26
nom...@intel.com [build-test alert] BUILD SUCCEEDED Linux SUSE 9 x86_64: harmony_hdk Wed, 04 Jul, 15:03
nom...@hursley.ibm.com [continuum] BUILD FAILURE: Java6 Classlib/linux.ia32 Build/Test Wed, 04 Jul, 15:54
nom...@intel.com [build-test alert] BUILD SUCCEEDED Windows XP SP2 x86: jdktools_test Wed, 04 Jul, 16:13
nom...@intel.com [build-test alert] BUILD SUCCEEDED Linux SUSE 9 x86: jdktools_test Wed, 04 Jul, 16:40
nom...@intel.com [build-test alert] BUILD FAILED Windows 2003 x86_64 msvc debug: classlib tests Wed, 04 Jul, 17:57
nbe...@kc.rr.com [build-test alert] BUILD FAILED Windows XP x86: drlvm-test Wed, 04 Jul, 18:16
nom...@intel.com [build-test alert] BUILD FAILED Linux SUSE 9 64bit gcc debug: drlvm tests Wed, 04 Jul, 19:50
nom...@hursley.ibm.com [continuum] BUILD FAILURE: Classlib/linux.ia32 Build/Test Wed, 04 Jul, 19:52
nom...@intel.com [build-test alert] BUILD SUCCEEDED Linux SUSE 9 64bit gcc debug: drlvm tests Wed, 04 Jul, 21:56
nbe...@kc.rr.com [build-test alert] BUILD FAILED Windows XP x86: drlvm-test Wed, 04 Jul, 22:40
nom...@intel.com [build-test alert] BUILD SUCCEEDED Windows 2003 x86_64 msvc debug: classlib tests Wed, 04 Jul, 23:54
nbe...@kc.rr.com [build-test alert] BUILD FAILED Windows XP x86: classlib-test Thu, 05 Jul, 00:08
nom...@intel.com [build-test alert] BUILD FAILED LINUX SUSE 9 x86_64: harmony_hdk Thu, 05 Jul, 02:01
nom...@intel.com [build-test alert] BUILD SUCCEEDED Linux SUSE 9 x86_64: harmony_hdk Thu, 05 Jul, 02:55
nom...@intel.com [build-test alert] BUILD SUCCEEDED Windows server 2003 msvc: jdktools_test Thu, 05 Jul, 03:03
nom...@intel.com [build-test alert] BUILD FAILED Linux SUSE 9 64bit gcc debug: classlib over drlvm Thu, 05 Jul, 04:29
nbe...@kc.rr.com [build-test alert] BUILD FAILED Windows XP x86: drlvm-test Thu, 05 Jul, 04:37
nom...@hursley.ibm.com [continuum] BUILD FAILURE: Classlib/linux.ia32 Build/Test Thu, 05 Jul, 06:03
nom...@intel.com [build-test alert] BUILD FAILED Linux SUSE 9 gcc debug: drlvm test Thu, 05 Jul, 06:07
nom...@intel.com [build-test alert] BUILD FAILED Windows 2003 x86_64 msvc debug: classlib tests Thu, 05 Jul, 06:25
nom...@intel.com [build-test alert] BUILD FAILED LINUX SUSE 9 x86_64: harmony_hdk Thu, 05 Jul, 06:40
nom...@intel.com [build-test alert] BUILD SUCCEEDED Linux SUSE 9 x86_64: harmony_hdk Thu, 05 Jul, 07:23
Message list1 · 2 · 3 · 4 · 5 · 6 · 7 · Next »Thread · Author · Date
Box list
Jul 20113
Dec 201029
Nov 20106
Oct 201046
Sep 201035
Aug 201017
Jul 201029
Jun 201041
May 201020
Apr 201040
Mar 2010102
Feb 201043
Jan 201014
Dec 200911
Nov 20099
Oct 200912
Sep 20093
Aug 200915
Jul 200959
Jun 200916
May 200930
Apr 200960
Mar 200919
Feb 200945
Jan 200957
Dec 200827
Nov 200815
Oct 200824
Sep 200854
Aug 200834
Jul 200841
Jun 200899
May 200862
Apr 2008113
Mar 2008133
Feb 2008164
Jan 2008291
Dec 2007335
Nov 2007454
Oct 2007405
Sep 2007259
Aug 2007368
Jul 2007618
Jun 2007607
May 2007672
Apr 2007455
Mar 20071104
Feb 2007389
Jan 2007418
Dec 200692