harmony-alerts mailing list archives: July 2007

Site index · List index
Message list« Previous · 1 · 2 · 3 · 4 · 5 · 6 · 7 · Next »Thread · Author · Date
nom...@intel.com [build-test alert] BUILD SUCCEEDED Windows 2003 x86_64 msvc debug: drlvm Wed, 25 Jul, 04:58
nom...@intel.com [build-test alert] BUILD FAILED Linux SUSE 9 64bit gcc debug: drlvm tests Wed, 25 Jul, 06:50
nom...@intel.com [build-test alert] BUILD FAILED Windows 2003 x86: jedit_test Wed, 25 Jul, 07:06
nom...@intel.com [build-test alert] BUILD PASSED Linux x86_64: scimark Wed, 25 Jul, 07:34
nom...@intel.com [build-test alert] BUILD PASSED Linux x86: classlib-test Wed, 25 Jul, 07:58
nom...@intel.com [build-test alert] BUILD PASSED Windows 2003 x86: classlib-testdebug Wed, 25 Jul, 08:03
nom...@intel.com [build-test alert] BUILD PASSED Windows 2003 x86_64: classlib-test Wed, 25 Jul, 08:24
nom...@intel.com [build-test alert] BUILD PASSED Linux x86_64: classlib-test Wed, 25 Jul, 08:32
nom...@intel.com [build-test alert] BUILD SUCCEEDED Linux SUSE 9 64bit gcc debug: drlvm tests Wed, 25 Jul, 09:34
nom...@intel.com [build-test alert] BUILD PASSED Windows 2003 x86_64: drlvm-reg-test Wed, 25 Jul, 10:10
nom...@intel.com [build-test alert] BUILD FAILED Windows 2003 x86: drlvm Wed, 25 Jul, 10:11
nom...@intel.com [build-test alert] BUILD FAILED Linux x86: drlvm Wed, 25 Jul, 10:12
nom...@intel.com [build-test alert] BUILD FAILED Linux x86_64: drlvm Wed, 25 Jul, 10:15
nom...@intel.com [build-test alert] BUILD FAILED Windows 2003 x86_64: hdk Wed, 25 Jul, 10:36
nom...@intel.com [build-test alert] BUILD FAILED Linux x86_64: hdk Wed, 25 Jul, 10:53
nom...@intel.com [build-test alert] BUILD FAILED Linux x86: hdk Wed, 25 Jul, 11:20
nom...@intel.com [build-test alert] BUILD PASSED Windows 2003 x86: drlvm Wed, 25 Jul, 11:23
nom...@intel.com [build-test alert] BUILD PASSED Linux x86_64: drlvm Wed, 25 Jul, 11:24
nom...@intel.com [build-test alert] BUILD PASSED Linux x86: drlvm Wed, 25 Jul, 11:27
nom...@intel.com [build-test alert] BUILD PASSED Linux x86_64: hdk Wed, 25 Jul, 11:31
nom...@intel.com [build-test alert] BUILD PASSED Windows 2003 x86_64: hdk Wed, 25 Jul, 11:43
nom...@intel.com [build-test alert] BUILD PASSED Linux x86: hdk Wed, 25 Jul, 11:47
nom...@intel.com [build-test alert] BUILD FAILED Windows 2003 x86_64: hdk Wed, 25 Jul, 11:54
nom...@intel.com [build-test alert] BUILD FAILED Linux SUSE 9 64bit gcc debug: drlvm reg.test Wed, 25 Jul, 12:24
nom...@intel.com [build-test alert] BUILD PASSED Windows 2003 x86_64: hdk Wed, 25 Jul, 12:28
nom...@intel.com [build-test alert] BUILD FAILED Linux x86_64: drlvm-reg-test Wed, 25 Jul, 12:29
nom...@intel.com [build-test alert] BUILD FAILED Linux x86_64: ehwa-api Wed, 25 Jul, 12:30
nom...@intel.com [build-test alert] BUILD FAILED Linux SUSE 9 64bit gcc debug: drlvm tests Wed, 25 Jul, 12:30
nom...@intel.com [build-test alert] BUILD FAILED Windows 2003 x86: eut Wed, 25 Jul, 13:39
nom...@intel.com [build-test alert] BUILD PASSED Linux x86_64: ehwa-api Wed, 25 Jul, 13:53
nom...@intel.com [build-test alert] BUILD PASSED Linux x86_64: drlvm-reg-test Wed, 25 Jul, 14:26
nom...@intel.com [build-test alert] BUILD FAILED Windows 2003 x86: func Wed, 25 Jul, 14:55
nom...@intel.com [build-test alert] BUILD FAILED Windows 2003 x86: stress Wed, 25 Jul, 16:34
nom...@intel.com [build-test alert] BUILD PASSED Windows 2003 x86: struts_test Wed, 25 Jul, 16:37
nom...@intel.com [build-test alert] BUILD PASSED Windows 2003 x86: tomcat-scenario Wed, 25 Jul, 16:38
nom...@intel.com [build-test alert] BUILD FAILED Linux x86_64: drlvm-test Wed, 25 Jul, 16:57
nom...@intel.com [build-test alert] BUILD FAILED Linux SUSE 9 gcc debug: drlvm test Wed, 25 Jul, 17:31
nom...@intel.com [build-test alert] BUILD FAILED Linux x86: jdktools-test Wed, 25 Jul, 18:51
nom...@intel.com [build-test alert] BUILD SUCCEEDED Linux SUSE 9 gcc debug: drlvm test Wed, 25 Jul, 20:34
nom...@intel.com [build-test alert] BUILD SUCCEEDED Linux SUSE 9 64bit gcc debug: drlvm reg.test Wed, 25 Jul, 21:33
nom...@intel.com [build-test alert] BUILD FAILED Windows 2003 x86: drlvm-testdebug Wed, 25 Jul, 22:17
nom...@intel.com [build-test alert] BUILD SUCCEEDED Linux SUSE 9 64bit gcc debug: drlvm tests Wed, 25 Jul, 23:36
nom...@intel.com [build-test alert] BUILD PASSED Linux x86: jdktools-test Thu, 26 Jul, 02:37
nom...@intel.com [build-test alert] BUILD FAILED Linux x86_64: classlib-test Thu, 26 Jul, 04:42
nom...@intel.com [build-test alert] BUILD FAILED Windows 2003 x86: tptp Thu, 26 Jul, 05:17
nom...@intel.com [build-test alert] BUILD FAILED Windows 2003 x86: vtsvm Thu, 26 Jul, 05:54
nom...@intel.com [build-test alert] BUILD PASSED Linux x86_64: dacapo Thu, 26 Jul, 05:56
nom...@intel.com [build-test alert] BUILD FAILED Linux SUSE 9 gcc debug: drlvm test Thu, 26 Jul, 09:05
nom...@intel.com [build-test alert] BUILD PASSED Linux x86_64: classlib-test Thu, 26 Jul, 10:51
nom...@intel.com [build-test alert] BUILD FAILED Windows 2003 x86_64: drlvm-test Thu, 26 Jul, 12:07
nom...@intel.com [build-test alert] BUILD SUCCEEDED Linux SUSE 9 gcc debug: drlvm test Thu, 26 Jul, 12:17
nom...@intel.com [build-test alert] BUILD FAILED Linux x86_64: jdktools-test Thu, 26 Jul, 13:48
nom...@intel.com [build-test alert] BUILD FAILED Linux SUSE 9 gcc debug: drlvm test Thu, 26 Jul, 16:16
nom...@intel.com [build-test alert] BUILD FAILED Linux x86: classlib-test Thu, 26 Jul, 17:15
nom...@intel.com [build-test alert] BUILD PASSED Linux x86: classlib-test Thu, 26 Jul, 18:57
nom...@intel.com [build-test alert] BUILD SUCCEEDED Linux SUSE 9 gcc debug: drlvm test Thu, 26 Jul, 19:22
nom...@intel.com [build-test alert] BUILD FAILED Linux x86: jdktools-test Thu, 26 Jul, 23:33
nom...@intel.com [build-test alert] BUILD FAILED Linux SUSE 9 gcc debug: drlvm test Fri, 27 Jul, 00:11
nom...@intel.com [build-test alert] BUILD FAILED Windows 2003 x86: classlib-testdebug Fri, 27 Jul, 03:03
nom...@intel.com [build-test alert] BUILD FAILED Linux SUSE 9 64bit gcc debug: drlvm tests Fri, 27 Jul, 05:04
nom...@intel.com [build-test alert] BUILD SUCCEEDED Linux SUSE 9 gcc debug: drlvm test Fri, 27 Jul, 06:28
nom...@intel.com [build-test alert] BUILD PASSED Windows 2003 x86: JettyScenario Fri, 27 Jul, 07:26
nom...@intel.com [build-test alert] BUILD PASSED Windows 2003 x86: axis2_app Fri, 27 Jul, 07:30
nom...@intel.com [build-test alert] BUILD SUCCEEDED Linux SUSE 9 64bit gcc debug: drlvm tests Fri, 27 Jul, 07:46
nom...@intel.com [build-test alert] BUILD PASSED Linux x86: jdktools-test Fri, 27 Jul, 08:52
nom...@intel.com [build-test alert] BUILD PASSED Windows 2003 x86: classlib-testdebug Fri, 27 Jul, 11:51
nom...@intel.com [build-test alert] BUILD FAILED Linux SUSE 9 gcc debug: drlvm test Fri, 27 Jul, 12:20
nom...@intel.com [build-test alert] BUILD FAILED Linux x86_64: classlib-test Fri, 27 Jul, 16:50
nom...@intel.com [build-test alert] BUILD FAILED Linux x86: drlvm-test Fri, 27 Jul, 19:03
nom...@intel.com [build-test alert] BUILD FAILED Linux SUSE 9 64bit gcc debug: drlvm tests Fri, 27 Jul, 19:06
nom...@intel.com [build-test alert] BUILD SUCCEEDED Linux SUSE 9 64bit gcc debug: drlvm tests Fri, 27 Jul, 21:51
nom...@intel.com [build-test alert] BUILD PASSED Windows 2003 x86: jdktools-testdebug Sat, 28 Jul, 00:29
nom...@intel.com [build-test alert] BUILD PASSED Linux x86_64: jdktools-test Sat, 28 Jul, 05:43
nom...@intel.com [build-test alert] BUILD SUCCEEDED Linux SUSE 9 gcc debug: drlvm test Sat, 28 Jul, 17:57
nom...@intel.com [build-test alert] BUILD FAILED Windows server 2003 msvc: harmony Mon, 30 Jul, 03:02
nom...@intel.com [build-test alert] BUILD PASSED Windows 2003 x86_64: scimark Mon, 30 Jul, 11:53
nom...@intel.com [build-test alert] BUILD PASSED Linux x86_64: dacapo Mon, 30 Jul, 11:56
nom...@intel.com [build-test alert] BUILD FAILED Linux SUSE 9 gcc debug: drlvm test Mon, 30 Jul, 12:01
nom...@intel.com [build-test alert] BUILD PASSED Linux x86: snapshot Mon, 30 Jul, 12:05
nom...@intel.com [build-test alert] BUILD FAILED Linux x86: ega. (Eclipse x 48h) Mon, 30 Jul, 12:14
nom...@intel.com [build-test alert] BUILD PASSED Linux x86_64: scimark Mon, 30 Jul, 12:17
nom...@intel.com [build-test alert] BUILD FAILED Windows 2003 x86: egax48 Mon, 30 Jul, 12:23
nom...@intel.com [build-test alert] BUILD FAILED Linux x86: reliability Mon, 30 Jul, 12:50
nom...@intel.com [build-test alert] BUILD FAILED Windows 2003 x86_64: dacapo Mon, 30 Jul, 14:16
nom...@intel.com [build-test alert] BUILD FAILED Linux x86: classlib-test Mon, 30 Jul, 17:02
nom...@intel.com [build-test alert] BUILD PASSED Linux x86: classlib-test Mon, 30 Jul, 20:09
nom...@intel.com [build-test alert] BUILD PASSED Linux x86: drlvm-test Tue, 31 Jul, 04:17
nom...@intel.com [build-test alert] BUILD FAILED Linux SUSE 9 64bit gcc debug: drlvm tests Tue, 31 Jul, 05:42
nom...@intel.com [build-test alert] BUILD FAILED Linux x86_64: drlvm-reg-test Tue, 31 Jul, 05:54
nom...@intel.com [build-test alert] BUILD FAILED Linux x86: ehwa-api Tue, 31 Jul, 07:25
nom...@intel.com [build-test alert] BUILD PASSED Linux x86: ehwa-api Tue, 31 Jul, 08:15
nom...@intel.com [build-test alert] BUILD SUCCEEDED Linux SUSE 9 64bit gcc debug: drlvm tests Tue, 31 Jul, 08:28
nom...@intel.com [build-test alert] BUILD FAILED Linux SUSE 9 64bit gcc debug: drlvm tests Tue, 31 Jul, 11:16
nom...@intel.com [build-test alert] BUILD SUCCEEDED Linux SUSE 9 gcc debug: drlvm test Tue, 31 Jul, 12:35
nom...@intel.com [build-test alert] BUILD PASSED Windows 2003 x86: JettyScenario Tue, 31 Jul, 13:08
nom...@intel.com [build-test alert] BUILD PASSED Windows 2003 x86: axis2_app Tue, 31 Jul, 13:10
nom...@intel.com [build-test alert] BUILD FAILED Windows 2003 x86: drlvm Tue, 31 Jul, 13:47
nom...@intel.com [build-test alert] BUILD FAILED Windows 2003 x86_64: drlvm Tue, 31 Jul, 13:51
nom...@intel.com [build-test alert] BUILD SUCCEEDED Linux SUSE 9 64bit gcc debug: drlvm tests Tue, 31 Jul, 14:04
nom...@intel.com [build-test alert] BUILD PASSED Windows 2003 x86: drlvm Tue, 31 Jul, 14:26
Message list« Previous · 1 · 2 · 3 · 4 · 5 · 6 · 7 · Next »Thread · Author · Date
Box list
Jul 20113
Dec 201029
Nov 20106
Oct 201046
Sep 201035
Aug 201017
Jul 201029
Jun 201041
May 201020
Apr 201040
Mar 2010102
Feb 201043
Jan 201014
Dec 200911
Nov 20099
Oct 200912
Sep 20093
Aug 200915
Jul 200959
Jun 200916
May 200930
Apr 200960
Mar 200919
Feb 200945
Jan 200957
Dec 200827
Nov 200815
Oct 200824
Sep 200854
Aug 200834
Jul 200841
Jun 200899
May 200862
Apr 2008113
Mar 2008133
Feb 2008164
Jan 2008291
Dec 2007335
Nov 2007454
Oct 2007405
Sep 2007259
Aug 2007368
Jul 2007618
Jun 2007607
May 2007672
Apr 2007455
Mar 20071104
Feb 2007389
Jan 2007418
Dec 200692