harmony-alerts mailing list archives: July 2007

Site index · List index
Message list« Previous · 1 · 2 · 3 · 4 · 5 · 6 · 7 · Next »Thread · Author · Date
nom...@intel.com [build-test alert] BUILD SUCCEEDED Windows server 2003 msvc: jdktools_test Fri, 13 Jul, 09:17
nom...@intel.com [build-test alert] BUILD SUCCEEDED Windows XP SP2 msvc debug: drlvm tests Fri, 13 Jul, 12:03
nom...@intel.com [build-test alert] BUILD SUCCEEDED Linux SUSE 9 64bit gcc debug: drlvm tests Fri, 13 Jul, 12:09
nom...@intel.com [build-test alert] BUILD SUCCEEDED Linux SUSE 9 gcc debug: drlvm test Fri, 13 Jul, 13:03
nom...@intel.com [build-test alert] BUILD FAILED LINUX SUSE 9 x86_64: harmony HDK Fri, 13 Jul, 14:56
nom...@intel.com [build-test alert] BUILD FAILED Windows 2003 x86_64 msvc debug: classlib tests Fri, 13 Jul, 15:11
nom...@intel.com [build-test alert] BUILD FAILED LINUX SUSE 9 x86: harmony HDK Fri, 13 Jul, 15:15
nom...@intel.com [build-test alert] BUILD FAILED Windows XP SP2 msvc debug: classlib over drlvm Fri, 13 Jul, 18:08
nom...@intel.com [build-test alert] BUILD FAILED Windows server 2003 msvc: jdktools_test Fri, 13 Jul, 22:09
nom...@intel.com [build-test alert] BUILD FAILED LINUX SUSE 9 x86_64: tomcat start Sat, 14 Jul, 04:23
nom...@intel.com [build-test alert] BUILD FAILED LINUX SUSE 9 x86: tomcat start Sat, 14 Jul, 04:27
nom...@intel.com [build-test alert] BUILD SUCCEEDED Linux SUSE 9 x86_64: harmony HDK Mon, 16 Jul, 05:01
nom...@intel.com [build-test alert] BUILD SUCCEEDED Linux SUSE 9 x86: harmony HDK Mon, 16 Jul, 05:20
nom...@intel.com [build-test alert] BUILD FAILED Windows XP SP2 msvc debug: drlvm reg.test Mon, 16 Jul, 05:31
nom...@intel.com [build-test alert] BUILD SUCCEEDED Linux SUSE 9 x86_64: tomcat start Mon, 16 Jul, 05:39
nom...@intel.com [build-test alert] BUILD SUCCEEDED Linux SUSE 9 x86: tomcat start Mon, 16 Jul, 05:53
nom...@intel.com [build-test alert] BUILD FAILED Linux SUSE 9 gcc debug: drlvm test Mon, 16 Jul, 07:12
nom...@intel.com [build-test alert] BUILD FAILED Linux SUSE 9 gcc debug: drlvm reg.test Mon, 16 Jul, 07:43
nom...@intel.com [build-test alert] BUILD SUCCEEDED Linux SUSE 9 gcc debug: drlvm test Mon, 16 Jul, 10:58
nom...@intel.com [build-test alert] BUILD FAILED LINUX SUSE 9 x86: jdktools_test Mon, 16 Jul, 11:40
nom...@intel.com [build-test alert] BUILD FAILED LINUX SUSE 9 x86_64: harmony_hdk Mon, 16 Jul, 13:36
nom...@intel.com [build-test alert] BUILD SUCCEEDED Linux SUSE 9 x86: jdktools_test Mon, 16 Jul, 13:47
nom...@intel.com [build-test alert] BUILD SUCCEEDED Linux SUSE 9 x86_64: harmony_hdk Mon, 16 Jul, 14:22
nom...@intel.com [build-test alert] BUILD FAILED LINUX SUSE 9 x86_64: harmony_hdk Tue, 17 Jul, 02:34
nom...@intel.com [build-test alert] BUILD SUCCEEDED Linux SUSE 9 x86_64: harmony_hdk Tue, 17 Jul, 03:16
nom...@intel.com [build-test alert] BUILD FAILED LINUX SUSE 9 x86_64: harmony_hdk Tue, 17 Jul, 04:32
nom...@intel.com [build-test alert] BUILD FAILED Windows 2003 x86_64 msvc debug: drlvm Tue, 17 Jul, 07:45
nom...@intel.com [build-test alert] BUILD FAILED Linux SUSE 9 64bit gcc debug: drlvm reg.test Tue, 17 Jul, 09:54
nom...@intel.com [build-test alert] BUILD FAILED Windows XP SP2 msvc debug: drlvm tests Tue, 17 Jul, 10:02
nom...@intel.com [build-test alert] BUILD FAILED Linux SUSE9 64bit gcc debug: classlib Tue, 17 Jul, 10:46
nom...@intel.com [build-test alert] BUILD FAILED Linux SUSE9 64bit gcc debug: drlvm Tue, 17 Jul, 10:57
nom...@intel.com [build-test alert] BUILD SUCCEEDED Linux SUSE9 64bit gcc debug: classlib Tue, 17 Jul, 11:13
nom...@intel.com [build-test alert] BUILD SUCCEEDED Linux SUSE9 64bit gcc debug: drlvm Tue, 17 Jul, 11:41
nom...@intel.com [build-test alert] BUILD SUCCEEDED Linux SUSE 9 x86_64: harmony_hdk Tue, 17 Jul, 12:26
nom...@intel.com [build-test alert] BUILD FAILED Linux SUSE 9 gcc debug: drlvm test Tue, 17 Jul, 12:29
nom...@intel.com [build-test alert] BUILD FAILED LINUX SUSE 9 x86_64: harmony_hdk Tue, 17 Jul, 15:46
nom...@intel.com [build-test alert] BUILD SUCCEEDED Linux SUSE 9 gcc debug: drlvm test Tue, 17 Jul, 16:20
nom...@intel.com [build-test alert] BUILD FAILED Windows server 2003 msvc: harmony Tue, 17 Jul, 16:39
nom...@intel.com [build-test alert] BUILD FAILED LINUX SUSE 9 x86: harmony HDK Tue, 17 Jul, 17:04
nom...@intel.com [build-test alert] BUILD FAILED LINUX SUSE 9 x86_64: harmony HDK Tue, 17 Jul, 17:32
nom...@intel.com [build-test alert] BUILD FAILED Windows XP SP2 x86: harmony HDK Tue, 17 Jul, 17:50
nom...@intel.com [build-test alert] BUILD FAILED Windows 2003 x86_64 msvc debug: drlvm regression tests Tue, 17 Jul, 20:51
nom...@intel.com [build-test alert] BUILD SUCCEEDED Windows 2003 x86_64 msvc debug: classlib tests Tue, 17 Jul, 22:00
nom...@intel.com [build-test alert] BUILD SUCCEEDED Linux SUSE 9 x86: harmony HDK Wed, 18 Jul, 02:01
nom...@intel.com [build-test alert] BUILD SUCCEEDED Linux SUSE 9 x86_64: harmony HDK Wed, 18 Jul, 02:08
nom...@intel.com [build-test alert] BUILD SUCCEEDED Windows XP SP2 x86: harmony HDK Wed, 18 Jul, 02:11
nom...@intel.com [build-test alert] BUILD SUCCEEDED Windows server 2003 msvc: harmony Wed, 18 Jul, 02:24
nom...@intel.com [build-test alert] BUILD SUCCEEDED Windows XP SP2 msvc debug: classlib over drlvm Wed, 18 Jul, 03:10
nom...@intel.com [build-test alert] BUILD FAILED Linux SUSE 9 64bit gcc debug: drlvm tests Wed, 18 Jul, 04:58
nom...@intel.com [build-test alert] BUILD FAILED Linux SUSE 9 gcc debug: drlvm test Wed, 18 Jul, 05:10
nom...@intel.com [build-test alert] BUILD FAILED LINUX SUSE 9 x86: jdktools_test Wed, 18 Jul, 05:49
nom...@intel.com [build-test alert] BUILD SUCCEEDED Linux SUSE 9 x86: jdktools_test Wed, 18 Jul, 06:36
nom...@intel.com [build-test alert] BUILD SUCCEEDED Linux SUSE 9 x86_64: harmony_hdk Wed, 18 Jul, 06:37
nom...@intel.com [build-test alert] BUILD SUCCEEDED Linux SUSE 9 64bit gcc debug: drlvm tests Wed, 18 Jul, 07:39
nom...@intel.com [build-test alert] BUILD SUCCEEDED Linux SUSE 9 gcc debug: drlvm test Wed, 18 Jul, 09:06
nom...@intel.com [build-test alert] BUILD FAILED LINUX SUSE 9 x86_64: harmony_hdk Wed, 18 Jul, 09:07
nom...@intel.com [build-test alert] BUILD FAILED Linux SUSE 9 64bit gcc debug: drlvm tests Wed, 18 Jul, 15:59
nom...@intel.com [build-test alert] BUILD SUCCEEDED Linux SUSE 9 64bit gcc debug: drlvm tests Wed, 18 Jul, 18:38
nom...@intel.com [build-test alert] BUILD SUCCEEDED Linux SUSE 9 x86_64: harmony_hdk Thu, 19 Jul, 06:56
nom...@intel.com [build-test alert] BUILD SUCCEEDED Linux SUSE 9 64bit gcc debug: drlvm reg.test Thu, 19 Jul, 07:39
nom...@intel.com [build-test alert] BUILD SUCCEEDED Linux SUSE 9 64bit gcc debug: classlib over drlvm Thu, 19 Jul, 08:10
nom...@intel.com [build-test alert] BUILD SUCCEEDED Linux SUSE 9 gcc debug: drlvm test Thu, 19 Jul, 08:49
nom...@intel.com [build-test alert] BUILD SUCCEEDED Linux SUSE 9 gcc debug: drlvm reg.test Thu, 19 Jul, 09:26
nom...@intel.com [build-test alert] BUILD SUCCEEDED Linux SUSE 9 gcc debug: classlib over drlvm Thu, 19 Jul, 10:11
nom...@intel.com [build-test alert] BUILD PASSED Windows 2003 x86: JettyScenario Thu, 19 Jul, 11:49
nom...@intel.com [build-test alert] BUILD PASSED Linux x86: snapshot Thu, 19 Jul, 11:50
nom...@intel.com [build-test alert] BUILD PASSED Windows 2003 x86: axis2_app Thu, 19 Jul, 11:53
nom...@intel.com [build-test alert] BUILD FAILED Windows 2003 x86: egax48 Thu, 19 Jul, 12:05
nom...@intel.com [build-test alert] BUILD FAILED Linux x86: reliability Thu, 19 Jul, 12:36
nom...@intel.com [build-test alert] BUILD PASSED Linux x86: JettyScenario Thu, 19 Jul, 12:44
nom...@intel.com [build-test alert] BUILD PASSED Linux x86: axis2_app Thu, 19 Jul, 12:47
nom...@intel.com [build-test alert] BUILD FAILED Windows 2003 x86: egax48 Thu, 19 Jul, 12:49
nom...@intel.com [build-test alert] BUILD FAILED Linux x86: classlib-test Thu, 19 Jul, 13:03
nom...@intel.com [build-test alert] BUILD FAILED Windows 2003 x86_64: classlib-gui-test Thu, 19 Jul, 13:33
nom...@intel.com [build-test alert] BUILD FAILED Windows 2003 x86_64: drlvm-reg-test Thu, 19 Jul, 15:44
nom...@intel.com [build-test alert] BUILD FAILED Windows 2003 x86_64 msvc debug: classlib tests Thu, 19 Jul, 17:34
nom...@intel.com [build-test alert] BUILD FAILED Linux x86: eut Thu, 19 Jul, 17:53
nom...@intel.com [build-test alert] BUILD FAILED Linux x86_64: drlvm-test Thu, 19 Jul, 18:14
nom...@intel.com [build-test alert] BUILD PASSED Windows 2003 x86: drlvm-testdebug Thu, 19 Jul, 19:28
nom...@intel.com [build-test alert] BUILD PASSED Linux x86_64: drlvm-test Thu, 19 Jul, 21:58
nom...@intel.com [build-test alert] BUILD FAILED Linux x86: classlib-gui-test Thu, 19 Jul, 22:23
nom...@intel.com [build-test alert] BUILD FAILED Linux x86: func Thu, 19 Jul, 23:41
nom...@intel.com [build-test alert] BUILD FAILED Windows 2003 x86: drlvm-testdebug Fri, 20 Jul, 01:20
nom...@intel.com [build-test alert] BUILD FAILED LINUX SUSE 9 x86_64: harmony_hdk Fri, 20 Jul, 03:25
nom...@intel.com [build-test alert] BUILD SUCCEEDED Linux SUSE 9 x86_64: harmony_hdk Fri, 20 Jul, 04:18
nom...@intel.com [build-test alert] BUILD FAILED Windows 2003 x86_64: drlvm-test Fri, 20 Jul, 04:57
nom...@intel.com [build-test alert] BUILD FAILED Windows 2003 x86_64 msvc debug: drlvm regression tests Fri, 20 Jul, 06:05
nom...@intel.com [build-test alert] BUILD SUCCEEDED Windows XP SP2 msvc debug: drlvm reg.test Fri, 20 Jul, 06:06
nom...@intel.com [build-test alert] BUILD FAILED Linux x86: stress Fri, 20 Jul, 06:27
nom...@intel.com [build-test alert] BUILD PASSED Linux x86: struts_test Fri, 20 Jul, 06:45
nom...@intel.com [build-test alert] BUILD PASSED Linux x86: tomcat-scenario Fri, 20 Jul, 06:46
nom...@intel.com [build-test alert] BUILD FAILED Linux x86: tptp Fri, 20 Jul, 07:00
nom...@intel.com [build-test alert] BUILD SUCCEEDED Windows 2003 x86_64 msvc debug: classlib tests Fri, 20 Jul, 07:15
nom...@intel.com [build-test alert] BUILD FAILED Linux x86: snapshot Fri, 20 Jul, 07:47
nom...@intel.com [build-test alert] BUILD FAILED Linux x86: vtsvm Fri, 20 Jul, 08:16
nom...@intel.com [build-test alert] BUILD FAILED Linux x86: JettyScenario Fri, 20 Jul, 08:27
nom...@intel.com [build-test alert] BUILD PASSED Linux x86: axis2_app Fri, 20 Jul, 08:32
nom...@intel.com [build-test alert] BUILD PASSED Windows 2003 x86: drlvm-testdebug Fri, 20 Jul, 08:47
nom...@intel.com [build-test alert] BUILD FAILED Linux x86: scimark Fri, 20 Jul, 09:11
nom...@intel.com [build-test alert] BUILD PASSED Linux x86: snapshot Fri, 20 Jul, 10:02
Message list« Previous · 1 · 2 · 3 · 4 · 5 · 6 · 7 · Next »Thread · Author · Date
Box list
Jul 20113
Dec 201029
Nov 20106
Oct 201046
Sep 201035
Aug 201017
Jul 201029
Jun 201041
May 201020
Apr 201040
Mar 2010102
Feb 201043
Jan 201014
Dec 200911
Nov 20099
Oct 200912
Sep 20093
Aug 200915
Jul 200959
Jun 200916
May 200930
Apr 200960
Mar 200919
Feb 200945
Jan 200957
Dec 200827
Nov 200815
Oct 200824
Sep 200854
Aug 200834
Jul 200841
Jun 200899
May 200862
Apr 2008113
Mar 2008133
Feb 2008164
Jan 2008291
Dec 2007335
Nov 2007454
Oct 2007405
Sep 2007259
Aug 2007368
Jul 2007618
Jun 2007607
May 2007672
Apr 2007455
Mar 20071104
Feb 2007389
Jan 2007418
Dec 200692