harmony-alerts mailing list archives

Site index · List index
Message view « Date » · « Thread »
Top « Date » · « Thread »
From nom...@intel.com
Subject [build-test alert] BUILD FAILED Linux x86: jedit_test
Date Wed, 01 Aug 2007 04:20:12 GMT
BUILD FAILED:
	Ant Error Message:
/export/users/cc/cc-suites/scripts/cc-exec-adaptor.xml:101: The following error occurred while
executing this line: /export/users/cc/cc-suites/adaptors/jedit_test/adaptor.xml:122: Some
of JEdit tests failed.

Date of build:	07/30/2007 19:02:02
Time to build:	2,418 minutes 4 seconds
Last changed:	07/30/2007 19:01:30
Last log entry:	snapshot

***********************************************************
Errors/Warnings:	(16)
            
Java Result: 1
Java Result: 1
[junit] Test org.apache.harmony.guitests.JEditLaunchTest FAILED
BUILD FAILED
/export/users/cc/cc-suites/tests/jedit_test/build.xml:118: if=test.not.passed
Total time: 12 seconds
[junit] Test org.apache.harmony.guitests.JEditFunctionalTest FAILED
BUILD FAILED
/export/users/cc/cc-suites/tests/jedit_test/build.xml:122: if=test.not.passed
Total time: 12 seconds
[junit] Test org.apache.harmony.guitests.JEditStressTest FAILED
BUILD FAILED
/export/users/cc/cc-suites/tests/jedit_test/build.xml:126: if=test.not.passed
Total time: 2,417 minutes 36 seconds
The execution FAILED with the following exception:
The following error occurred while executing this line:
/export/users/cc/cc-suites/adaptors/jedit_test/adaptor.xml:122: Some of JEdit tests failed.

***********************************************************
Unit Tests: (3)
        
error: /export/users/cc/cc-suites/tests/jedit_test/scripts/jedit_fn_00.xml org.apache.harmony.guitests.JEditFunctionalTest
error: /export/users/cc/cc-suites/tests/jedit_test/scripts/jedit_ln_00.xml org.apache.harmony.guitests.JEditLaunchTest
error: test org.apache.harmony.guitests.JEditStressTest
Unit Test Error Details:	(3)
                
Test: /export/users/cc/cc-suites/tests/jedit_test/scripts/jedit_fn_00.xmlClass: org.apache.harmony.guitests.JEditFunctionalTestjava.lang.NoSuchMethodError:
java/awt/Toolkit.getEventMonitor()Ljava/lang/Object; while resolving constant pool entry at
index 107 in class java/awt/EventQueueCore
	at java.awt.EventQueueCore.postEvent(EventQueueCore.java:91)
	at java.awt.EventQueue.postEvent(EventQueue.java:116)
	at java.awt.EventQueue.invokeAndWait(EventQueue.java:67)
	at abbot.util.AWT.invokeAndWait(AWT.java:96)
	at abbot.script.AppClassLoader$AppEventQueue.install(AppClassLoader.java:235)
	at abbot.script.AppClassLoader.install(AppClassLoader.java:185)
	at abbot.script.Launch.install(Launch.java:112)
	at abbot.script.Launch.runStep(Launch.java:180)
	at abbot.script.Step.run(Step.java:92)
	at abbot.script.StepRunner.runStep(StepRunner.java:277)
	at abbot.script.Sequence.runStep(Sequence.java:110)
	at abbot.script.Script.runStep(Script.java:499)
	at abbot.script.StepRunner.runStep(StepRunner.java:274)
	at abbot.script.StepRunner.run(StepRunner.java:194)
	at junit.extensions.abbot.ScriptFixture.runTest(ScriptFixture.java:60)
Test: /export/users/cc/cc-suites/tests/jedit_test/scripts/jedit_ln_00.xmlClass: org.apache.harmony.guitests.JEditLaunchTestjava.util.NoSuchElementException
	at java.util.LinkedList.getLast(LinkedList.java:476)
	at java.awt.EventQueueCore.pop(EventQueueCore.java:215)
	at java.awt.EventQueue.pop(EventQueue.java:140)
	at abbot.script.AppClassLoader$AppEventQueue.uninstall(AppClassLoader.java:250)
	at abbot.script.AppClassLoader.uninstall(AppClassLoader.java:206)
	at abbot.script.Launch.terminate(Launch.java:153)
	at abbot.script.StepRunner.terminate(StepRunner.java:341)
	at abbot.script.StepRunner.run(StepRunner.java:209)
	at junit.extensions.abbot.ScriptFixture.runTest(ScriptFixture.java:60)
Test: testClass: org.apache.harmony.guitests.JEditStressTestjava.util.NoSuchElementException
	at java.util.LinkedList.getLast(LinkedList.java:476)
	at java.awt.EventQueueCore.pop(EventQueueCore.java:215)
	at java.awt.EventQueue.pop(EventQueue.java:140)
	at abbot.script.AppClassLoader$AppEventQueue.uninstall(AppClassLoader.java:250)
	at abbot.script.AppClassLoader.uninstall(AppClassLoader.java:206)
	at abbot.script.Launch.terminate(Launch.java:153)
	at abbot.script.Fixture.terminate(Fixture.java:61)
	at abbot.script.StepRunner.terminate(StepRunner.java:341)
	at abbot.script.StepRunner.run(StepRunner.java:209)
	at junit.extensions.abbot.ScriptFixture.runTest(ScriptFixture.java:60)
	at org.apache.harmony.guitests.JEditStressTest$RepeatableScript.runTest(Unknown Source)
	at org.apache.harmony.guitests.JEditStressTest.test(Unknown Source)
	at java.lang.reflect.VMReflection.invokeMethod(VMReflection.java)

***********************************************************
Modifications since last successful build:	(2)
            
add cc-snapshot log20070730190130Lbuild.7 07/30/2007 19:01:30snapshot
add cc-snapshot log20070724161215Lbuild.6 07/24/2007 16:12:15snapshot

begin 644 execution_log.zip
M4$L#! H    ( (1: 3>S]),V,00  !8<   2    97AE8W5T:6]N7VQO9RYH
M=&UL[5G=3^,X$'\^_HIY.2TK$:<??.:Z2'N[L%K$W<,"3PA5)IFT!L?.V0ZT
M]]??V"V%0AO"WB+UH575)O;,;\;S8?^4](:ND(>]:YV-#WNEP<,>!^O&$C]]
MR+5RD17_8@+[K=__^'"X82J5;(#_7-[P.WX%?U9"9KF0)'+M+]FHD',"<S>1
M11>51H_&28U0CBX=1AF6J#);)RB4=5S*Z 8SX1H+1J6L!C321$$;0:)<1OSZ
M6M>:*+EWNKE\JHN2PC;1P^QUA1MNF@L_^-]8L$&TIQZS(3>%5F,6G*E1H%Q7
M91V@Y7<X30G).J$&S;/MJZA$XP0^T_%7&4IT> 5?_3_!0B8,IDZ;,<0JMS$A
MQ4-=8"SY=69D_Q\>LX#Z' DNBUO2O8(O!KG#S ,E;\&8NTDE<L4,EMJXMSF-
M(Z\35Q:-C=.4OI&MA$,;AZ:+J2C26UTY&P<7^C3CXHFANI(E"6XP0DZ5^Z*S
MW\6G>VUN":=AG%?5Q*N1I6!&DE?J>7],+BLEW!7\J)3R(=5FP'A)*7CLK$'P
MP%EV<D0V3P/0.0TLQ3H?(GS[0DO*0&D'U!MW(D,8I'V>9?U[Y+=]H[7K4YOU
M43DSWORX',M;!E\.T-Z"8RYD9:C)H+4%1\9H8\/XN2@04/+28I9 E[6[!]3P
MZ5+4"Y7R:C!T@*,42R>T J&@X.)EU<UTPN;%CD;"'3TH)?"Y+*5(>4! FH(,
ME:!T;G8^ @V=#RF]V:4'WMK9\G]72_%_XVYJXV_MK9QA6AGAQG]QQ0=H6,B]
MG]A</.\1D^W6\E!Z WZ42:X&C!+N*&K,>[WY<#/!V-EN"G(VM@Z+"<;T.D"T
M6Z_X\:3,G-;2,JX<<]S>9IA;ID-TN61!@YU<T*\O!%^DM%(?Q\WG@\'NSEZ[
MOI3>4M]P_/G[Z='7FL8:(%FF]HT6[:(3LY,9,FZXLKDV!?A 4]%V#CJ%78Z]
MJ%_GJ<[%]].OBURLV43",I]N'3.2E+3;^PF(_),?9M2U=)Y::J;E]L\U'7^S
MQ?ANTW1BSXF<T"_\0%M)1S+3J5278]KVZ-=O-VWP; V<?GWO,P%HSOU.J[47
MT;?;ZK</6ITU%5Q3P3457%/!%>5IJT(%<SI9)N?K+Z"#QS.PE::$NZR]OU-+
M"9NQ@_GEOBM#V-_=KR,(R[+XKB2ATUF3A#5)6).$-4EXB]-KDK!2)AJ1!$OG
MDGU9G&\G"&<!:,7)06>O^PO(P>-2W_?106MONXX9+$K=^[*"W9]G!9VM[?8>
M%$)5I [=W97A"/]K]UA@0O)9!\Q[W@V>VY]U/>!N^!;"$:95>!(Y22W<"S<$
M1S.YEE+?>V.SYYU)4'DRX9L#=)I6QM#V<C_TT9PBTK0;"@M2*$PV:ISD&2\I
M0'/^3<<>^>,9'3N@<P@M Z&N(*<^Q8QM]&)^V(O#:[]X\@HP#N\#_P-02P$"
M% ,*    " "$6@$WL_23-C$$   6'   $@              I($     97AE
E8W5T:6]N7VQO9RYH=&UL4$L%!@     !  $ 0    &$$      $! 
end

Mime
View raw message