harmony-alerts mailing list archives

Site index · List index
Message view « Date » · « Thread »
Top « Date » · « Thread »
From nom...@intel.com
Subject [build-test alert] BUILD FAILED Windows 2003 x86: jedit_test
Date Tue, 31 Jul 2007 21:26:40 GMT
BUILD FAILED:
	Ant Error Message:
C:\cc\cc-suites\scripts\cc-exec-adaptor.xml:101: The following error occurred while executing
this line: C:\cc\cc-suites\adaptors\jedit_test\adaptor.xml:122: Some of JEdit tests failed.

Date of build:	08/01/2007 04:26:13
Time to build:	22 seconds
Last changed:	07/31/2007 20:08:02
Last log entry:	snapshot

***********************************************************
Errors/Warnings:	(16)
            
Java Result: 1
Java Result: 1
[junit] Test org.apache.harmony.guitests.JEditLaunchTest FAILED
BUILD FAILED
C:\cc\cc-suites\tests\jedit_test\build.xml:118: if=test.not.passed
Total time: 7 seconds
[junit] Test org.apache.harmony.guitests.JEditFunctionalTest FAILED
BUILD FAILED
C:\cc\cc-suites\tests\jedit_test\build.xml:122: if=test.not.passed
Total time: 6 seconds
[junit] Test org.apache.harmony.guitests.JEditStressTest FAILED
BUILD FAILED
C:\cc\cc-suites\tests\jedit_test\build.xml:126: if=test.not.passed
Total time: 6 seconds
The execution FAILED with the following exception:
The following error occurred while executing this line:
C:\cc\cc-suites\adaptors\jedit_test\adaptor.xml:122: Some of JEdit tests failed.

***********************************************************
Unit Tests: (3)
        
error: C:\cc\cc-suites\tests\jedit_test/scripts/jedit_fn_00.xml org.apache.harmony.guitests.JEditFunctionalTest
error: C:\cc\cc-suites\tests\jedit_test/scripts/jedit_ln_00.xml org.apache.harmony.guitests.JEditLaunchTest
error: test org.apache.harmony.guitests.JEditStressTest
Unit Test Error Details:	(3)
                
Test: C:\cc\cc-suites\tests\jedit_test/scripts/jedit_fn_00.xmlClass: org.apache.harmony.guitests.JEditFunctionalTestjava.lang.NoSuchMethodError:
java/awt/Toolkit.getEventMonitor()Ljava/lang/Object; while resolving constant pool entry at
index 107 in class java/awt/EventQueueCore
	at java.awt.EventQueueCore.postEvent(EventQueueCore.java:91)
	at java.awt.EventQueue.postEvent(EventQueue.java:116)
	at java.awt.EventQueue.invokeAndWait(EventQueue.java:67)
	at abbot.util.AWT.invokeAndWait(AWT.java:96)
	at abbot.script.AppClassLoader$AppEventQueue.install(AppClassLoader.java:235)
	at abbot.script.AppClassLoader.install(AppClassLoader.java:185)
	at abbot.script.Launch.install(Launch.java:112)
	at abbot.script.Launch.runStep(Launch.java:180)
	at abbot.script.Step.run(Step.java:92)
	at abbot.script.StepRunner.runStep(StepRunner.java:277)
	at abbot.script.Sequence.runStep(Sequence.java:110)
	at abbot.script.Script.runStep(Script.java:499)
	at abbot.script.StepRunner.runStep(StepRunner.java:274)
	at abbot.script.StepRunner.run(StepRunner.java:194)
	at junit.extensions.abbot.ScriptFixture.runTest(ScriptFixture.java:60)
Test: C:\cc\cc-suites\tests\jedit_test/scripts/jedit_ln_00.xmlClass: org.apache.harmony.guitests.JEditLaunchTestjava.util.NoSuchElementException
	at java.util.LinkedList.getLast(LinkedList.java:476)
	at java.awt.EventQueueCore.pop(EventQueueCore.java:215)
	at java.awt.EventQueue.pop(EventQueue.java:140)
	at abbot.script.AppClassLoader$AppEventQueue.uninstall(AppClassLoader.java:250)
	at abbot.script.AppClassLoader.uninstall(AppClassLoader.java:206)
	at abbot.script.Launch.terminate(Launch.java:153)
	at abbot.script.StepRunner.terminate(StepRunner.java:341)
	at abbot.script.StepRunner.run(StepRunner.java:209)
	at junit.extensions.abbot.ScriptFixture.runTest(ScriptFixture.java:60)
Test: testClass: org.apache.harmony.guitests.JEditStressTestjava.util.NoSuchElementException
	at java.util.LinkedList.getLast(LinkedList.java:476)
	at java.awt.EventQueueCore.pop(EventQueueCore.java:215)
	at java.awt.EventQueue.pop(EventQueue.java:140)
	at abbot.script.AppClassLoader$AppEventQueue.uninstall(AppClassLoader.java:250)
	at abbot.script.AppClassLoader.uninstall(AppClassLoader.java:206)
	at abbot.script.Launch.terminate(Launch.java:153)
	at abbot.script.Fixture.terminate(Fixture.java:61)
	at abbot.script.StepRunner.terminate(StepRunner.java:341)
	at abbot.script.StepRunner.run(StepRunner.java:209)
	at junit.extensions.abbot.ScriptFixture.runTest(ScriptFixture.java:60)
	at org.apache.harmony.guitests.JEditStressTest$RepeatableScript.runTest(Unknown Source)
	at org.apache.harmony.guitests.JEditStressTest.test(Unknown Source)
	at java.lang.reflect.VMReflection.invokeMethod(VMReflection.java)

***********************************************************
Modifications since last successful build:	(2)
            
add cc-snapshot log20070731200802Lbuild.6 07/31/2007 20:08:02snapshot
add cc-snapshot log20070726133349Lbuild.5 07/26/2007 13:33:49snapshot

begin 644 execution_log.zip
M4$L#! H    ( %,C 3=Q!6:8@P0  &D>   2    97AE8W5T:6]N7VQO9RYH
M=&UL[5EM;]LV$/Z\ /D/]V5H"D2*Y<5QIKD!NL09&J3[T"0?AMHP:.EL,Z9(
MC:22>+]^1\IYL6,K=MML'68CL"F2]]SI>"]/I-;(9N*HU5?IY*B5:SQJ,3!V
M(O#=FX&2-C#\+XSAL/;C+V^.MK=T(>/M+7"?S]?LAG7AUX*+=, %;>J[87B7
MB=D=LU>!01OD6MU-XLIM [3)*$@Q1YF:ZJU<&LN$"*XQY7:-K4$NBB'-K":B
M-*?-3 2LWU<OJ,F9,WX=B41E.3FQE,1T%9%KIM?9?G\?:VQ=R?M3R\,1TYF2
MD]";5"E"$5#DU:"&W>#TD&BWY7*X3@RX^,I16X[S4GZ8C5.NNW"LD5E,@2YB
M.(X[)RHI,I36 ),I7$S5=@3KIUKT_F2=T(-7F9$(9#+4F"L][V(W2E&@Q2Z<
MN%\"=ZHQL4I/G/XDH;_ %-RBZ?A<ZM#9)F-56-/QJGNT8CLE?'7\T1ZF,4!&
M8?@\9[^=+;=*CTEX=2?_Z\ K>(\<%@A6R&=A7 X+R6T7/A52.K<I/0Q93GY^
MS("A-\*:\*Q-:L\]TB5-+ >['"'\=DSWDH)4%BA\;WB*,$QZ+$U[M\C&/:V4
M[5$N]"A"]63G;068TPWNU"':A5/&1:$I$:"V"VVME39^_I)G""A8;C"EB3#:
MCR@QD^6P5S)AQ7!D >\2S"U7$KB$C/$%T?4@Y(M-V+[CMGTO%</[/!<\81X"
M:0E2E)R.<J?^%FCJ<D1'FWYVR+N-7??37:[@!V:G2GY73LT%)H7F=O*1239$
M'?H8< L[B]<=8KQ?JW"GT^!F0\'D,*1CM^2YT-F]<W]1@C3V5T:YF!B+60DR
M'7N,J/:2)4_"S2HE3,BD#2TSXQ0')E3>PTR$7B(\NZ)O%PXN6.EFG2]WYB>]
MXD8S>B&BU@ET.'W_X;Q]4IED0R3EE,'!PFI9:BZ72+]FT@R4SL"Y.X:#9CTS
M5>@+LW>.MUQ].#]9:.A\,?&W^+2$//"<.(H.8^"#=VXZI,REYF<HGZKT7BKJ
M4]/[:+J,4]1A9[><T3=\0E,(2YEYOY:H?$+&T;<K.Q$XS@56+:E]VHO/F%VO
MU9I![3"H1;W:?OU@0^,V-.ZYY?\TC2O'F;HA*O*1NMY\:*](RL(^2\9%O@@;
MDY'JPA^JT$"<T+CR"->N7L&]23 B,Z&/*,'!4"<J<NIMR\&>?E:P<:_"Q@V-
MK<J_#8W]2AH[H#Y84H)O065/']"^>SK;B!K5='8U3C-[QZ_-:YK1S]6\9NEQ
MO@:WJ=>_AML<;+C-LKJ^X3;_#V[SQ;W]A:[V11W>#S>484,97J(,AMJ364@X
MUZ4+%Q[INZ<*4>-@\^1KF8;-DZ\56.)CH+_ZDZ_#9C5#7)B]K\(.#_[;['#]
M-K  6+#'VC9KY4_>2K.6F27:EBN)>$?9ZLM$>4YPR^T(+*T,E!#JUJEXJ$:Q
M%WFRX&H=J(3R75-QN1TY?TT1:=F.N '!)5*4S-O&4I:3"V;,FLX]_E-PH:B 
MJ@'XV <?)#"@8HMIN+6]U=IC1ZT]_R9YKWRKO.=?,?\-4$L! A0#"@    @ 
M4R,!-W$%9IB#!   :1X  !(              *2!     &5X96-U=&EO;E]L
=;V<N:'1M;%!+!08      0 ! $    "S!      ! 
end

Mime
View raw message