harmony-alerts mailing list archives

Site index · List index
Message view « Date » · « Thread »
Top « Date » · « Thread »
From nom...@intel.com
Subject [build-test alert] BUILD FAILED Linux x86: ega. (Eclipse x 48h)
Date Mon, 30 Jul 2007 12:14:22 GMT
BUILD FAILED:
	Ant Error Message:
/export/users/cc/cc-EGAx48/scripts/cc-exec-adaptor.xml:101: The following error occurred while
executing this line: /export/users/cc/cc-EGAx48/adaptors/ega/adaptor.xml:58: EGA scenario
failed.

Date of build:	07/30/2007 18:59:13
Time to build:	15 minutes 2 seconds
Last changed:	07/30/2007 18:58:43
Last log entry:	snapshot

***********************************************************
Errors/Warnings:	(186)
            
[exec] Result: 25
[echo]
[echo]
[echo] ========================== EGA.log =======================
[echo]
[echo] --- Automated EGA scenario for Eclipse 3.2.1 ---
[echo]
[echo]
[echo] Eclipse Home = /export/users/cc/cc-EGAx48/build/libs/eclipse-3.2.l-lnx-x86/eclipse
[echo] Tested JRE Home = /export/users/cc/cc-EGAx48/build/checkouts/snapshot/hdk/jdk
[echo] OS_ARCH = x86
[echo]
[echo] Tested JRE options for Eclipse launching = -showversion -Xmx600M -Xms512M
[echo] Tested JRE options for debug step =
[echo]
[echo] Time frame for the scenario run = 48 hours
[echo] Delay factor = 2
[echo] Kill Eclipse if EGA scenario fails = 1
[echo] Start:
[echo] 	Run Eclipse
[echo] 	Select workspace
[echo] 	wait window 'Workspace Launcher' to appear ...
[echo] 	window 'Workspace Launcher' (29360183) appeared
[echo] 	Select /export/users/cc/cc-EGAx48/tests/ega/workspace as workspace
[echo] 	Press 'OK' button
[echo] 	wait window (29360183) to close ...
[echo] 	window (29360183) successfully closed
[echo]
[echo] Prepare Eclipse environment:
[echo] 	Close Welcome page
[echo] 	wait window 'Java - Eclipse SDK' to appear ...
[echo] 	window 'Java - Eclipse SDK' (29360612) appeared
[echo] 	Uncheck Project->Build Automatically
[echo] 	Select Window->Preferences
[echo] 	wait window 'Preferences' to appear ...
[echo] 	window 'Preferences' (29362414) appeared
[echo] 	Select Java->Build Path->Classpath Variables
[echo] 	Create M2_REPO variable
[echo] 	wait window 'New Variable Entry' to appear ...
[echo] 	window 'New Variable Entry' (29363566) appeared
[echo] 	Set M2_REPO value to /export/users/cc/cc-EGAx48/tests/ega/project/.m2/repository
[echo] 	Press OK button
[echo] 	wait window (29363566) to close ...
[echo] 	window (29363566) successfully closed
[echo] 	Press OK button to apply new preferences
[echo] 	wait window (29362414) to close ...
[echo] 	window (29362414) successfully closed
[echo] 	wait window 'Java - Eclipse SDK' to appear ...
[echo] 	window 'Java - Eclipse SDK' (29360612) appeared
[echo]
[echo] Import geronimo modules into workspace:
[echo] 	Select File->Import...
[echo] 	wait window 'Import' to appear ...
[echo] 	window 'Import' (29364913) appeared
[echo] 	Select import existing project
[echo] 	Type path to search projects: /export/users/cc/cc-EGAx48/tests/ega/project/geronimo-1.2-beta/modules
[echo] 	Uncheck all builders
[echo] 	Import
[echo] 	wait window (29364913) to close ...
[echo] 	window (29364913) successfully closed
[echo]
[echo] Import testsupport module into workspace:
[echo] 	wait window 'Java - Eclipse SDK' to appear ...
[echo] 	window 'Java - Eclipse SDK' (29360612) appeared
[echo] 	Select File->Import...
[echo] 	wait window 'Import' to appear ...
[echo] 	window 'Import' (29378042) appeared
[echo] 	Select import existing project
[echo] 	Type path to search projects: /export/users/cc/cc-EGAx48/tests/ega/project/geronimo-1.2-beta/testsupport
[echo] 	Import
[echo] 	wait window (29378042) to close ...
[echo] 	window (29378042) successfully closed
[echo]
[echo] Start repetable part:
[echo]
[echo] -------------------- Iteration 1 start ------------------
[echo]
[echo] Clean all Geronimo modules:
[echo] 	wait window 'Java - Eclipse SDK' to appear ...
[echo] 	window 'Java - Eclipse SDK' (29360612) appeared
[echo] 	Select Project->Clean...
[echo] 	wait window 'Clean' to appear ...
[echo] 	window 'Clean' (29381155) appeared
[echo] 	Uncheck start build immediatelly
[echo] 	wait window (29381155) to close ...
[echo] 	window (29381155) successfully closed
[echo] 	window 'Cleaning selected projects' (29381461) appeared
[echo] 	wait window (29381461) to close ...
[echo] 	window (29381461) successfully closed
[echo]
[echo] Build all Geronimo modules:
[echo] 	wait window 'Java - Eclipse SDK' to appear ...
[echo] 	window 'Java - Eclipse SDK' (29360612) appeared
[echo] 	Select Project->Build All
[echo] 	wait window 'Building Workspace' to appear ...
[echo] 	window 'Building Workspace' (29382749) appeared
[echo] 	wait window (29382749) to close ...
[echo] 	window (29382749) successfully closed
[echo] 	wait window 'Java - Eclipse SDK' to appear ...
[echo] 	window 'Java - Eclipse SDK' (29360612) appeared
[echo]
[echo] Open Navigator view:
[echo]
[echo] Fix org.apache.geronimo.common.propertyeditor.PropertyEditorsTest:
[echo] 	Select 'Navigate->Open Resource'
[echo] 	wait window 'Open Resource' to appear ...
[echo] 	window 'Open Resource' (29384366) appeared
[echo] 	Type PropertyEditorsTest.java into 'Open Resource' dialog
[echo] 	wait window (29384366) to close ...
[echo] 	window (29384366) successfully closed
[echo] 	wait window 'Java - PropertyEditorsTest.java - Eclipse SDK' to appear ...
[echo] 	window 'Java - PropertyEditorsTest.java - Eclipse SDK' (29360612) appeared
[echo] 	Go to line 'protected void setUp() throws Exception {'
[echo] 	wait window 'Go to Line' to appear ...
[echo] 	window 'Go to Line' (29388088) appeared
[echo] 	wait window (29388088) to close ...
[echo] 	window (29388088) successfully closed
[echo] 	wait window 'Java - PropertyEditorsTest.java - Eclipse SDK' to appear ...
[echo] 	window 'Java - PropertyEditorsTest.java - Eclipse SDK' (29360612) appeared
[echo] 	Add line Class.forName("org.apache.geronimo.common.propertyeditor.PropertyEditors");
to setUp() method
[echo] 	Save PropertyEditorsTest.java
[echo] 	Close PropertyEditorsTest.java
[echo] 	wait window 'Java - Eclipse SDK' to appear ...
[echo] 	window 'Java - Eclipse SDK' (29360612) appeared
[echo]
[echo] Run JUnit tests from geronimo-common module:
[echo] 	Select geronimo-common module
[echo] 	Open Run->Run
[echo] 	wait window 'Run' to appear ...
[echo] 	window 'Run' (29392869) appeared
[echo] 	Create new JUnit run configuration
[echo] 	Run
[echo] 	wait window (29392869) to close ...
[echo] 	window (29392869) successfully closed
[echo]
[echo] Modify GBeanData class from geronimo-kernel module:
[echo] 	wait window 'Java - Eclipse SDK' to appear ...
[echo] 	window 'Java - Eclipse SDK' (29360612) appeared
[echo] 	Select geronimo-kernel module
[echo] 	Select Navigate->Go Into
[echo] 	Open GBeanData.java
[echo] 	wait window 'Java - GBeanData.java - Eclipse SDK' to appear ...
[echo]
[echo] ERROR: Window 'Java - GBeanData.java - Eclipse SDK' didn't appear for 200 sec!
[echo]
[echo] Print error screen picture:
[echo] 	Picture was saved to /export/users/cc/cc-EGAx48/build/results/ega/20070730_0659/error.xwd
[echo] 	Please, use command 'xwud -in ./error.xwd' to view the error screen picture
[echo]
[echo] Kill Eclipse:
[echo] 	Found 1 Eclipse processes
[echo] 	Process 0:
[echo] 	Eclipse process was killed
[echo]
[echo]
[echo] EGA FAILED!
[echo]
[echo] ======================= eclipse.log =======================
[echo] Apache Harmony Launcher : (c) Copyright 1991, 2006 The Apache Software Foundation or
its licensors, as applicable.
[echo] java version "1.5.0"
[echo] pre-alpha : not complete or compatible
[echo] svn = r560888, (Jul 30 2007), Linux/ia32/gcc 3.3.3, release build
[echo] http://harmony.apache.org
[echo] Install location:
[echo]     file:/export/users/cc/cc-EGAx48/build/libs/eclipse-3.2.l-lnx-x86/eclipse/
[echo] Configuration file:
[echo]     file:/export/users/cc/cc-EGAx48/build/libs/eclipse-3.2.l-lnx-x86/eclipse/configuration/config.ini
loaded
[echo] Configuration location:
[echo]     file:/export/users/cc/cc-EGAx48/build/libs/eclipse-3.2.l-lnx-x86/eclipse/configuration/
[echo] Framework located:
[echo]     file:/export/users/cc/cc-EGAx48/build/libs/eclipse-3.2.l-lnx-x86/eclipse/plugins/org.eclipse.osgi_3.2.1.R32x_v20060919.jar
[echo] Framework classpath:
[echo]     file:/export/users/cc/cc-EGAx48/build/libs/eclipse-3.2.l-lnx-x86/eclipse/plugins/org.eclipse.osgi_3.2.1.R32x_v20060919.jar
[echo] Debug options:
[echo]     file:/export/users/cc/cc-EGAx48/tests/ega/.options not found
[echo] The GC did not provide gc_add_weak_root_set_entry()
[echo] Time to load bundles: 375
[echo] Starting application: 8365
[echo] Application Started: 38009
[echo]
[echo] ===========================================================
BUILD FAILED
/export/users/cc/cc-EGAx48/tests/ega/build.xml:464: EGA FAILED!
Total time: 15 minutes 1 second
The execution FAILED with the following exception:
The following error occurred while executing this line:
/export/users/cc/cc-EGAx48/adaptors/ega/adaptor.xml:58: EGA scenario failed.

***********************************************************
Unit Tests: (0)
        
No Tests Run: This project doesn't have any tests

***********************************************************
Modifications since last successful build:	(3)
            
add cc-snapshot log20070730185843Lbuild.3 07/30/2007 18:58:43snapshot
add cc-snapshot log20070724161107Lbuild.2 07/24/2007 16:11:07snapshot
add cc-snapshot log20070720165026Lbuild.1 07/20/2007 16:50:26snapshot

begin 644 execution_log.zip
M4$L#! H    ( ,B9_C9'^ON+<PH   T[   2    97AE8W5T:6]N7VQO9RYH
M=&ULY5OK;MNX$OZ]>0IN@8.D0"SY%L?QI@'2)$W36P*GW2Y0% 8CT38;211$
MRI>>ES_#H>38CB5+7F^;[O$N"COB#&>&'^="CHZ'RO=.CN^$.STY#B-V<DR)
M5%./O=CMBT!5)/_..J1=_<\?NR<[41QT=HC^?/E&1_0K>1ESS^US#X;<Z:_6
MQ/<6!BS\>$1NOC-G*+Z2BOZ0;AR0B\M3(AT6T(@+(@*BAHSTA>>),0\&Q!%!
MGP_BB"H.SY JD^=')A5SR9ON!7E!;#8)1:3L6+)(VHX#_U=@JDFS;:/LMC-D
MSKV(E;1E0$,Y%,H>NO?V-_<^<X(+Q^.A9.2U\%F1*3Q^)VUFB"H-JVYY%2^8
M5";M5OK7;.O-SWN;FH<KEE@BB/T[%H$0U?54L!!$<12YV<X<?LX\.B5]ZBBA
M^=8S![[EGC<S!>\_+%Z?<D\"::V85G/+)4*ME(1UCV:</1H'SE!CX 6IP/*,
M1V!E!,%?_J15K;[77^1!K?Z^] R .)?=Q0. /@N!?3Y*-_QD&P&19]%8":XZ
MZX;I[VL')6@J.LY*3+EV_,BW$L/E#15^"#[!4F!MR_&HE"NW_80Y7\EI2($S
M>4TC7P13\@[7&'#<(7O.<W(FPFG$!T-%:D='M7U2KU9;Y".,3\AN15^-:<3(
M*Q$'KMD(L)Y<2>)Q0*$4D=PG5!(:AO '>@=298JB_T)23#VK60=6]=E*).!H
M\)45ZH5#"J(&0J'2'E-,SZ^_@S P6R:Y' 6 L^B@56VWV_MD[TWLD495*WCX
M?)^\XT$\L3EMU.V!XY"&!?_MDXAYC,)&0%^2R7FH5-BQ[:&QJ$714I:(!@76
M%C?!]E88M\P9"!WH79ONXT4/;EF/5N2+R[0ET0,QI4E='C'MAJ;;<+'V@@ V
M6&:V#80<\*<CC2,B9H&OUJ[ZZ4@5A[#1?K(\EF1*3R+7BM'Y!V8WORP>\.P=
M8JPTMY1( AE,SJY:30.R/-I<7P9Q\)V'D(!,0AJXVMQKU:21,YRI>7O^%E6M
M53SM:BH#=6\I&EF#[T2)<KQZR@\U[2,'\ 602Z,Y&0NLQ2K&A =%9,I>QFV 
MI)#&J<OK,E^,YEW>6$3W$APQVZ*[T[X7%!Y0>\8]VP='C"+GB,G8@^CX,,,*
M@<@7_QX&)&20+\&/ B9*>*-(.HY5#QO57K5U<)2=D((1U4*^GSGT!D/?/I&,
M_0U);!AF>6* 69_+E,Y/,P-I%[ET2/T@.__O=J^['?*9!ZX8D]TW.H.HD,N7
M$/'.J:*8J\$?4AC KML%8[K!KM(9"0-L:T% 1-#+^9U012PM="\%&FY1*_0@
MFPD8.6RUK6SO$4:P3RR=<EL^DY(.6'9,SGR0_>1%YH>D1LUZ7EX,70J>0CKL
M(_P6"L+YB@#-@X/+3_&S:KKYJ>;*D:*S;5"D7M_V3KMGKX'["E^XWAX_K2HK
M5I%E<]4%;C^B^E_@ID\1Y'P!K&M?,A1Q)+-Y+)? V2.7:^!%S*9U<$Y%KUUA
M)_OY;W@RDO#/'G4+(<11<_$F>^B8<AB8>*[/,X*T MO5B4#BI%;%B <^.2SV
MZD>-5K76;CQ/6+&5=<N"[.5"GB[NBFA[ S%!DMUK<,!WL5* SV*6F=, [.%X
M0JZ,X8_,,4<G8\>!R?NQYTT-!W<#.(,"H:YT4PRP8,0C$?@LR(7-&4K\F7F.
M=C A1(6BD'BS(G:5A,0J%L8PK5J]""0^!>CO0'GQ#;!1.<$#QS0T0$&O3;H6
M428\5T[ A'T6L0!6HZ@1YDA*:[] BVK7F[5FB9V@S9>J?$/5L')RIDOM$+Z2
M/\&QZ..,/$U,^D;>UWO=BYMK,DI(BNK^@8UGTY"+0$73TB98Q0(MT3AHM8I9
M0LW)[\5L37GRX"%" QG;\NN0#X9"<DQWUWF(Z[>)?RCA'HPRY=V#H2OE'I:E
M3!8$* ,P=5@:X'.P+"^_H2LG_U-S,9D/KGR-,3)@X&2Y+X@OW%AO-RQ&9Q$G
MS_4FN_@5]UCEQ+ #E8K:QA"4MD=*AC9H'M7*1%YN5&83+K%83+90CL0?IZ$.
M*N"/0$S)=)&<4LG<BO'Q/DT-7:E9]<H=E&9V:O'UX0'"@#D497G)W&_)DI;8
M&<: Y7>&H=M.X$^D1HO%(7XWEBD!Q:>VZW[^WCAL5YME)'UB>V,>#5L$?&*5
MTH!/Z+8#>',J!#$;%-5Y0YA?&96ZJR-7LPO3&I26>J(U%W6%IL([#G1#ETOQ
MXE?<E;-L&]4JL2]Q?&FQ$RHM:;M6.S@H4QB8)43?#UO49RZ'C#>_*%C&?#)G
M:<PG="73GWF=M1^1:'*@25U#:HAFJU;$$(^U0<(-M$&Z[>Q@4[+\Z[9#4GR"
M6@650 *]RK.SD=)*K&*!ZU4_;!YM!!!#6!X@ANY?FNU?ARP@'^B(#Z@^ZAMQ
M-MXDY+SB$Z+O2I-+]S1N6X[P?1%8L,=#%JDIN"F8Q;I)?E[@3ZF/00O4$[N)
MF) XH=1=)D4<:5P47(<EJI)+L$2-T&@VBE7SF!*MT-K<DV ZN\P?'+J^6BB!
M;R-,>7P;NK^/[TS]M@+]HMQ+.;I+H:7!.Z9=P*@R$6DDN OQ27T*]\">PTB,
M);F8. R/Z,E_"^/-<'\'W$LK/4^*B]2NMML;>3U#6!X5AN[_$A6GKFLP@:>.
M5E]$'ZC/]IYM[.">/?_#U$(&4CY30Y%GQULZRG$7Z\Z\-R#\9<*5O@QZ\RG@
MR;$ Z4?"GQU55<QB)"E7@8BRFC"'SOCH.*B<:$$*VA.&EC8@TFB+'=7;K4+I
M3G+FK4]#C8'T5=]BQUG^'5MQGY+(5-JG)'3;2;7?"Y?WIP\M!P2[\98 <<^B
M@'D% /'4-L CA"YHLA[9#ZD21)(KR"_68'JI<Z.<H?+;/HI9+O/!ECM--KE_
MA/R,L"@"-M*)&%@KY(Z*HUQ W9@A9$PED>#.W4+M9=G].SB_-1GG7I$DK4(Q
M]IKZ/@U<LCL9QRZI\$ WV*0\<%%TJH_- :M4V\!.\XT >9;!CF52FZT8A$[M
M#G+/NV_,&%+-8[S$$$U_#T)MY%ZR\7AY2EZ=7KV[.,\!4_EV(I(V/V[43_0T
MFLE1%-R/19K)<?3FS>1(_H\TDR/G8LWD\Q17@53ZY,<3#IHPNPE-?_#=H6UT
MZ&8?S2[$?ISOQTB4U3,,EJ%N3LQ;%/@'FW%1Z.QS#MU6I6^>C'S,_4'BA5X\
MX(%\U+.?-$IV&_5);Z3W=?6H=@0Q,;M%]T$#)^VI^.5T.,<&N95O:Y25_N'.
M*7W[ _U07WO"3,;:=UZ>Z30#!T/ &7&7D8'3HZ[;&S-ZWXN$4#TH^'I,-W_L
M/<_FI;OU]"$$; [P28&+A\6-P^S>6[PFTB>CB3O&74+:C58VR>G#2$,.P"6-
M=K6:W:*\24/LVL\"SX4?+S]=O3M/ NO"@T)K-WL'L]-L-3OS,3I[QH\"W#6^
M#=@AM0/B0[  AOIVC($S6%Q\S#K3MNC:SHX&@.Z5CM&B9BK(BO65Y\([FRP]
M->H@R=P#S+F$X\01E %D/ 28IASAL1IRB4<0G9T<_:E+0UWAHPF2'VB$@W;G
M<1\F<ZV=8YN>'-OXMJMMWGRU\378_P%02P$"% ,*    " #(F?XV1_K[BW,*
M   -.P  $@              I($     97AE8W5T:6]N7VQO9RYH=&UL4$L%
3!@     !  $ 0    *,*      $! 
end

Mime
View raw message