harmony-alerts mailing list archives

Site index · List index
Message view « Date » · « Thread »
Top « Date » · « Thread »
From nom...@intel.com
Subject [build-test alert] BUILD FAILED Windows 2003 x86: stress
Date Wed, 25 Jul 2007 16:34:16 GMT
BUILD FAILED:
	Ant Error Message:
C:\cc\cc-suites\scripts\cc-exec-adaptor.xml:101: The following error occurred while executing
this line: C:\cc\cc-suites\adaptors\stress\adaptor.xml:100: The following error occurred while
executing this line: C:\cc\cc-suites\adaptors\stress\adaptor.xml:116: The following error
occurred while executing this line: C:\cc\cc-suites\scripts\framework.xml:1069: Java returned:
1

Date of build:	07/25/2007 22:59:46
Time to build:	34 minutes 23 seconds
Last changed:	07/19/2007 18:48:06
Last log entry:	snapshot

***********************************************************
Errors/Warnings:	(4)
            
BUILD FAILED
C:\cc\cc-suites\tests\stress\qa\build.xml:169: Java returned: -1
Total time: 34 minutes 21 seconds
The execution FAILED with the following exception:
The following error occurred while executing this line:
C:\cc\cc-suites\adaptors\stress\adaptor.xml:100: The following error occurred while executing
this line:
C:\cc\cc-suites\adaptors\stress\adaptor.xml:116: The following error occurred while executing
this line:
C:\cc\cc-suites\scripts\framework.xml:1069: Java returned: 1

***********************************************************
Unit Tests: (193)
        
error: test stress.org.apache.harmony.test.stress.classloader.NotSynchThreads.MethodArgs.testMethodArgs
error: test stress.org.apache.harmony.test.stress.exceptions.catcher.StackUnwindingInsideInitTests.StackUnwindingInsideInitTest10
error: test stress.org.apache.harmony.test.stress.exceptions.catcher.StackUnwindingManyObjectsTests.StackUnwindingManyObjectsTest2
error: test stress.org.apache.harmony.test.stress.misc.WaitNotifyTest
Unit Test Error Details:	(4)
                
Test: testClass: stress.org.apache.harmony.test.stress.classloader.NotSynchThreads.MethodArgs.testMethodArgsTestHarness:ExecUnit
runProc(): Timeout!!!. The test hung (not finished in 180 second).

java version "1.5.0" 
pre-alpha : not complete or compatible
svn = r557495, (Jul 19 2007), Windows/ia32/msvc 1310, release build
http://harmony.apache.org

The GC did not provide gc_add_weak_root_set_entry()


Apache Harmony Launcher : (c) Copyright 1991, 2006 The Apache Software Foundation or its licensors,
as applicable.
[debug] started null(org.apache.harmony.test.share.stress.ReliabilityRunner)
[debug] timeToWork = 30, timeToAbort = 30
[debug] started null(org.apache.harmony.test.share.stress.generator.Thread)
[debug] Thread.setContext  { org.apache.harmony.test.stress.classloader.NotSynchThreads.MethodArgs.testMethodArgs
{} }
[debug] Starting 1 threads
[debug] ThreadToRun.run()
[debug] completed null(org.apache.harmony.test.share.stress.generator.Thread)
[debug] Generator.execute()
[debug] class = org.apache.harmony.test.stress.classloader.NotSynchThreads.MethodArgs.test...
Test: testClass: stress.org.apache.harmony.test.stress.exceptions.catcher.StackUnwindingInsideInitTests.StackUnwindingInsideInitTest10java
version "1.5.0" 
pre-alpha : not complete or compatible
svn = r557495, (Jul 19 2007), Windows/ia32/msvc 1310, release build
http://harmony.apache.org

The GC did not provide gc_add_weak_root_set_entry()


Apache Harmony Launcher : (c) Copyright 1991, 2006 The Apache Software Foundation or its licensors,
as applicable.
[debug] started null(org.apache.harmony.test.share.stress.ReliabilityRunner)
[debug] timeToWork = 30, timeToAbort = 30
[debug] started null(org.apache.harmony.test.share.stress.generator.Thread)
[debug] Thread.setContext  { generator.Thread { generator.Loop { org.apache.harmony.test.stress.gc.padder.BigObjectPadder{}
}} generator.Thread { org.apache.harmony.test.stress.exceptions.thrower.VerifyErrorThrower{}
generator.Loop { org.apache.harmony.test.stress.exceptions.catcher.StackUnwindingInsideInit{}
} } }
[debug] Starting 1 threads
[debug] ThreadToRun.run()
[debug] completed null(org.apache.harmony.test.share.stress.generator.Thread)
[debug] Ge...
Test: testClass: stress.org.apache.harmony.test.stress.exceptions.catcher.StackUnwindingManyObjectsTests.StackUnwindingManyObjectsTest2java
version "1.5.0" 
pre-alpha : not complete or compatible
svn = r557495, (Jul 19 2007), Windows/ia32/msvc 1310, release build
http://harmony.apache.org

The GC did not provide gc_add_weak_root_set_entry()


Apache Harmony Launcher : (c) Copyright 1991, 2006 The Apache Software Foundation or its licensors,
as applicable.
[debug] started null(org.apache.harmony.test.share.stress.ReliabilityRunner)
[debug] timeToWork = 30, timeToAbort = 30
[debug] started null(org.apache.harmony.test.share.stress.generator.Thread)
[debug] Thread.setContext  { generator.Thread { generator.Loop { org.apache.harmony.test.stress.gc.padder.BigObjectPadder{}
}} generator.Thread { org.apache.harmony.test.stress.exceptions.thrower.ArrayIndexOutOfBoundsExceptionThrower{}
generator.Loop { org.apache.harmony.test.stress.exceptions.catcher.StackUnwindingManyObjects{}
} } }
[debug] Starting 1 threads
[debug] ThreadToRun.run()
[debug] completed null(org.apache.harmony.test.share.stress.generator...
Test: testClass: stress.org.apache.harmony.test.stress.misc.WaitNotifyTestjava version "1.5.0"

pre-alpha : not complete or compatible
svn = r557495, (Jul 19 2007), Windows/ia32/msvc 1310, release build
http://harmony.apache.org

The GC did not provide gc_add_weak_root_set_entry()


Apache Harmony Launcher : (c) Copyright 1991, 2006 The Apache Software Foundation or its licensors,
as applicable.
[debug] started null(org.apache.harmony.test.share.stress.ReliabilityRunner)
[debug] timeToWork = 30, timeToAbort = 30
[debug] started null(org.apache.harmony.test.share.stress.generator.Thread)
[debug] Thread.setContext  { org.apache.harmony.test.stress.misc.WaitNotifyTest {} }
[debug] Starting 1 threads
[debug] ThreadToRun.run()
[debug] completed null(org.apache.harmony.test.share.stress.generator.Thread)
[debug] Generator.execute()
[debug] class = org.apache.harmony.test.stress.misc.WaitNotifyTest
[debug] org.apache.harmony.test.stress.misc.WaitNotifyTest { }
[debug] started test(org.apache.harmony.test.stress.misc.WaitNotifyTest)
[debug]...

***********************************************************
Modifications since last successful build:	(3)
            
add cc-snapshot log20070719184806Lbuild.4 07/19/2007 18:48:06snapshot
add cc-snapshot log20070712185838Lbuild.3 07/12/2007 18:58:38snapshot
add cc-snapshot log20070712142711Lbuild.2 07/12/2007 14:27:11snapshot

begin 644 execution_log.zip
M4$L#! H    ( $:\^383Y=N;TPH  %V*   2    97AE8W5T:6]N7VQO9RYH
M=&ULW9U_3^,X&L?_!FG>@[6ZTS+23-.TM- <B\26<@/+CU'++'>ZCI!)W-9#
MXF1LA](][7L_VVUH4Y)21C/GIXMF:&([SL=?/\\3VTG#P4A&X>'!71Q,#@\2
M3@X/,!)R$I)??A[$3+X7] _BH?WJW__Q\^&;;9XR[\TV0N@_ 0F)))_1L?ZD
M;(C<UCX:T) (-.!QA-I>W_?5O_<BI9*(_EU*PZ#/B4A#*?I"JBUA:E)U?<$/
M^#/Z59?0-7C(%*X\1F&^1'[/'Q'_ON+';$"'7CYKNDW\4?P9M4V!E&-)8^:A
M[&=,V2W%]=IM)![\\J-_OYC"H+_]]R&:G>Q/#P7D+AV6'W5-A"0!.E,92$DF
M:414!=*D5F8)?ZY@UC]+ CH&PS&-CE,I',%P(D:Q=$;!O?-%_^?$N:/,T=55
MR",IK/Z1^)_148)5/>@#YE',)N@<ITSM<^2A'?^M$BR9<#H<2=6E+?<=JE6K
M372MRL\.Z\4#.<:<H),X98&1%<4<42E02'W"1,S%.X0%PDFB$O!=2"KE+#H%
M/1 N=#4_N95&I?H3*B^N+/0]#I,15K LELB/HT0;HB;0VPI'G:_\>/' T"^(
M-QI[NZW&.[1SEH:JF;J->V_?H1O*@G@L'&T8CC8,Y-;=ZCO$E9%C0::F4%[Y
M2,K$<YS15-<*-GI58K["4E0?,.4)R%^T4N-'RF!&T\R*/QB^TEKZVM8R-^M_
MQ8ZJ0O^_)>SAN5\M5M9Y],,T(!G"5VU*)J424B&_!T96GS[#*O]6?E(QQQ>>
M<[JMS5*703.IGBR)"E2M:,NM-MPFVKG $^0VI[;\=D5UJJI9CW@7F+(MQ;#S
MUD-M3K"R,3\?2JY^>T5-0F(N>Q/6'F'&2*AK[>DD)";*^7C,5)Q5(<UD(M6 
M)%9Y+?6SWCF.*3]1QDOXUD!]Z-J5*XR0C)$@F/LCHY+0LK0]Q_>=>5PQ&<ZT
MBQS518+[)LUYO4S7YAQCHF*#4![CJVBG54([,I98^UE]3>V/J5#X.B;IJL]C
M'QO!7->K>FX-=5.&0IU8,4?I5FH'3*6Z=*B3K'>.GHPYZ1)Q),X^;>$@R!J 
MQBITJ;.BF23*?9VI)V>./95GEHT3:B*N0^,L21F+Z@CAJ*[F1YSC2=<D+._?
M<*4_[YECS(G1SL>C7J]SO*9(/[X!'VE"@AG\PC9\<,6FAB0S\L4=:.@A9D-%
M/7!ZMUTR4([#?*+KNZVZ!4F :/4@H("X*!DV=:TDV1*U'V(APM@8[@5]O!YI
MDU:A)&;J L+DQS@.3?GVQ_-(VI+V59# E#RA) R$XC*%G_: 25E""4S+<\R'
MI*WS+G%$S!'YI-LN,%W7(-XXC6\V3N,;8!I?8#8Q=+/A\,(^,&U7D$+3E,A1
M'!SQX0ST:1>:HF6<(/74[I-=%7(I(%4MI06F;2]-3ID</'G4;!^8IB64FZ%E
M?2,H=V%17G-"%J/]PCXPVUQ!"LP^;WC,AHNHEYWVN2H%3- R3.AJWFR$F#<;
MI"6PR%E""2%R7L9Z@=T?K5Z/  BZ(?/H;\"&X&*OQP8QH_X&[%>K77Z?9=>K
M-Y_=9S%W=B+,\) $^J:+?AH U??!2+1B=@RP0TMGGHJUT^U>=:&AED[G (H+
M>$JW)BK$T+EBF ^0MFP,O0FH-QM&"L&QKAB94F[*R.0UP"#6S.? JRY>T"@A
M7[?FK+WT;GGL,D\"1@KVVCJ'A'VIFG/"C?PO,D+H\#4F_!N""2&^YS !/RFQ
M#B<X/3=DE6<3EW@V<7WGAR_N_&AFX$]-K,L*3U?(3TZ\9EEHTWC!6<+**0% 
M6K#3@DU9;UN'$\+]P'4X(=P17'?Q$IR-?L_G*<IO\KB[GKOF79Z])@QA(#^^
ML18HN#"S*9-[P ]QK,,)+FP#>Y"#//HDT=^K5,C3:.7T)/;O/[$Q90%EPU,F
M:$!.&96Z=K$RUZW:N8?Z71O1^"OT1/.OT(@]J(W0PZVKNR_$EZ*H%4O9-:!.
M\;I6@ U0KVL&6)LJ8C<Q==. P<;/,N"-,XE]2\!#WQEP/'1.U*^(,&G>Q_#/
M]@EE.*1_F&_PUE=F0N+N8A;$D8G/I1DP>>NE&9!X>U2_(68.Y[Z0#9F]^4(V
M9/;6"]GPV$NM!:B=%,20A0R8O(46#=262ZT8GOU.7VA19, +.9"("VP7G-46
M7/,L7^TB$CD7)(KY9,JFMD$1-3,BB]ZLB7H1#D/])L/YUB6Q.JMY$<RBY:\&
MLVQ<Y6"V%@9>!+,U$2T'^R;++[^/5'.]1G6]^TBNNPM( WA.!M/#++M7HH[6
MBQ(:9[J$]@&'@X\FU7(0?XX&">N:9FN.T 2;D]FG^L*H@_DPU:,ZX1QE6Z8F
MFT0<3S2._K OSS),%1*-K3A>"&/K<E\(8VO@70AC:XZL8<S(A).!<,S(1<V!
M#9*M)6R-)/2"^G19W;9_+Z/8=*AE%EO#H2(66X.@ A9 L@!2Q6;P74*Q&7J7
M4&P&7F%>OYR]D]GZ2*8 QVZP>X9CU[&?X=CUJ&<X=KWJ&8ZM>_8E.-:&,TF

MG2_!.'&$3QCF-'8ZOW<NKZM5U^D\J-F4KK-J[5W@Y7BU13QK@: 4K[6(9RV*
M/\<[Z1Y=='3GGG <$7"=.\.K+>(!ZMP97GT1SUK4?XYWT;FXZOY;]^[\3LXW
M=.^*]>*&UVBMN5[<J$&1HY:3 Y Y98#U'"! @]K- 5J;-90#-G* UD8^Y8#-
M'*"UL5 YX%X.T-KHJ #P]%^=8Q/3Z",)P%VQ9GBU13Q (>;JU[-.^UI[\'31
M'IP'9X"-'" @#\X FSE 0!Z< >[E  %Y< :XGP,$-./) %LY0$"C]NL/W<Z1
M"8+3+X&!BX(98"T'""@.9H#U'""@H58&N)L#!!2H,\!&#A!0H,X FSE 0($Z
M ]S+ 0(*U!G@?@X04*#. %LY0'B!VJTN MJ[Y5X.F+N2N/"N)&[N2F+MMF9$
MA>^T<1CJU_B8XRURF+M"5P^$#\)X;!UFPOPN\5/S5WMMP]Q@*B]C20>3&8F%
M;\O*[*TJ9O>42<)YFIBQI,/BJZN+COKH776*"E@;RJT!/:9R5(9MRRWSV&<Q
M-1;H^"-,69'860D@.A<#YX5^0@:F<3C]V[RK1+8U)ER+N$1E6\/$/',O)"0I
MBQA/F4"L^!EL7MHY[G=\\5&]YKGK/K#>JMH4)Q4)84%I7\ZS@?3F[.TR;LT@
M%Z2!H,Q?Z(N4S9< (FXQ=MY?EL!?[307ZE*BW24#%E.W,+YP]5MY'=*4E;'$
MX5:CZI871"C1[QP*MMS]UJI2 TQ#56J%]R&DQA QW]I:\942A,0]31)54;VZ
MX@_5()2R>Q:/V:KS'<>,5%"/$"1'1A'$21)SB2@S*0'EQ%?]/BFO8JOM.;ZO
M_KT7*562.7<I#0-'=5P:2C'K]=4=)1!Y5 -F_>U#)&E$O*UJU:O7O<8>PBQ 
MS=INM*H&W4'3XU!]%T64I0I#13DDB!^S8.G0_-ZOGT[/C]')T>EYYSB?T_;Z
MOM]_:E;?6$-_VIS^5]PWS:P\1J'G-EL>.E,'*?%DJFPN\-![=]592Y!K[AQY
M^UK)/Y=E2HBT8YB.&<2AFNI0-D1/K[KPS"$+&=J24.RKF0A7T7\\4L:7U:BR
MY8@*%%)&O#?;RVW% 4Y4KS\U=[8_;:WJ&_3_.9/;_(YG$CZGB>K!@7Y 81SS
M^UEK"CK/W7ZS?>#@PP,GX43]OHN#B?H8R2@\_!]02P$"% ,*    " !&O/DV
M$^7;F],*  !=B@  $@              I($     97AE8W5T:6]N7VQO9RYH
9=&UL4$L%!@     !  $ 0     ,+      $! 
end

Mime
View raw message