harmony-alerts mailing list archives

Site index · List index
Message view « Date » · « Thread »
Top « Date » · « Thread »
From nom...@intel.com
Subject [build-test alert] BUILD FAILED Windows 2003 x86: jedit_test
Date Wed, 25 Jul 2007 07:06:14 GMT
BUILD FAILED:
	Ant Error Message:
C:\cc\cc-suites\scripts\cc-exec-adaptor.xml:101: The following error occurred while executing
this line: C:\cc\cc-suites\adaptors\jedit_test\adaptor.xml:122: Some of JEdit tests failed.

Date of build:	07/25/2007 14:05:40
Time to build:	27 seconds

***********************************************************
Errors/Warnings:	(16)
            
Java Result: 1
Java Result: 1
[junit] Test org.apache.harmony.guitests.JEditLaunchTest FAILED
BUILD FAILED
C:\cc\cc-suites\tests\jedit_test\build.xml:118: if=test.not.passed
Total time: 13 seconds
[junit] Test org.apache.harmony.guitests.JEditFunctionalTest FAILED
BUILD FAILED
C:\cc\cc-suites\tests\jedit_test\build.xml:122: if=test.not.passed
Total time: 5 seconds
[junit] Test org.apache.harmony.guitests.JEditStressTest FAILED
BUILD FAILED
C:\cc\cc-suites\tests\jedit_test\build.xml:126: if=test.not.passed
Total time: 5 seconds
The execution FAILED with the following exception:
The following error occurred while executing this line:
C:\cc\cc-suites\adaptors\jedit_test\adaptor.xml:122: Some of JEdit tests failed.

***********************************************************
Unit Tests: (3)
        
error: C:\cc\cc-suites\tests\jedit_test/scripts/jedit_fn_00.xml org.apache.harmony.guitests.JEditFunctionalTest
error: C:\cc\cc-suites\tests\jedit_test/scripts/jedit_ln_00.xml org.apache.harmony.guitests.JEditLaunchTest
error: test org.apache.harmony.guitests.JEditStressTest
Unit Test Error Details:	(3)
                
Test: C:\cc\cc-suites\tests\jedit_test/scripts/jedit_fn_00.xmlClass: org.apache.harmony.guitests.JEditFunctionalTestjava.lang.NoSuchMethodError:
java/awt/Toolkit.getEventMonitor()Ljava/lang/Object; while resolving constant pool entry at
index 107 in class java/awt/EventQueueCore
	at java.awt.EventQueueCore.postEvent(EventQueueCore.java:91)
	at java.awt.EventQueue.postEvent(EventQueue.java:116)
	at java.awt.EventQueue.invokeAndWait(EventQueue.java:67)
	at abbot.util.AWT.invokeAndWait(AWT.java:96)
	at abbot.script.AppClassLoader$AppEventQueue.install(AppClassLoader.java:235)
	at abbot.script.AppClassLoader.install(AppClassLoader.java:185)
	at abbot.script.Launch.install(Launch.java:112)
	at abbot.script.Launch.runStep(Launch.java:180)
	at abbot.script.Step.run(Step.java:92)
	at abbot.script.StepRunner.runStep(StepRunner.java:277)
	at abbot.script.Sequence.runStep(Sequence.java:110)
	at abbot.script.Script.runStep(Script.java:499)
	at abbot.script.StepRunner.runStep(StepRunner.java:274)
	at abbot.script.StepRunner.run(StepRunner.java:194)
	at junit.extensions.abbot.ScriptFixture.runTest(ScriptFixture.java:60)
Test: C:\cc\cc-suites\tests\jedit_test/scripts/jedit_ln_00.xmlClass: org.apache.harmony.guitests.JEditLaunchTestjava.util.NoSuchElementException
	at java.util.LinkedList.getLast(LinkedList.java:476)
	at java.awt.EventQueueCore.pop(EventQueueCore.java:215)
	at java.awt.EventQueue.pop(EventQueue.java:140)
	at abbot.script.AppClassLoader$AppEventQueue.uninstall(AppClassLoader.java:250)
	at abbot.script.AppClassLoader.uninstall(AppClassLoader.java:206)
	at abbot.script.Launch.terminate(Launch.java:153)
	at abbot.script.StepRunner.terminate(StepRunner.java:341)
	at abbot.script.StepRunner.run(StepRunner.java:209)
	at junit.extensions.abbot.ScriptFixture.runTest(ScriptFixture.java:60)
Test: testClass: org.apache.harmony.guitests.JEditStressTestjava.util.NoSuchElementException
	at java.util.LinkedList.getLast(LinkedList.java:476)
	at java.awt.EventQueueCore.pop(EventQueueCore.java:215)
	at java.awt.EventQueue.pop(EventQueue.java:140)
	at abbot.script.AppClassLoader$AppEventQueue.uninstall(AppClassLoader.java:250)
	at abbot.script.AppClassLoader.uninstall(AppClassLoader.java:206)
	at abbot.script.Launch.terminate(Launch.java:153)
	at abbot.script.Fixture.terminate(Fixture.java:61)
	at abbot.script.StepRunner.terminate(StepRunner.java:341)
	at abbot.script.StepRunner.run(StepRunner.java:209)
	at junit.extensions.abbot.ScriptFixture.runTest(ScriptFixture.java:60)
	at org.apache.harmony.guitests.JEditStressTest$RepeatableScript.runTest(Unknown Source)
	at org.apache.harmony.guitests.JEditStressTest.test(Unknown Source)
	at java.lang.reflect.VMReflection.invokeMethod(VMReflection.java)

***********************************************************
Modifications since last successful build:	(0)
            

begin 644 execution_log.zip
M4$L#! H    ( ,5P^3;(+3-E@ 0  %X=   2    97AE8W5T:6]N7VQO9RYH
M=&UL[5G?;QHY$'Z^2/D?YN741,IN@(0DW:.1>@DY-4KOH4D>3@4ALSNP#EY[
M:WN3<'_]C0U) X$%>LE=JX(0&'O\S=CSZ]/22&TFCAM=E0R/&[G&XP8#8X<"
MW[WI*6D#P__&"(XJO_[VYGAS0Q<RVMP ]_I\PVY9&WXON$AZ7)!0UPW#^TQ,
M2DS^"@S:(-?J?AB5BO70QFF08(XR,>6B7!K+A AN,.%V!=$@%T6?9I;;HC0G
M828"UNVJ!6IRYHQ?94>LLIPN<;03DV6VW#"]BOC#.5807>KVQY:'*=.9DL/0
MFU2ZA2*@R,M!#;O%L9-(VG+97R4&7'SEJ"W'Z5U^F T2KMMPHI%93(!^1' 2
MM4Y57&0HK0$F$[@<JVT)UDVTZ'QAK="#EYD1"V0RU)@KO2A"2(AI#)!1H#S/
MJC([XYC>@2FX1=/R.=>B&(@'JK"FY4WLT(IMW2D]H!.\//#H?*7'HQ,%@A7R
M622,AH7DM@V?"BG)0%"Z'[*<+N)K$/6]$=:$YTU2>^&1KFAB/MA5BO#'"9TE
M :DL4 3<\@2A'W=8DG3ND TZ6BG;H7#JD)/U<&N[!,SI!N<6J.[ &>.BT!1+
M4-F!IM9*&S]_Q3,$%"PWF$10"RMO]RBVX_FPUS)F13^U@/<QYI8K"5Q"QOA,
M]X\W^7P-F_?<-A]V1? ^SP6/F8= 6H($)2=7;M6V@::N4G)M\MDA[]1WW%=[
MOH)?F!TK^5,Y-9<8%YK;X4<F61]UZ&/ +6S-7G>(T7ZEY#J=!C<;"B;[(;G=
MTLV%SNZMAQ\CD/K^TBB70V,Q&X&,QQZC6EEDR9-PLTH)$S)I0\O,(,&>"96_
M829"OR,\OZ9/%PXN6.FP[BZWIB>]XOIA=;LT)_I(LI1PP<SZ,!U^JV0%G+W_
M<-$\G00<@8UT$:1FTO24SL!==P0'1X>9*3-W9O9.M?[K#Q>G,W5/%Q-O]=,2
M\D@5HFKU* +>>^>F0\I<ZA^&\JE,[Y6B4C\^1]6GG*(N-2ES3I_P"4TA+ D]
MK,4J'Y)U].GJ3A4<;P&KYA0_[;=/V%VK5 X#>M?JG>I^I;ZF0FLJ]-SR_YH*
MC<:9NL4V?*2V-QW:2Q*;L,OB09'/PL8X56WX2Q4:B%<95Q_AQM4@># )4C(3
MNH@2' RUHB*GYC8?[.EK"1MW2VS\T:B@&R4HT)*_3MVW\QBIQM@J/7QA)K:8
M:+Z0+:]&-_]O'MNC1CCB!"_!9<\>T;YS/EL-]]Z6T]GE:,KD@6?2A96(T@)>
M4S\HYS5SO?D:W*96^S?<IKZF-O/*^IK:_!S4YIM;^X*F]DT-W@_7C&'-&!8Q
M!D/MR<SDFZNRA4N/]-TSA=I1=?WD:YZ&G_#)UW1$K1+HK\X0%SWYFIF]K\(.
M#WYX=CB)N^=QS4K @KG:MN&*&-Y3?OG$'MTLW'&;@J65GA)"W3D5C_4C\EN>
M++CJ!"JF#-54#NY2=\(Q(BW;E!L07"+Y==HVEK"<>M>$6>.YKS3^4E')4SWP
MT0K>K="C\HA)N+&YT=AEQXU=__?I[NBOU%W_O^H_4$L! A0#"@    @ Q7#Y
M-L@M,V6 !   7AT  !(              *2!     &5X96-U=&EO;E]L;V<N
::'1M;%!+!08      0 ! $    "P!      ! 
end

Mime
View raw message