harmony-alerts mailing list archives

Site index · List index
Message view « Date » · « Thread »
Top « Date » · « Thread »
From nom...@intel.com
Subject [build-test alert] BUILD FAILED Linux x86: jedit_test
Date Wed, 25 Jul 2007 00:37:01 GMT
BUILD FAILED:
	Ant Error Message:
/export/users/cc/cc-suites/scripts/cc-exec-adaptor.xml:101: The following error occurred while
executing this line: /export/users/cc/cc-suites/adaptors/jedit_test/adaptor.xml:122: Some
of JEdit tests failed.

Date of build:	07/25/2007 07:36:16
Time to build:	40 seconds
Last changed:	07/24/2007 16:12:15
Last log entry:	snapshot

***********************************************************
Errors/Warnings:	(16)
            
Java Result: 1
Java Result: 1
[junit] Test org.apache.harmony.guitests.JEditLaunchTest FAILED
BUILD FAILED
/export/users/cc/cc-suites/tests/jedit_test/build.xml:118: if=test.not.passed
Total time: 14 seconds
[junit] Test org.apache.harmony.guitests.JEditFunctionalTest FAILED
BUILD FAILED
/export/users/cc/cc-suites/tests/jedit_test/build.xml:122: if=test.not.passed
Total time: 11 seconds
[junit] Test org.apache.harmony.guitests.JEditStressTest FAILED
BUILD FAILED
/export/users/cc/cc-suites/tests/jedit_test/build.xml:126: if=test.not.passed
Total time: 11 seconds
The execution FAILED with the following exception:
The following error occurred while executing this line:
/export/users/cc/cc-suites/adaptors/jedit_test/adaptor.xml:122: Some of JEdit tests failed.

***********************************************************
Unit Tests: (3)
        
error: /export/users/cc/cc-suites/tests/jedit_test/scripts/jedit_fn_00.xml org.apache.harmony.guitests.JEditFunctionalTest
error: /export/users/cc/cc-suites/tests/jedit_test/scripts/jedit_ln_00.xml org.apache.harmony.guitests.JEditLaunchTest
error: test org.apache.harmony.guitests.JEditStressTest
Unit Test Error Details:	(3)
                
Test: /export/users/cc/cc-suites/tests/jedit_test/scripts/jedit_fn_00.xmlClass: org.apache.harmony.guitests.JEditFunctionalTestjava.lang.NoSuchMethodError:
java/awt/Toolkit.getEventMonitor()Ljava/lang/Object; while resolving constant pool entry at
index 107 in class java/awt/EventQueueCore
	at java.awt.EventQueueCore.postEvent(EventQueueCore.java:91)
	at java.awt.EventQueue.postEvent(EventQueue.java:116)
	at java.awt.EventQueue.invokeAndWait(EventQueue.java:67)
	at abbot.util.AWT.invokeAndWait(AWT.java:96)
	at abbot.script.AppClassLoader$AppEventQueue.install(AppClassLoader.java:235)
	at abbot.script.AppClassLoader.install(AppClassLoader.java:185)
	at abbot.script.Launch.install(Launch.java:112)
	at abbot.script.Launch.runStep(Launch.java:180)
	at abbot.script.Step.run(Step.java:92)
	at abbot.script.StepRunner.runStep(StepRunner.java:277)
	at abbot.script.Sequence.runStep(Sequence.java:110)
	at abbot.script.Script.runStep(Script.java:499)
	at abbot.script.StepRunner.runStep(StepRunner.java:274)
	at abbot.script.StepRunner.run(StepRunner.java:194)
	at junit.extensions.abbot.ScriptFixture.runTest(ScriptFixture.java:60)
Test: /export/users/cc/cc-suites/tests/jedit_test/scripts/jedit_ln_00.xmlClass: org.apache.harmony.guitests.JEditLaunchTestjava.util.NoSuchElementException
	at java.util.LinkedList.getLast(LinkedList.java:476)
	at java.awt.EventQueueCore.pop(EventQueueCore.java:215)
	at java.awt.EventQueue.pop(EventQueue.java:140)
	at abbot.script.AppClassLoader$AppEventQueue.uninstall(AppClassLoader.java:250)
	at abbot.script.AppClassLoader.uninstall(AppClassLoader.java:206)
	at abbot.script.Launch.terminate(Launch.java:153)
	at abbot.script.StepRunner.terminate(StepRunner.java:341)
	at abbot.script.StepRunner.run(StepRunner.java:209)
	at junit.extensions.abbot.ScriptFixture.runTest(ScriptFixture.java:60)
Test: testClass: org.apache.harmony.guitests.JEditStressTestjava.util.NoSuchElementException
	at java.util.LinkedList.getLast(LinkedList.java:476)
	at java.awt.EventQueueCore.pop(EventQueueCore.java:215)
	at java.awt.EventQueue.pop(EventQueue.java:140)
	at abbot.script.AppClassLoader$AppEventQueue.uninstall(AppClassLoader.java:250)
	at abbot.script.AppClassLoader.uninstall(AppClassLoader.java:206)
	at abbot.script.Launch.terminate(Launch.java:153)
	at abbot.script.Fixture.terminate(Fixture.java:61)
	at abbot.script.StepRunner.terminate(StepRunner.java:341)
	at abbot.script.StepRunner.run(StepRunner.java:209)
	at junit.extensions.abbot.ScriptFixture.runTest(ScriptFixture.java:60)
	at org.apache.harmony.guitests.JEditStressTest$RepeatableScript.runTest(Unknown Source)
	at org.apache.harmony.guitests.JEditStressTest.test(Unknown Source)
	at java.lang.reflect.VMReflection.invokeMethod(VMReflection.java)

***********************************************************
Modifications since last successful build:	(1)
            
add cc-snapshot log20070724161215Lbuild.6 07/24/2007 16:12:15snapshot

begin 644 execution_log.zip
M4$L#! H    ( )T\^38-,LK:+00  /L=   2    97AE8W5T:6]N7VQO9RYH
M=&UL[5G?3^,X$'X^_HIY.2TK$:<M%-A<%VEO@=,B[AX6>$*H,LFD-3AVSG:@
MO;_^QF[Y46C3LGN5T"E5E2;VS#>3\<SX:](;ND(>]*YU-C[HE08/>ARL&TO\
M_"'7RD56_(,)[+=^_>W#P8:I5+(!_G-YP^_X%?Q>"9GE0I+(M3]EHT+.",Q<
M1!9=5!H]&B<U0CFZ=!AE6*+*;)V@4-9Q*:,;S(1;63 J936@D544M!$DRF7$
MKZ]UK8F2>Z=7ET]U45+8)GJ8+5>XX69UX0?_5Q9<(=I3C]F0FT*K,0O.U"C0
M6E=E':#E=SA=$I)U0@U67VV?124:)_"%CC_+4*+#*SCTOP0+F3"8.FW&$*O<
MQH04#W6!L>37F9']OWG, NI+)+@L;DGW"KX:Y XS#Y2\!6/F(I7(%3-8:N/>
MYC2.O$Y<630V3E/Z1K82#FT<BBZFI$AO=>5L'%SHTXR+)X;J4I8DN,$(.67N
MJ\I>BT_WVMP2SHIQ?J\FED:6@AE)7JF7]3$YK91P5_"]4LJ'5)L!XR4MP5-E
M#8('SK*3([)Y&H#.:6 AUOD0X8^O=$L9*.V :N-.9 B#M,^SK'^/_+9OM'9]
M*K,^*F?&FQ\78WG+X-,!VEMPS(6L#!49M+;@R!AM;!@_%P4"2EY:S!+HLL[^
M)RKX="'JA4IY-1@ZP%&*I1-:@5!0</$ZZQYU0O-B1R/ACAZ4$OA2EE*D/" @
M34&&2M!R;G8^ @V=#VEYLTL/O-7=\C]7"_%_X6YJXR_MK9QA6AGAQG]RQ0=H
M6%A[/[$Y?]XC)CNMQ:'T!OPHDUP-&"VXHZ@Q[_7FP\4$H[NS*LC9V#HL)AC3
M\P#1;BWQXUF:.:VE95PYYKB]S3"W3(?H<LF"!CNYH*-/!)^D=*<^CILO!X/=
M[EZ[/I7>DM]P_.7;Z=%A36$-D"Q3^4;SNNC$[&2&C!NN;*Y- 3[0Q&"V6X5=
M##VO7&>9SL6WT\-Y'M;TD'"7SSO'(T=*VNW]!$3^V0\S*EK:3BW5TF+[YYIV
MO^F]M'=\L6G:L&=$3N@(W]%6TI',="K5Y9BZ'AU]MVF#)VO@]/+69P+0C/N=
M5FLOHF^GVV_M;>\V3+!A@@T3;)C@.Z5I[X4)YK2S3+;7_X -'C^"O6M&N,,^
M=7=K&>%JY&#V=M=+$#K=.H*P:!772A(ZG9\@">V&),P(-B1AF?\-26A(PN*4
M;4C"&DF"I7W)OD[.MQ.$LP#TSLG![GZW>5S4/"[Z$4;XE-]K9H.UCXOFE>MZ
MF>#N_X()_M0>,<>$Y(]];M;S[>"Y_5'7 ^Z&;Y0XHCH._6.RF' OW! <S>1:
M2GWOC3UVJ22H/)OP+1!T2IW 4->Y'_IH3A%IV@V%!2D4)ALU3O*,EQ2@&?^F
M8T__$LZ(7(#.(=0(A$R"G+HQ9FRC%_.#7AS>[<:3][QQ>.G[+U!+ 0(4 PH 
M   ( )T\^38-,LK:+00  /L=   2              "D@0    !E>&5C=71I
A;VY?;&]G+FAT;6Q02P4&      $  0!     700      
end

Mime
View raw message