harmony-alerts mailing list archives

Site index · List index
Message view « Date » · « Thread »
Top « Date » · « Thread »
From nom...@intel.com
Subject [build-test alert] BUILD FAILED Linux x86: stress
Date Wed, 25 Jul 2007 00:08:48 GMT
BUILD FAILED:
	Ant Error Message:
/export/users/cc/cc-suites/scripts/cc-exec-adaptor.xml:101: The following error occurred while executing this line: /export/users/cc/cc-suites/adaptors/stress/adaptor.xml:100: The following error occurred while executing this line: /export/users/cc/cc-suites/adaptors/stress/adaptor.xml:116: The following error occurred while executing this line: /export/users/cc/cc-suites/scripts/framework.xml:1069: Java returned: 1

Date of build:	07/25/2007 05:08:02
Time to build:	120 minutes 34 seconds
Last changed:	07/24/2007 16:12:15
Last log entry:	snapshot

***********************************************************
Errors/Warnings:	(4)
            
BUILD FAILED
/export/users/cc/cc-suites/tests/stress/qa/build.xml:169: Java returned: 255
Total time: 120 minutes 31 seconds
The execution FAILED with the following exception:
The following error occurred while executing this line:
/export/users/cc/cc-suites/adaptors/stress/adaptor.xml:100: The following error occurred while executing this line:
/export/users/cc/cc-suites/adaptors/stress/adaptor.xml:116: The following error occurred while executing this line:
/export/users/cc/cc-suites/scripts/framework.xml:1069: Java returned: 1

***********************************************************
Unit Tests: (193)
        
error: test stress.org.apache.harmony.test.stress.classloader.MixThreads.ConstantPool.testCPLmt1
error: test stress.org.apache.harmony.test.stress.classloader.MixThreads.ConstantPool.testCPLmt2
error: test stress.org.apache.harmony.test.stress.classloader.MixThreads.FieldsLmt.testFieldsLmt1
error: test stress.org.apache.harmony.test.stress.classloader.MixThreads.FieldsLmt.testFieldsLmt2
error: test stress.org.apache.harmony.test.stress.classloader.MixThreads.LargeClassName.testLargeClassName_W1
error: test stress.org.apache.harmony.test.stress.classloader.MixThreads.WrongClasses.testNECLoad1
error: test stress.org.apache.harmony.test.stress.classloader.MixThreads.WrongClasses.testNECLoad2
error: test stress.org.apache.harmony.test.stress.classloader.MixThreads.WrongClasses.testWCLoad1
error: test stress.org.apache.harmony.test.stress.classloader.MixThreads.WrongClasses.testWCLoad2
error: test stress.org.apache.harmony.test.stress.classloader.NotSynchThreads.SupIntf.testManySupIntf1
error: test stress.org.apache.harmony.test.stress.classloader.NotSynchThreads.SupIntf.testManySupIntf2
error: test stress.org.apache.harmony.test.stress.classloader.NotSynchThreads.WrongClasses.testWCLoad
error: test stress.org.apache.harmony.test.stress.classloader.OneThread.MethodArgs.testMethodArgs
error: test stress.org.apache.harmony.test.stress.classloader.OneThread.MethodNameLmt.testMethodNameLmt
error: test stress.org.apache.harmony.test.stress.classloader.OneThread.SubClasses.testManySubClasses
error: test stress.org.apache.harmony.test.stress.classloader.OneThread.SupIntf.testManySupIntf1
error: test stress.org.apache.harmony.test.stress.classloader.OneThread.WrongClasses.testWCLoad
error: test stress.org.apache.harmony.test.stress.classloader.SynchThreads.ConstantPool.testCPLmt1
error: test stress.org.apache.harmony.test.stress.classloader.SynchThreads.ConstantPool.testCPLmt2
error: test stress.org.apache.harmony.test.stress.classloader.SynchThreads.FieldsLmt.testFieldsLmt1
error: test stress.org.apache.harmony.test.stress.classloader.SynchThreads.FieldsLmt.testFieldsLmt2
error: test stress.org.apache.harmony.test.stress.classloader.SynchThreads.LargeClassName.testLargeClassName_R1
error: test stress.org.apache.harmony.test.stress.classloader.SynchThreads.LargeClassName.testLargeClassName_W1
error: test stress.org.apache.harmony.test.stress.classloader.SynchThreads.MethodArgs.testMethodArgs1
error: test stress.org.apache.harmony.test.stress.classloader.SynchThreads.SupIntf.testManySupIntf1
error: test stress.org.apache.harmony.test.stress.classloader.SynchThreads.SupIntf.testManySupIntf2
error: test stress.org.apache.harmony.test.stress.classloader.SynchThreads.SupIntf.testManySupIntf3
error: test stress.org.apache.harmony.test.stress.classloader.SynchThreads.SupIntf.testManySupIntf4
error: test stress.org.apache.harmony.test.stress.classloader.SynchThreads.WrongClasses.testNECLoad1
error: test stress.org.apache.harmony.test.stress.classloader.SynchThreads.WrongClasses.testNECLoad2
error: test stress.org.apache.harmony.test.stress.classloader.SynchThreads.WrongClasses.testWCLoad1
error: test stress.org.apache.harmony.test.stress.classloader.SynchThreads.WrongClasses.testWCLoad2
error: test stress.org.apache.harmony.test.stress.gc.frag.FragmentationGCFinalizeTest3.FragmentationGCFinalizeTest3
error: test stress.org.apache.harmony.test.stress.gc.frag.FragmentationSimpleTest2.FragmentationSimpleTest2
error: test stress.org.apache.harmony.test.stress.jni.stack.StackTest12
error: test stress.org.apache.harmony.test.stress.jni.stack.StackTest14
error: test stress.org.apache.harmony.test.stress.jni.stack.StackTest4
error: test stress.org.apache.harmony.test.stress.jni.stack.StackTest6
error: test stress.org.apache.harmony.test.stress.jni.strings.StringsTest1
error: test stress.org.apache.harmony.test.stress.jni.strings.StringsTest2
error: test stress.org.apache.harmony.test.stress.jni.strings.StringsTest3
error: test stress.org.apache.harmony.test.stress.jpda.jdwp.scenario.THREAD003.ThreadTest003
error: test stress.org.apache.harmony.test.stress.misc.WaitNotifyTest
error: test stress.org.apache.harmony.test.stress.threads.StressThreads12Test.StressThreads12Test
Unit Test Error Details:	(44)
                
Test: testClass: stress.org.apache.harmony.test.stress.classloader.MixThreads.ConstantPool.testCPLmt1java version "1.5.0" 
pre-alpha : not complete or compatible
svn = r558930, (Jul 24 2007), Linux/ia32/gcc 3.3.3, release build
http://harmony.apache.org
The GC did not provide gc_add_weak_root_set_entry()

Apache Harmony Launcher : (c) Copyright 1991, 2006 The Apache Software Foundation or its licensors, as applicable.
[debug] started null(org.apache.harmony.test.share.stress.ReliabilityRunner)
[debug] timeToWork = 30, timeToAbort = 30
[debug] started null(org.apache.harmony.test.share.stress.generator.Thread)
[debug] Thread.setContext  { org.apache.harmony.test.stress.classloader.MixThreads.ConstantPool.testCPLmt {} }
[debug] Starting 1 threads
[debug] ThreadToRun.run()
[debug] completed null(org.apache.harmony.test.share.stress.generator.Thread)
[debug] Generator.execute()
[debug] class = org.apache.harmony.test.stress.classloader.MixThreads.ConstantPool.testCPLmt
[debug] org.apache.harmony.test.stress.classloader.MixThreads.ConstantPool.testCPLmt { }
[debug] started test(or...
Test: testClass: stress.org.apache.harmony.test.stress.classloader.MixThreads.ConstantPool.testCPLmt2java version "1.5.0" 
pre-alpha : not complete or compatible
svn = r558930, (Jul 24 2007), Linux/ia32/gcc 3.3.3, release build
http://harmony.apache.org
The GC did not provide gc_add_weak_root_set_entry()

Apache Harmony Launcher : (c) Copyright 1991, 2006 The Apache Software Foundation or its licensors, as applicable.
[debug] started null(org.apache.harmony.test.share.stress.ReliabilityRunner)
[debug] timeToWork = 30, timeToAbort = 30
[debug] started null(org.apache.harmony.test.share.stress.generator.Thread)
[debug] Thread.setContext  { org.apache.harmony.test.stress.classloader.MixThreads.ConstantPool.testCPLmt {} }
[debug] Starting 1 threads
[debug] completed null(org.apache.harmony.test.share.stress.generator.Thread)
[debug] ThreadToRun.run()
[debug] Generator.execute()
[debug] class = org.apache.harmony.test.stress.classloader.MixThreads.ConstantPool.testCPLmt
[debug] org.apache.harmony.test.stress.classloader.MixThreads.ConstantPool.testCPLmt { }
[debug] started test(or...
Test: testClass: stress.org.apache.harmony.test.stress.classloader.MixThreads.FieldsLmt.testFieldsLmt1java version "1.5.0" 
pre-alpha : not complete or compatible
svn = r558930, (Jul 24 2007), Linux/ia32/gcc 3.3.3, release build
http://harmony.apache.org
The GC did not provide gc_add_weak_root_set_entry()

Apache Harmony Launcher : (c) Copyright 1991, 2006 The Apache Software Foundation or its licensors, as applicable.
[debug] started null(org.apache.harmony.test.share.stress.ReliabilityRunner)
[debug] timeToWork = 30, timeToAbort = 30
[debug] started null(org.apache.harmony.test.share.stress.generator.Thread)
[debug] Thread.setContext  { org.apache.harmony.test.stress.classloader.MixThreads.FieldsLmt.testFieldsLmt {} }
[debug] Starting 1 threads
[debug] ThreadToRun.run()
[debug] completed null(org.apache.harmony.test.share.stress.generator.Thread)
[debug] Generator.execute()
[debug] class = org.apache.harmony.test.stress.classloader.MixThreads.FieldsLmt.testFieldsLmt
[debug] org.apache.harmony.test.stress.classloader.MixThreads.FieldsLmt.testFieldsLmt { }
[debug] started test...
Test: testClass: stress.org.apache.harmony.test.stress.classloader.MixThreads.FieldsLmt.testFieldsLmt2java version "1.5.0" 
pre-alpha : not complete or compatible
svn = r558930, (Jul 24 2007), Linux/ia32/gcc 3.3.3, release build
http://harmony.apache.org
The GC did not provide gc_add_weak_root_set_entry()

Apache Harmony Launcher : (c) Copyright 1991, 2006 The Apache Software Foundation or its licensors, as applicable.
[debug] started null(org.apache.harmony.test.share.stress.ReliabilityRunner)
[debug] timeToWork = 30, timeToAbort = 30
[debug] started null(org.apache.harmony.test.share.stress.generator.Thread)
[debug] Thread.setContext  { org.apache.harmony.test.stress.classloader.MixThreads.FieldsLmt.testFieldsLmt {} }
[debug] Starting 1 threads
[debug] ThreadToRun.run()
[debug] completed null(org.apache.harmony.test.share.stress.generator.Thread)
[debug] Generator.execute()
[debug] class = org.apache.harmony.test.stress.classloader.MixThreads.FieldsLmt.testFieldsLmt
[debug] org.apache.harmony.test.stress.classloader.MixThreads.FieldsLmt.testFieldsLmt { }
[debug] started test...
Test: testClass: stress.org.apache.harmony.test.stress.classloader.MixThreads.LargeClassName.testLargeClassName_W1java version "1.5.0" 
pre-alpha : not complete or compatible
svn = r558930, (Jul 24 2007), Linux/ia32/gcc 3.3.3, release build
http://harmony.apache.org
The GC did not provide gc_add_weak_root_set_entry()

Apache Harmony Launcher : (c) Copyright 1991, 2006 The Apache Software Foundation or its licensors, as applicable.
[debug] started null(org.apache.harmony.test.share.stress.ReliabilityRunner)
[debug] timeToWork = 30, timeToAbort = 30
[debug] started null(org.apache.harmony.test.share.stress.generator.Thread)
[debug] Thread.setContext  { org.apache.harmony.test.stress.classloader.MixThreads.LargeClassName.testLCN {} }
[debug] Starting 1 threads
[debug] ThreadToRun.run()
[debug] completed null(org.apache.harmony.test.share.stress.generator.Thread)
[debug] Generator.execute()
[debug] class = org.apache.harmony.test.stress.classloader.MixThreads.LargeClassName.testLCN
[debug] org.apache.harmony.test.stress.classloader.MixThreads.LargeClassName.testLCN { }
[debug] started test(or...
Test: testClass: stress.org.apache.harmony.test.stress.classloader.MixThreads.WrongClasses.testNECLoad1java version "1.5.0" 
pre-alpha : not complete or compatible
svn = r558930, (Jul 24 2007), Linux/ia32/gcc 3.3.3, release build
http://harmony.apache.org
The GC did not provide gc_add_weak_root_set_entry()

Apache Harmony Launcher : (c) Copyright 1991, 2006 The Apache Software Foundation or its licensors, as applicable.
[debug] started null(org.apache.harmony.test.share.stress.ReliabilityRunner)
[debug] timeToWork = 30, timeToAbort = 30
[debug] started null(org.apache.harmony.test.share.stress.generator.Thread)
[debug] Thread.setContext  { org.apache.harmony.test.stress.classloader.MixThreads.WrongClasses.testNECLoad_MT {} }
[debug] Starting 1 threads
[debug] ThreadToRun.run()
[debug] completed null(org.apache.harmony.test.share.stress.generator.Thread)
[debug] Generator.execute()
[debug] class = org.apache.harmony.test.stress.classloader.MixThreads.WrongClasses.testNECLoad_MT
[debug] org.apache.harmony.test.stress.classloader.MixThreads.WrongClasses.testNECLoad_MT { }
[debug] ...
Test: testClass: stress.org.apache.harmony.test.stress.classloader.MixThreads.WrongClasses.testNECLoad2java version "1.5.0" 
pre-alpha : not complete or compatible
svn = r558930, (Jul 24 2007), Linux/ia32/gcc 3.3.3, release build
http://harmony.apache.org
The GC did not provide gc_add_weak_root_set_entry()

Apache Harmony Launcher : (c) Copyright 1991, 2006 The Apache Software Foundation or its licensors, as applicable.
[debug] started null(org.apache.harmony.test.share.stress.ReliabilityRunner)
[debug] timeToWork = 30, timeToAbort = 30
[debug] started null(org.apache.harmony.test.share.stress.generator.Thread)
[debug] Thread.setContext  { org.apache.harmony.test.stress.classloader.MixThreads.WrongClasses.testNECLoad_MT {} }
[debug] Starting 1 threads
[debug] ThreadToRun.run()
[debug] completed null(org.apache.harmony.test.share.stress.generator.Thread)
[debug] Generator.execute()
[debug] class = org.apache.harmony.test.stress.classloader.MixThreads.WrongClasses.testNECLoad_MT
[debug] org.apache.harmony.test.stress.classloader.MixThreads.WrongClasses.testNECLoad_MT { }
[debug] ...
Test: testClass: stress.org.apache.harmony.test.stress.classloader.MixThreads.WrongClasses.testWCLoad1java version "1.5.0" 
pre-alpha : not complete or compatible
svn = r558930, (Jul 24 2007), Linux/ia32/gcc 3.3.3, release build
http://harmony.apache.org
The GC did not provide gc_add_weak_root_set_entry()

Apache Harmony Launcher : (c) Copyright 1991, 2006 The Apache Software Foundation or its licensors, as applicable.
[debug] started null(org.apache.harmony.test.share.stress.ReliabilityRunner)
[debug] timeToWork = 30, timeToAbort = 30
[debug] started null(org.apache.harmony.test.share.stress.generator.Thread)
[debug] Thread.setContext  { org.apache.harmony.test.stress.classloader.MixThreads.WrongClasses.testWCLoad_MT {} }
[debug] Starting 1 threads
[debug] ThreadToRun.run()
[debug] completed null(org.apache.harmony.test.share.stress.generator.Thread)
[debug] Generator.execute()
[debug] class = org.apache.harmony.test.stress.classloader.MixThreads.WrongClasses.testWCLoad_MT
[debug] org.apache.harmony.test.stress.classloader.MixThreads.WrongClasses.testWCLoad_MT { }
[debug] sta...
Test: testClass: stress.org.apache.harmony.test.stress.classloader.MixThreads.WrongClasses.testWCLoad2java version "1.5.0" 
pre-alpha : not complete or compatible
svn = r558930, (Jul 24 2007), Linux/ia32/gcc 3.3.3, release build
http://harmony.apache.org
The GC did not provide gc_add_weak_root_set_entry()

Apache Harmony Launcher : (c) Copyright 1991, 2006 The Apache Software Foundation or its licensors, as applicable.
[debug] started null(org.apache.harmony.test.share.stress.ReliabilityRunner)
[debug] timeToWork = 30, timeToAbort = 30
[debug] started null(org.apache.harmony.test.share.stress.generator.Thread)
[debug] Thread.setContext  { org.apache.harmony.test.stress.classloader.MixThreads.WrongClasses.testWCLoad_MT {} }
[debug] Starting 1 threads
[debug] ThreadToRun.run()
[debug] completed null(org.apache.harmony.test.share.stress.generator.Thread)
[debug] Generator.execute()
[debug] class = org.apache.harmony.test.stress.classloader.MixThreads.WrongClasses.testWCLoad_MT
[debug] org.apache.harmony.test.stress.classloader.MixThreads.WrongClasses.testWCLoad_MT { }
[debug] sta...
Test: testClass: stress.org.apache.harmony.test.stress.classloader.NotSynchThreads.SupIntf.testManySupIntf1java version "1.5.0" 
pre-alpha : not complete or compatible
svn = r558930, (Jul 24 2007), Linux/ia32/gcc 3.3.3, release build
http://harmony.apache.org
The GC did not provide gc_add_weak_root_set_entry()

Apache Harmony Launcher : (c) Copyright 1991, 2006 The Apache Software Foundation or its licensors, as applicable.
[debug] started null(org.apache.harmony.test.share.stress.ReliabilityRunner)
[debug] timeToWork = 30, timeToAbort = 30
[debug] started null(org.apache.harmony.test.share.stress.generator.Thread)
[debug] Thread.setContext  { org.apache.harmony.test.stress.classloader.NotSynchThreads.SupIntf.testManySupIntf1 {} }
[debug] Starting 1 threads
[debug] ThreadToRun.run()
[debug] completed null(org.apache.harmony.test.share.stress.generator.Thread)
[debug] Generator.execute()
[debug] class = org.apache.harmony.test.stress.classloader.NotSynchThreads.SupIntf.testManySupIntf1
[debug] org.apache.harmony.test.stress.classloader.NotSynchThreads.SupIntf.testManySupIntf1 { }
[d...
Test: testClass: stress.org.apache.harmony.test.stress.classloader.NotSynchThreads.SupIntf.testManySupIntf2java version "1.5.0" 
pre-alpha : not complete or compatible
svn = r558930, (Jul 24 2007), Linux/ia32/gcc 3.3.3, release build
http://harmony.apache.org
The GC did not provide gc_add_weak_root_set_entry()

Apache Harmony Launcher : (c) Copyright 1991, 2006 The Apache Software Foundation or its licensors, as applicable.
[debug] started null(org.apache.harmony.test.share.stress.ReliabilityRunner)
[debug] timeToWork = 30, timeToAbort = 30
[debug] started null(org.apache.harmony.test.share.stress.generator.Thread)
[debug] Thread.setContext  { org.apache.harmony.test.stress.classloader.NotSynchThreads.SupIntf.testManySupIntf2 {} }
[debug] Starting 1 threads
[debug] ThreadToRun.run()
[debug] completed null(org.apache.harmony.test.share.stress.generator.Thread)
[debug] Generator.execute()
[debug] class = org.apache.harmony.test.stress.classloader.NotSynchThreads.SupIntf.testManySupIntf2
[debug] org.apache.harmony.test.stress.classloader.NotSynchThreads.SupIntf.testManySupIntf2 { }
[d...
Test: testClass: stress.org.apache.harmony.test.stress.classloader.NotSynchThreads.WrongClasses.testWCLoadjava version "1.5.0" 
pre-alpha : not complete or compatible
svn = r558930, (Jul 24 2007), Linux/ia32/gcc 3.3.3, release build
http://harmony.apache.org
The GC did not provide gc_add_weak_root_set_entry()

Apache Harmony Launcher : (c) Copyright 1991, 2006 The Apache Software Foundation or its licensors, as applicable.
[debug] started null(org.apache.harmony.test.share.stress.ReliabilityRunner)
[debug] timeToWork = 30, timeToAbort = 30
[debug] started null(org.apache.harmony.test.share.stress.generator.Thread)
[debug] Thread.setContext  { org.apache.harmony.test.stress.classloader.NotSynchThreads.WrongClasses.testWCLoad_NST {} }
[debug] Starting 1 threads
[debug] ThreadToRun.run()
[debug] completed null(org.apache.harmony.test.share.stress.generator.Thread)
[debug] Generator.execute()
[debug] class = org.apache.harmony.test.stress.classloader.NotSynchThreads.WrongClasses.testWCLoad_NST
[debug] org.apache.harmony.test.stress.classloader.NotSynchThreads.WrongClasses.testWCLoad_N...
Test: testClass: stress.org.apache.harmony.test.stress.classloader.OneThread.MethodArgs.testMethodArgsjava version "1.5.0" 
pre-alpha : not complete or compatible
svn = r558930, (Jul 24 2007), Linux/ia32/gcc 3.3.3, release build
http://harmony.apache.org
The GC did not provide gc_add_weak_root_set_entry()

Apache Harmony Launcher : (c) Copyright 1991, 2006 The Apache Software Foundation or its licensors, as applicable.
[debug] started null(org.apache.harmony.test.share.stress.ReliabilityRunner)
[debug] timeToWork = 30, timeToAbort = 30
[debug] started null(org.apache.harmony.test.share.stress.generator.Thread)
[debug] Thread.setContext  { org.apache.harmony.test.stress.classloader.share.MethodArgs.testMethodArgs_R {} }
[debug] Starting 1 threads
[debug] ThreadToRun.run()
[debug] completed null(org.apache.harmony.test.share.stress.generator.Thread)
[debug] Generator.execute()
[debug] class = org.apache.harmony.test.stress.classloader.share.MethodArgs.testMethodArgs_R
[debug] org.apache.harmony.test.stress.classloader.share.MethodArgs.testMethodArgs_R { }
[debug] started test(or...
Test: testClass: stress.org.apache.harmony.test.stress.classloader.OneThread.MethodNameLmt.testMethodNameLmtjava version "1.5.0" 
pre-alpha : not complete or compatible
svn = r558930, (Jul 24 2007), Linux/ia32/gcc 3.3.3, release build
http://harmony.apache.org
The GC did not provide gc_add_weak_root_set_entry()

Apache Harmony Launcher : (c) Copyright 1991, 2006 The Apache Software Foundation or its licensors, as applicable.
[debug] started null(org.apache.harmony.test.share.stress.ReliabilityRunner)
[debug] timeToWork = 30, timeToAbort = 30
[debug] started null(org.apache.harmony.test.share.stress.generator.Thread)
[debug] Thread.setContext  { org.apache.harmony.test.stress.classloader.OneThread.MethodNameLmt.testMethodNameLmt {} }
[debug] Starting 1 threads
[debug] ThreadToRun.run()
[debug] Generator.execute()
[debug] completed null(org.apache.harmony.test.share.stress.generator.Thread)
[debug] class = org.apache.harmony.test.stress.classloader.OneThread.MethodNameLmt.testMethodNameLmt
[debug] org.apache.harmony.test.stress.classloader.OneThread.MethodNameLmt.testMethodNameLmt { }...
Test: testClass: stress.org.apache.harmony.test.stress.classloader.OneThread.SubClasses.testManySubClassesjava version "1.5.0" 
pre-alpha : not complete or compatible
svn = r558930, (Jul 24 2007), Linux/ia32/gcc 3.3.3, release build
http://harmony.apache.org
The GC did not provide gc_add_weak_root_set_entry()

Apache Harmony Launcher : (c) Copyright 1991, 2006 The Apache Software Foundation or its licensors, as applicable.
[debug] started null(org.apache.harmony.test.share.stress.ReliabilityRunner)
[debug] timeToWork = 30, timeToAbort = 30
[debug] started null(org.apache.harmony.test.share.stress.generator.Thread)
[debug] Thread.setContext  { org.apache.harmony.test.stress.classloader.OneThread.SubClasses.testManySubClasses {} }
[debug] Starting 1 threads
[debug] ThreadToRun.run()
[debug] completed null(org.apache.harmony.test.share.stress.generator.Thread)
[debug] Generator.execute()
[debug] class = org.apache.harmony.test.stress.classloader.OneThread.SubClasses.testManySubClasses
[debug] org.apache.harmony.test.stress.classloader.OneThread.SubClasses.testManySubClasses { }
[debu...
Test: testClass: stress.org.apache.harmony.test.stress.classloader.OneThread.SupIntf.testManySupIntf1java version "1.5.0" 
pre-alpha : not complete or compatible
svn = r558930, (Jul 24 2007), Linux/ia32/gcc 3.3.3, release build
http://harmony.apache.org
The GC did not provide gc_add_weak_root_set_entry()

Apache Harmony Launcher : (c) Copyright 1991, 2006 The Apache Software Foundation or its licensors, as applicable.
[debug] started null(org.apache.harmony.test.share.stress.ReliabilityRunner)
[debug] timeToWork = 30, timeToAbort = 30
[debug] started null(org.apache.harmony.test.share.stress.generator.Thread)
[debug] Thread.setContext  { org.apache.harmony.test.stress.classloader.OneThread.SupIntf.testManySupIntf1 {} }
[debug] Starting 1 threads
[debug] ThreadToRun.run()
[debug] completed null(org.apache.harmony.test.share.stress.generator.Thread)
[debug] Generator.execute()
[debug] class = org.apache.harmony.test.stress.classloader.OneThread.SupIntf.testManySupIntf1
[debug] org.apache.harmony.test.stress.classloader.OneThread.SupIntf.testManySupIntf1 { }
[debug] started test...
Test: testClass: stress.org.apache.harmony.test.stress.classloader.OneThread.WrongClasses.testWCLoadjava version "1.5.0" 
pre-alpha : not complete or compatible
svn = r558930, (Jul 24 2007), Linux/ia32/gcc 3.3.3, release build
http://harmony.apache.org
The GC did not provide gc_add_weak_root_set_entry()

Apache Harmony Launcher : (c) Copyright 1991, 2006 The Apache Software Foundation or its licensors, as applicable.
[debug] started null(org.apache.harmony.test.share.stress.ReliabilityRunner)
[debug] timeToWork = 30, timeToAbort = 30
[debug] started null(org.apache.harmony.test.share.stress.generator.Thread)
[debug] Thread.setContext  { org.apache.harmony.test.stress.classloader.OneThread.WrongClasses.testWCLoad {} }
[debug] Starting 1 threads
[debug] ThreadToRun.run()
[debug] completed null(org.apache.harmony.test.share.stress.generator.Thread)
[debug] Generator.execute()
[debug] class = org.apache.harmony.test.stress.classloader.OneThread.WrongClasses.testWCLoad
[debug] org.apache.harmony.test.stress.classloader.OneThread.WrongClasses.testWCLoad { }
[debug] started test(or...
Test: testClass: stress.org.apache.harmony.test.stress.classloader.SynchThreads.ConstantPool.testCPLmt1java version "1.5.0" 
pre-alpha : not complete or compatible
svn = r558930, (Jul 24 2007), Linux/ia32/gcc 3.3.3, release build
http://harmony.apache.org
The GC did not provide gc_add_weak_root_set_entry()

Apache Harmony Launcher : (c) Copyright 1991, 2006 The Apache Software Foundation or its licensors, as applicable.
[debug] started null(org.apache.harmony.test.share.stress.ReliabilityRunner)
[debug] timeToWork = 30, timeToAbort = 30
[debug] started null(org.apache.harmony.test.share.stress.generator.Thread)
[debug] Thread.setContext  { org.apache.harmony.test.stress.classloader.SynchThreads.ConstantPool.testCPLmt {} }
[debug] Starting 1 threads
[debug] ThreadToRun.run()
[debug] completed null(org.apache.harmony.test.share.stress.generator.Thread)
[debug] Generator.execute()
[debug] class = org.apache.harmony.test.stress.classloader.SynchThreads.ConstantPool.testCPLmt
[debug] org.apache.harmony.test.stress.classloader.SynchThreads.ConstantPool.testCPLmt { }
[debug] started t...
Test: testClass: stress.org.apache.harmony.test.stress.classloader.SynchThreads.ConstantPool.testCPLmt2java version "1.5.0" 
pre-alpha : not complete or compatible
svn = r558930, (Jul 24 2007), Linux/ia32/gcc 3.3.3, release build
http://harmony.apache.org
The GC did not provide gc_add_weak_root_set_entry()

Apache Harmony Launcher : (c) Copyright 1991, 2006 The Apache Software Foundation or its licensors, as applicable.
[debug] started null(org.apache.harmony.test.share.stress.ReliabilityRunner)
[debug] timeToWork = 30, timeToAbort = 30
[debug] started null(org.apache.harmony.test.share.stress.generator.Thread)
[debug] Thread.setContext  { org.apache.harmony.test.stress.classloader.SynchThreads.ConstantPool.testCPLmt {} }
[debug] Starting 1 threads
[debug] ThreadToRun.run()
[debug] completed null(org.apache.harmony.test.share.stress.generator.Thread)
[debug] Generator.execute()
[debug] class = org.apache.harmony.test.stress.classloader.SynchThreads.ConstantPool.testCPLmt
[debug] org.apache.harmony.test.stress.classloader.SynchThreads.ConstantPool.testCPLmt { }
[debug] started t...
Test: testClass: stress.org.apache.harmony.test.stress.classloader.SynchThreads.FieldsLmt.testFieldsLmt1java version "1.5.0" 
pre-alpha : not complete or compatible
svn = r558930, (Jul 24 2007), Linux/ia32/gcc 3.3.3, release build
http://harmony.apache.org
The GC did not provide gc_add_weak_root_set_entry()

Apache Harmony Launcher : (c) Copyright 1991, 2006 The Apache Software Foundation or its licensors, as applicable.
[debug] started null(org.apache.harmony.test.share.stress.ReliabilityRunner)
[debug] timeToWork = 30, timeToAbort = 30
[debug] started null(org.apache.harmony.test.share.stress.generator.Thread)
[debug] Thread.setContext  { org.apache.harmony.test.stress.classloader.SynchThreads.FieldsLmt.testFieldsLmt {} }
[debug] Starting 1 threads
[debug] ThreadToRun.run()
[debug] completed null(org.apache.harmony.test.share.stress.generator.Thread)
[debug] Generator.execute()
[debug] class = org.apache.harmony.test.stress.classloader.SynchThreads.FieldsLmt.testFieldsLmt
[debug] org.apache.harmony.test.stress.classloader.SynchThreads.FieldsLmt.testFieldsLmt { }
[debug] starte...
Test: testClass: stress.org.apache.harmony.test.stress.classloader.SynchThreads.FieldsLmt.testFieldsLmt2java version "1.5.0" 
pre-alpha : not complete or compatible
svn = r558930, (Jul 24 2007), Linux/ia32/gcc 3.3.3, release build
http://harmony.apache.org
The GC did not provide gc_add_weak_root_set_entry()

Apache Harmony Launcher : (c) Copyright 1991, 2006 The Apache Software Foundation or its licensors, as applicable.
[debug] started null(org.apache.harmony.test.share.stress.ReliabilityRunner)
[debug] timeToWork = 30, timeToAbort = 30
[debug] started null(org.apache.harmony.test.share.stress.generator.Thread)
[debug] Thread.setContext  { org.apache.harmony.test.stress.classloader.SynchThreads.FieldsLmt.testFieldsLmt {} }
[debug] Starting 1 threads
[debug] ThreadToRun.run()
[debug] completed null(org.apache.harmony.test.share.stress.generator.Thread)
[debug] Generator.execute()
[debug] class = org.apache.harmony.test.stress.classloader.SynchThreads.FieldsLmt.testFieldsLmt
[debug] org.apache.harmony.test.stress.classloader.SynchThreads.FieldsLmt.testFieldsLmt { }
[debug] starte...
Test: testClass: stress.org.apache.harmony.test.stress.classloader.SynchThreads.LargeClassName.testLargeClassName_R1java version "1.5.0" 
pre-alpha : not complete or compatible
svn = r558930, (Jul 24 2007), Linux/ia32/gcc 3.3.3, release build
http://harmony.apache.org
The GC did not provide gc_add_weak_root_set_entry()

Apache Harmony Launcher : (c) Copyright 1991, 2006 The Apache Software Foundation or its licensors, as applicable.
[debug] started null(org.apache.harmony.test.share.stress.ReliabilityRunner)
[debug] timeToWork = 30, timeToAbort = 30
[debug] started null(org.apache.harmony.test.share.stress.generator.Thread)
[debug] Thread.setContext  { org.apache.harmony.test.stress.classloader.SynchThreads.LargeClassName.testLCN {} }
[debug] Starting 1 threads
[debug] ThreadToRun.run()
[debug] completed null(org.apache.harmony.test.share.stress.generator.Thread)
[debug] Generator.execute()
[debug] class = org.apache.harmony.test.stress.classloader.SynchThreads.LargeClassName.testLCN
[debug] org.apache.harmony.test.stress.classloader.SynchThreads.LargeClassName.testLCN { }
[debug] started t...
Test: testClass: stress.org.apache.harmony.test.stress.classloader.SynchThreads.LargeClassName.testLargeClassName_W1java version "1.5.0" 
pre-alpha : not complete or compatible
svn = r558930, (Jul 24 2007), Linux/ia32/gcc 3.3.3, release build
http://harmony.apache.org
The GC did not provide gc_add_weak_root_set_entry()

Apache Harmony Launcher : (c) Copyright 1991, 2006 The Apache Software Foundation or its licensors, as applicable.
[debug] started null(org.apache.harmony.test.share.stress.ReliabilityRunner)
[debug] timeToWork = 30, timeToAbort = 30
[debug] started null(org.apache.harmony.test.share.stress.generator.Thread)
[debug] Thread.setContext  { org.apache.harmony.test.stress.classloader.SynchThreads.LargeClassName.testLCN {} }
[debug] Starting 1 threads
[debug] ThreadToRun.run()
[debug] completed null(org.apache.harmony.test.share.stress.generator.Thread)
[debug] Generator.execute()
[debug] class = org.apache.harmony.test.stress.classloader.SynchThreads.LargeClassName.testLCN
[debug] org.apache.harmony.test.stress.classloader.SynchThreads.LargeClassName.testLCN { }
[debug] started t...
Test: testClass: stress.org.apache.harmony.test.stress.classloader.SynchThreads.MethodArgs.testMethodArgs1java version "1.5.0" 
pre-alpha : not complete or compatible
svn = r558930, (Jul 24 2007), Linux/ia32/gcc 3.3.3, release build
http://harmony.apache.org
The GC did not provide gc_add_weak_root_set_entry()

Apache Harmony Launcher : (c) Copyright 1991, 2006 The Apache Software Foundation or its licensors, as applicable.
[debug] started null(org.apache.harmony.test.share.stress.ReliabilityRunner)
[debug] timeToWork = 30, timeToAbort = 30
[debug] started null(org.apache.harmony.test.share.stress.generator.Thread)
[debug] Thread.setContext  { org.apache.harmony.test.stress.classloader.SynchThreads.MethodArgs.testMethodArgs {} }
[debug] Starting 1 threads
[debug] ThreadToRun.run()
[debug] completed null(org.apache.harmony.test.share.stress.generator.Thread)
[debug] Generator.execute()
[debug] class = org.apache.harmony.test.stress.classloader.SynchThreads.MethodArgs.testMethodArgs
[debug] org.apache.harmony.test.stress.classloader.SynchThreads.MethodArgs.testMethodArgs { }
[debug] ...
Test: testClass: stress.org.apache.harmony.test.stress.classloader.SynchThreads.SupIntf.testManySupIntf1java version "1.5.0" 
pre-alpha : not complete or compatible
svn = r558930, (Jul 24 2007), Linux/ia32/gcc 3.3.3, release build
http://harmony.apache.org
The GC did not provide gc_add_weak_root_set_entry()

Apache Harmony Launcher : (c) Copyright 1991, 2006 The Apache Software Foundation or its licensors, as applicable.
[debug] started null(org.apache.harmony.test.share.stress.ReliabilityRunner)
[debug] timeToWork = 30, timeToAbort = 30
[debug] started null(org.apache.harmony.test.share.stress.generator.Thread)
[debug] Thread.setContext  { org.apache.harmony.test.stress.classloader.SynchThreads.SupIntf.testManySupIntf1 {} }
[debug] Starting 1 threads
[debug] ThreadToRun.run()
[debug] completed null(org.apache.harmony.test.share.stress.generator.Thread)
[debug] Generator.execute()
[debug] class = org.apache.harmony.test.stress.classloader.SynchThreads.SupIntf.testManySupIntf1
[debug] org.apache.harmony.test.stress.classloader.SynchThreads.SupIntf.testManySupIntf1 { }
[debug] sta...
Test: testClass: stress.org.apache.harmony.test.stress.classloader.SynchThreads.SupIntf.testManySupIntf2java version "1.5.0" 
pre-alpha : not complete or compatible
svn = r558930, (Jul 24 2007), Linux/ia32/gcc 3.3.3, release build
http://harmony.apache.org
The GC did not provide gc_add_weak_root_set_entry()

Apache Harmony Launcher : (c) Copyright 1991, 2006 The Apache Software Foundation or its licensors, as applicable.
[debug] started null(org.apache.harmony.test.share.stress.ReliabilityRunner)
[debug] timeToWork = 30, timeToAbort = 30
[debug] started null(org.apache.harmony.test.share.stress.generator.Thread)
[debug] Thread.setContext  { org.apache.harmony.test.stress.classloader.SynchThreads.SupIntf.testManySupIntf1 {} }
[debug] Starting 1 threads
[debug] ThreadToRun.run()
[debug] completed null(org.apache.harmony.test.share.stress.generator.Thread)
[debug] Generator.execute()
[debug] class = org.apache.harmony.test.stress.classloader.SynchThreads.SupIntf.testManySupIntf1
[debug] org.apache.harmony.test.stress.classloader.SynchThreads.SupIntf.testManySupIntf1 { }
[debug] sta...
Test: testClass: stress.org.apache.harmony.test.stress.classloader.SynchThreads.SupIntf.testManySupIntf3java version "1.5.0" 
pre-alpha : not complete or compatible
svn = r558930, (Jul 24 2007), Linux/ia32/gcc 3.3.3, release build
http://harmony.apache.org
The GC did not provide gc_add_weak_root_set_entry()

Apache Harmony Launcher : (c) Copyright 1991, 2006 The Apache Software Foundation or its licensors, as applicable.
[debug] started null(org.apache.harmony.test.share.stress.ReliabilityRunner)
[debug] timeToWork = 30, timeToAbort = 30
[debug] started null(org.apache.harmony.test.share.stress.generator.Thread)
[debug] Thread.setContext  { org.apache.harmony.test.stress.classloader.SynchThreads.SupIntf.testManySupIntf2 {} }
[debug] Starting 1 threads
[debug] ThreadToRun.run()
[debug] completed null(org.apache.harmony.test.share.stress.generator.Thread)
[debug] Generator.execute()
[debug] class = org.apache.harmony.test.stress.classloader.SynchThreads.SupIntf.testManySupIntf2
[debug] org.apache.harmony.test.stress.classloader.SynchThreads.SupIntf.testManySupIntf2 { }
[debug] sta...
Test: testClass: stress.org.apache.harmony.test.stress.classloader.SynchThreads.SupIntf.testManySupIntf4java version "1.5.0" 
pre-alpha : not complete or compatible
svn = r558930, (Jul 24 2007), Linux/ia32/gcc 3.3.3, release build
http://harmony.apache.org
The GC did not provide gc_add_weak_root_set_entry()

Apache Harmony Launcher : (c) Copyright 1991, 2006 The Apache Software Foundation or its licensors, as applicable.
[debug] started null(org.apache.harmony.test.share.stress.ReliabilityRunner)
[debug] timeToWork = 30, timeToAbort = 30
[debug] started null(org.apache.harmony.test.share.stress.generator.Thread)
[debug] Thread.setContext  { org.apache.harmony.test.stress.classloader.SynchThreads.SupIntf.testManySupIntf2 {} }
[debug] Starting 1 threads
[debug] ThreadToRun.run()
[debug] completed null(org.apache.harmony.test.share.stress.generator.Thread)
[debug] Generator.execute()
[debug] class = org.apache.harmony.test.stress.classloader.SynchThreads.SupIntf.testManySupIntf2
[debug] org.apache.harmony.test.stress.classloader.SynchThreads.SupIntf.testManySupIntf2 { }
[debug] sta...
Test: testClass: stress.org.apache.harmony.test.stress.classloader.SynchThreads.WrongClasses.testNECLoad1java version "1.5.0" 
pre-alpha : not complete or compatible
svn = r558930, (Jul 24 2007), Linux/ia32/gcc 3.3.3, release build
http://harmony.apache.org
The GC did not provide gc_add_weak_root_set_entry()

Apache Harmony Launcher : (c) Copyright 1991, 2006 The Apache Software Foundation or its licensors, as applicable.
[debug] started null(org.apache.harmony.test.share.stress.ReliabilityRunner)
[debug] timeToWork = 30, timeToAbort = 30
[debug] started null(org.apache.harmony.test.share.stress.generator.Thread)
[debug] Thread.setContext  { org.apache.harmony.test.stress.classloader.SynchThreads.WrongClasses.testNECLoad_ST {} }
[debug] Starting 1 threads
[debug] ThreadToRun.run()
[debug] completed null(org.apache.harmony.test.share.stress.generator.Thread)
[debug] Generator.execute()
[debug] class = org.apache.harmony.test.stress.classloader.SynchThreads.WrongClasses.testNECLoad_ST
[debug] org.apache.harmony.test.stress.classloader.SynchThreads.WrongClasses.testNECLoad_ST { }
[d...
Test: testClass: stress.org.apache.harmony.test.stress.classloader.SynchThreads.WrongClasses.testNECLoad2java version "1.5.0" 
pre-alpha : not complete or compatible
svn = r558930, (Jul 24 2007), Linux/ia32/gcc 3.3.3, release build
http://harmony.apache.org
The GC did not provide gc_add_weak_root_set_entry()

Apache Harmony Launcher : (c) Copyright 1991, 2006 The Apache Software Foundation or its licensors, as applicable.
[debug] started null(org.apache.harmony.test.share.stress.ReliabilityRunner)
[debug] timeToWork = 30, timeToAbort = 30
[debug] started null(org.apache.harmony.test.share.stress.generator.Thread)
[debug] Thread.setContext  { org.apache.harmony.test.stress.classloader.SynchThreads.WrongClasses.testNECLoad_ST {} }
[debug] Starting 1 threads
[debug] ThreadToRun.run()
[debug] completed null(org.apache.harmony.test.share.stress.generator.Thread)
[debug] Generator.execute()
[debug] class = org.apache.harmony.test.stress.classloader.SynchThreads.WrongClasses.testNECLoad_ST
[debug] org.apache.harmony.test.stress.classloader.SynchThreads.WrongClasses.testNECLoad_ST { }
[d...
Test: testClass: stress.org.apache.harmony.test.stress.classloader.SynchThreads.WrongClasses.testWCLoad1java version "1.5.0" 
pre-alpha : not complete or compatible
svn = r558930, (Jul 24 2007), Linux/ia32/gcc 3.3.3, release build
http://harmony.apache.org
The GC did not provide gc_add_weak_root_set_entry()

Apache Harmony Launcher : (c) Copyright 1991, 2006 The Apache Software Foundation or its licensors, as applicable.
[debug] started null(org.apache.harmony.test.share.stress.ReliabilityRunner)
[debug] timeToWork = 30, timeToAbort = 30
[debug] started null(org.apache.harmony.test.share.stress.generator.Thread)
[debug] Thread.setContext  { org.apache.harmony.test.stress.classloader.SynchThreads.WrongClasses.testWCLoad_ST {} }
[debug] Starting 1 threads
[debug] ThreadToRun.run()
[debug] Generator.execute()
[debug] completed null(org.apache.harmony.test.share.stress.generator.Thread)
[debug] class = org.apache.harmony.test.stress.classloader.SynchThreads.WrongClasses.testWCLoad_ST
[debug] org.apache.harmony.test.stress.classloader.SynchThreads.WrongClasses.testWCLoad_ST { }
[debu...
Test: testClass: stress.org.apache.harmony.test.stress.classloader.SynchThreads.WrongClasses.testWCLoad2java version "1.5.0" 
pre-alpha : not complete or compatible
svn = r558930, (Jul 24 2007), Linux/ia32/gcc 3.3.3, release build
http://harmony.apache.org
The GC did not provide gc_add_weak_root_set_entry()

Apache Harmony Launcher : (c) Copyright 1991, 2006 The Apache Software Foundation or its licensors, as applicable.
[debug] started null(org.apache.harmony.test.share.stress.ReliabilityRunner)
[debug] timeToWork = 30, timeToAbort = 30
[debug] started null(org.apache.harmony.test.share.stress.generator.Thread)
[debug] Thread.setContext  { org.apache.harmony.test.stress.classloader.SynchThreads.WrongClasses.testWCLoad_ST {} }
[debug] Starting 1 threads
[debug] ThreadToRun.run()
[debug] completed null(org.apache.harmony.test.share.stress.generator.Thread)
[debug] Generator.execute()
[debug] class = org.apache.harmony.test.stress.classloader.SynchThreads.WrongClasses.testWCLoad_ST
[debug] org.apache.harmony.test.stress.classloader.SynchThreads.WrongClasses.testWCLoad_ST { }
[debu...
Test: testClass: stress.org.apache.harmony.test.stress.gc.frag.FragmentationGCFinalizeTest3.FragmentationGCFinalizeTest3java version "1.5.0" 
pre-alpha : not complete or compatible
svn = r558930, (Jul 24 2007), Linux/ia32/gcc 3.3.3, release build
http://harmony.apache.org
The GC did not provide gc_add_weak_root_set_entry()

Apache Harmony Launcher : (c) Copyright 1991, 2006 The Apache Software Foundation or its licensors, as applicable.
[debug] started null(org.apache.harmony.test.share.stress.ReliabilityRunner)
[debug] timeToWork = 30, timeToAbort = 30
[debug] started null(org.apache.harmony.test.share.stress.generator.Thread)
[debug] Thread.setContext  { org.apache.harmony.test.stress.gc.frag.share.FragmentationGCFinalizeTest {} }
[debug] Starting 1 threads
[debug] ThreadToRun.run()
[debug] completed null(org.apache.harmony.test.share.stress.generator.Thread)
[debug] Generator.execute()
[debug] class = org.apache.harmony.test.stress.gc.frag.share.FragmentationGCFinalizeTest
[debug] org.apache.harmony.test.stress.gc.frag.share.FragmentationGCFinalizeTest { }
[debug] started test(org.apache.har...
Test: testClass: stress.org.apache.harmony.test.stress.gc.frag.FragmentationSimpleTest2.FragmentationSimpleTest2java version "1.5.0" 
pre-alpha : not complete or compatible
svn = r558930, (Jul 24 2007), Linux/ia32/gcc 3.3.3, release build
http://harmony.apache.org
The GC did not provide gc_add_weak_root_set_entry()

Apache Harmony Launcher : (c) Copyright 1991, 2006 The Apache Software Foundation or its licensors, as applicable.
[debug] started null(org.apache.harmony.test.share.stress.ReliabilityRunner)
[debug] timeToWork = 30, timeToAbort = 30
[debug] started null(org.apache.harmony.test.share.stress.generator.Thread)
[debug] Thread.setContext  { org.apache.harmony.test.stress.gc.frag.share.FragmentationSimpleTest {} }
[debug] Starting 1 threads
[debug] ThreadToRun.run()
[debug] completed null(org.apache.harmony.test.share.stress.generator.Thread)
[debug] Generator.execute()
[debug] class = org.apache.harmony.test.stress.gc.frag.share.FragmentationSimpleTest
[debug] org.apache.harmony.test.stress.gc.frag.share.FragmentationSimpleTest { }
[debug] started test(org.apache.harmony.test.st...
Test: testClass: stress.org.apache.harmony.test.stress.jni.stack.StackTest12java version "1.5.0" 
pre-alpha : not complete or compatible
svn = r558930, (Jul 24 2007), Linux/ia32/gcc 3.3.3, release build
http://harmony.apache.org
The GC did not provide gc_add_weak_root_set_entry()

Apache Harmony Launcher : (c) Copyright 1991, 2006 The Apache Software Foundation or its licensors, as applicable.
[debug] started null(org.apache.harmony.test.share.stress.ReliabilityRunner)
[debug] timeToWork = 30, timeToAbort = 30
[debug] started null(org.apache.harmony.test.share.stress.generator.Thread)
[debug] Thread.setContext  { org.apache.harmony.test.stress.jni.stack.StackTest12 {} }
[debug] Starting 1 threads
[debug] ThreadToRun.run()
[debug] completed null(org.apache.harmony.test.share.stress.generator.Thread)
[debug] Generator.execute()
[debug] class = org.apache.harmony.test.stress.jni.stack.StackTest12
[debug] org.apache.harmony.test.stress.jni.stack.StackTest12 { }
[debug] started test(org.apache.harmony.test.stress.jni.stack.StackTest12)
[debug] Main thread:...
Test: testClass: stress.org.apache.harmony.test.stress.jni.stack.StackTest14java version "1.5.0" 
pre-alpha : not complete or compatible
svn = r558930, (Jul 24 2007), Linux/ia32/gcc 3.3.3, release build
http://harmony.apache.org
The GC did not provide gc_add_weak_root_set_entry()

Apache Harmony Launcher : (c) Copyright 1991, 2006 The Apache Software Foundation or its licensors, as applicable.
[debug] started null(org.apache.harmony.test.share.stress.ReliabilityRunner)
[debug] timeToWork = 30, timeToAbort = 30
[debug] started null(org.apache.harmony.test.share.stress.generator.Thread)
[debug] Thread.setContext  { org.apache.harmony.test.stress.jni.stack.StackTest14 {} }
[debug] Starting 1 threads
[debug] ThreadToRun.run()
[debug] completed null(org.apache.harmony.test.share.stress.generator.Thread)
[debug] Generator.execute()
[debug] class = org.apache.harmony.test.stress.jni.stack.StackTest14
[debug] org.apache.harmony.test.stress.jni.stack.StackTest14 { }
[debug] started test(org.apache.harmony.test.stress.jni.stack.StackTest14)
[debug] Main thread:...
Test: testClass: stress.org.apache.harmony.test.stress.jni.stack.StackTest4java version "1.5.0" 
pre-alpha : not complete or compatible
svn = r558930, (Jul 24 2007), Linux/ia32/gcc 3.3.3, release build
http://harmony.apache.org
The GC did not provide gc_add_weak_root_set_entry()

Apache Harmony Launcher : (c) Copyright 1991, 2006 The Apache Software Foundation or its licensors, as applicable.
[debug] started null(org.apache.harmony.test.share.stress.ReliabilityRunner)
[debug] timeToWork = 30, timeToAbort = 30
[debug] started null(org.apache.harmony.test.share.stress.generator.Thread)
[debug] Thread.setContext  { org.apache.harmony.test.stress.jni.stack.StackTest4 {} }
[debug] Starting 1 threads
[debug] ThreadToRun.run()
[debug] completed null(org.apache.harmony.test.share.stress.generator.Thread)
[debug] Generator.execute()
[debug] class = org.apache.harmony.test.stress.jni.stack.StackTest4
[debug] org.apache.harmony.test.stress.jni.stack.StackTest4 { }
[debug] started test(org.apache.harmony.test.stress.jni.stack.StackTest4)
[debug] Main thread: Pad...
Test: testClass: stress.org.apache.harmony.test.stress.jni.stack.StackTest6java version "1.5.0" 
pre-alpha : not complete or compatible
svn = r558930, (Jul 24 2007), Linux/ia32/gcc 3.3.3, release build
http://harmony.apache.org
The GC did not provide gc_add_weak_root_set_entry()

Apache Harmony Launcher : (c) Copyright 1991, 2006 The Apache Software Foundation or its licensors, as applicable.
[debug] started null(org.apache.harmony.test.share.stress.ReliabilityRunner)
[debug] timeToWork = 30, timeToAbort = 30
[debug] started null(org.apache.harmony.test.share.stress.generator.Thread)
[debug] Thread.setContext  { org.apache.harmony.test.stress.jni.stack.StackTest6 {} }
[debug] Starting 1 threads
[debug] ThreadToRun.run()
[debug] completed null(org.apache.harmony.test.share.stress.generator.Thread)
[debug] Generator.execute()
[debug] class = org.apache.harmony.test.stress.jni.stack.StackTest6
[debug] org.apache.harmony.test.stress.jni.stack.StackTest6 { }
[debug] started test(org.apache.harmony.test.stress.jni.stack.StackTest6)
[debug] Main thread: Pad...
Test: testClass: stress.org.apache.harmony.test.stress.jni.strings.StringsTest1java version "1.5.0" 
pre-alpha : not complete or compatible
svn = r558930, (Jul 24 2007), Linux/ia32/gcc 3.3.3, release build
http://harmony.apache.org
The GC did not provide gc_add_weak_root_set_entry()

Apache Harmony Launcher : (c) Copyright 1991, 2006 The Apache Software Foundation or its licensors, as applicable.
[debug] started null(org.apache.harmony.test.share.stress.ReliabilityRunner)
[debug] timeToWork = 30, timeToAbort = 30
[debug] started null(org.apache.harmony.test.share.stress.generator.Thread)
[debug] Thread.setContext  { org.apache.harmony.test.stress.jni.strings.StringsTest1 {} }
[debug] Starting 1 threads
[debug] ThreadToRun.run()
[debug] completed null(org.apache.harmony.test.share.stress.generator.Thread)
[debug] Generator.execute()
[debug] class = org.apache.harmony.test.stress.jni.strings.StringsTest1
[debug] org.apache.harmony.test.stress.jni.strings.StringsTest1 { }
[debug] started test(org.apache.harmony.test.stress.jni.strings.StringsTest1)
Native c...
Test: testClass: stress.org.apache.harmony.test.stress.jni.strings.StringsTest2java version "1.5.0" 
pre-alpha : not complete or compatible
svn = r558930, (Jul 24 2007), Linux/ia32/gcc 3.3.3, release build
http://harmony.apache.org
The GC did not provide gc_add_weak_root_set_entry()

Apache Harmony Launcher : (c) Copyright 1991, 2006 The Apache Software Foundation or its licensors, as applicable.
[debug] started null(org.apache.harmony.test.share.stress.ReliabilityRunner)
[debug] timeToWork = 30, timeToAbort = 30
[debug] started null(org.apache.harmony.test.share.stress.generator.Thread)
[debug] Thread.setContext  { org.apache.harmony.test.stress.jni.strings.StringsTest2 {} }
[debug] Starting 1 threads
[debug] ThreadToRun.run()
[debug] completed null(org.apache.harmony.test.share.stress.generator.Thread)
[debug] Generator.execute()
[debug] class = org.apache.harmony.test.stress.jni.strings.StringsTest2
[debug] org.apache.harmony.test.stress.jni.strings.StringsTest2 { }
[debug] started test(org.apache.harmony.test.stress.jni.strings.StringsTest2)
Native c...
Test: testClass: stress.org.apache.harmony.test.stress.jni.strings.StringsTest3java version "1.5.0" 
pre-alpha : not complete or compatible
svn = r558930, (Jul 24 2007), Linux/ia32/gcc 3.3.3, release build
http://harmony.apache.org
The GC did not provide gc_add_weak_root_set_entry()

Apache Harmony Launcher : (c) Copyright 1991, 2006 The Apache Software Foundation or its licensors, as applicable.
[debug] started null(org.apache.harmony.test.share.stress.ReliabilityRunner)
[debug] timeToWork = 30, timeToAbort = 30
[debug] started null(org.apache.harmony.test.share.stress.generator.Thread)
[debug] Thread.setContext  { org.apache.harmony.test.stress.jni.strings.StringsTest3 {} }
[debug] Starting 1 threads
[debug] ThreadToRun.run()
[debug] completed null(org.apache.harmony.test.share.stress.generator.Thread)
[debug] Generator.execute()
[debug] class = org.apache.harmony.test.stress.jni.strings.StringsTest3
[debug] org.apache.harmony.test.stress.jni.strings.StringsTest3 { }
[debug] started test(org.apache.harmony.test.stress.jni.strings.StringsTest3)
[debug] ...
Test: testClass: stress.org.apache.harmony.test.stress.jpda.jdwp.scenario.THREAD003.ThreadTest003TestHarness:ExecUnit	runProc(): Timeout!!!. The test hung (not finished in 180 second).

java version "1.5.0" 
pre-alpha : not complete or compatible
svn = r558930, (Jul 24 2007), Linux/ia32/gcc 3.3.3, release build
http://harmony.apache.org
06:57:47| Test: class org.apache.harmony.test.stress.jpda.jdwp.scenario.THREAD003.ThreadTest003
		test case(s) to run 1
06:57:48| Launching as a server listening on: nstdrlxl16:42358
06:57:48| Launching: /export/users/cc/cc-suites/build/checkouts/snapshot/hdk/jdk/jre/bin/java -cp "/export/users/cc/cc-suites/build/classes/stress/classes:/export/users/cc/cc-suites/build/results/stress/temp:/export/users/cc/cc-suites/build/classes/stress/classes:/export/users/cc/cc-suites/build/classes/stress/lib:/export/users/cc/cc-suites/build/libs/th.jar:/export/users/cc/cc-suites/build/libs/junit-3.8.2.jar" -agentlib:jdwp=transport=dt_socket,address=nstdrlxl16:42358,server=n -Dvm.assert_dialog=false -Djpda.settings.verbose=true org.apache.harmony.test.str...
Test: testClass: stress.org.apache.harmony.test.stress.misc.WaitNotifyTestjava version "1.5.0" 
pre-alpha : not complete or compatible
svn = r558930, (Jul 24 2007), Linux/ia32/gcc 3.3.3, release build
http://harmony.apache.org
The GC did not provide gc_add_weak_root_set_entry()

Apache Harmony Launcher : (c) Copyright 1991, 2006 The Apache Software Foundation or its licensors, as applicable.
[debug] started null(org.apache.harmony.test.share.stress.ReliabilityRunner)
[debug] timeToWork = 30, timeToAbort = 30
[debug] started null(org.apache.harmony.test.share.stress.generator.Thread)
[debug] Thread.setContext  { org.apache.harmony.test.stress.misc.WaitNotifyTest {} }
[debug] Starting 1 threads
[debug] ThreadToRun.run()
[debug] completed null(org.apache.harmony.test.share.stress.generator.Thread)
[debug] Generator.execute()
[debug] class = org.apache.harmony.test.stress.misc.WaitNotifyTest
[debug] org.apache.harmony.test.stress.misc.WaitNotifyTest { }
[debug] started test(org.apache.harmony.test.stress.misc.WaitNotifyTest)
[debug] i=0
[debug] i=1
[deb...
Test: testClass: stress.org.apache.harmony.test.stress.threads.StressThreads12Test.StressThreads12TestTestHarness:ExecUnit	runProc(): Timeout!!!. The test hung (not finished in 180 second).

java version "1.5.0" 
pre-alpha : not complete or compatible
svn = r558930, (Jul 24 2007), Linux/ia32/gcc 3.3.3, release build
http://harmony.apache.org

Apache Harmony Launcher : (c) Copyright 1991, 2006 The Apache Software Foundation or its licensors, as applicable.

***********************************************************
Modifications since last successful build:	(6)
            
add cc-snapshot log20070724161215Lbuild.6 07/24/2007 16:12:15snapshot
add cc-snapshot log20070720152501Lbuild.5 07/20/2007 15:25:01snapshot
add cc-snapshot log20070719194303Lbuild.4 07/19/2007 19:43:03snapshot
add cc-snapshot log20070713091307Lbuild.3 07/13/2007 09:13:07snapshot
add cc-snapshot log20070712133841Lbuild.2 07/12/2007 13:38:41snapshot
add cc-snapshot log20070706021248Lbuild.1 07/06/2007 02:12:48snapshot

begin 644 execution_log.zip
M4$L#! H    ( !0Y^3;=1;S%]PH  *.)   2    97AE8W5T:6]N7VQO9RYH
M=&ULW9W]4]LX&L=_IG^%9N=NELZTL9V00'QL9U@(6UA>.@E=[N:FPPA;250<
MV95D('NS__M)<DQLB$+294\/1PN))5OZZ*M'C][B>'<L)\F'W>LTGG[8S3CY
ML(N1D-.$_/3C,&7RO:"_DQ#M^'__QX\?WO"<A6\00O^.24(D^8(.]"ME(Q1T
M=]"0)D2@(4\GR"/W6<JEEPO"A1=%ZO][D5-)A'>=TR3V.!%Y(H4GI'HG=)HJ
MU:_X%G]!/^L3=%HA,N<V[B=)[83:030FT4TC2MF0CL):3/&>1./T"]HW\3G'
MDJ8L1.5/PNZO*&XUKT919+WVM]." _WM/[>364Y_A"@FU_G(>M$%$9+$Z%A%
M(*6:I!.BKI<FM#$+^,/.JW^>U= 4/<VUB@QG8IQ*;QS?>%_U+R?>-66>3GE1
M)O<D^H+V,JR20!\QGZ1LBDYPSM0Q1R':C-XJR;(IIZ.Q5'7;#=ZAIN]WT(4Z
M?W;9(!W*.\P).DQS%AMA4<H1E0(E-"),I%R\0U@@G&4J %\GI&%%T2'H5I53
MI_)#T&@W_!^0]6QEIN]QDHVQ0F6I1%$ZR;0]ZOSU>P6C<K->+FX9^@GQ=GNG
MV_+?H<WC/$'-+5W [;?OT EE^;VGK<)35H%:#?7O'>+*T+$@A2584QY+F86>
M-RX4;6"C5"/E=CM1XC/5 %!4-5#3DI2YC(O(1C0<?;^M:)LKVYGW#7LJ,?U[
M1=CMDY953;9W'R5Y3$J6;[A!BI!&0H5\69XR99V7O:FK9M,P5R_*NWBO[5.?
M@F;2/=@4%<AO:!/VVT$';9[B*0HZA5&_M:>F4II54'B**=M0!)MO0[3/"5;6
M%M6=ROFOJR<D).9R,&7[8\P8272B QV$Q%2U09XRY765:S.12.%K,5%7_:R4
MQ0'EAY3%A&\,U8M.7#6),9(I$@3S:&PD$EJ3->I)\,B$>6O+=6%RNR/*5PC5
MC"+E K5::%.F$B?*O;16JX(#*E0YM(O2*9^D$3;"M<.=L-E"_9RA1(<US$6Z
MM+I1YE+U(RJ+E7(8R)23/A%[XOCS!H[CDA[=*3^F\D0S.52+]HK&7;;U0II9
M]%=&/<PYG@IOS[SH- *$-C_M#0:]@]5*^U>R- &QM &Q= "Q= &Q!+Y+F%$^
M(4QJGMD[DY(S(.6[HQMOH/\Z;M>/2%I@2+842:_?/^^[!G'H7!Z1=*!(XM"O
M/&XY32B:!'":3N"R[7 UE1>*Q;SJ5+9=ZO*$9@<430"IHEPVI2<P+4@P3KN 
M)S0.1YAF<L3)4'AFZM17[QPV*C7E)YF>.*MI9S&I*WS@9W:GYJQ*KE/,IN?7
M7]5TT6"*Y=&.9C0O7(JM_XM2..HTGBW%$1,T)D>,RD6%J,>ZFO&\:"$<N;X7
M+8,CA_FB98#:(!:10^X2;+R.IN#?S0NU7=IX'=DOSJC9P/(2S$:>&KEX@RLU
M:B&<L(CH]*[\8$$0'%B]1;8 >%'PFM#6I?"M5MCRGZR%F[7W"69X1&*],*[W
M<5%K!Z ^34NPXTJE:1G$"8[U7LF^.M\LD/9-P./C2TXEX0-SC<D8&O\GFI%X
MQEYY#YZ[F$O-P*L',,A'D3?D>.0=JC]ZK=KL#9H)RH(@8(BM!4& $ =4[_+W
M,8O3B>GUGXD&C-YY)AHP>O>9:$#HO^P?4H83^CM98-V/(IVL6"VDGFO9M$8 
M$GE.U;)& ,(M[-7J/F ZC@7&4(F 8[ISJ(4.#J9KLSHU:.YL-BQ>9+N5&&? 
MF;I:#\DF.$F*Q<"/.!E^,J'0R !17=!R[1287',P"% 3,BDJ4'\>>?[NC(S<
M]C#+N1RMYS_+Y6@!RLX%TKC<#K660($S=\BV#LZL9EQN+>N43%(^+8;MZKU[
MJYH#=4H@1V-%.=9K36:E21T.<I$1%NMT/):>GY_VU,O@O/<TVM7*<YWWB$G"
M>9[)*O$=E>,Y<^T45TNK*U!7=:XS@U#Z$E-YEDHZG-JEKI\#0^O%W%6Q'U&#
M4/NB. J:!GI!V'K38,L&2B?T%]U+L'#_9+OC3HWCE)KU62\:8\H6VUYY#@RK
M6TQ<M;H'7A#V]L";%%L-RR4&T559D!=J[&@&\*AO30C)[,[S(1J&!3^AK8T#
M'E@=6>^$BLC;5T/,/3YRN/]E,,PG",YO"1\FZ9UKEBF+^B3*S6V CEGJ_:J3
M==LHP4(D:;%[JN\UG/6AW@GF([*O8\_PA)AKZD%7?3<?>/XSQ([\QI] OGQU
M(E]"$UE_&M7@S6YBK1P[\LW?@PI-U?V4"8F9_)2FB;EB_]/)Q-$]$&M"NMDA
MLT(>4I+$0G&9TQ^.@$EIH02FY2"_?MQ^YD'0FM @SXZ8'%9(S;&;SQZL2^GF
MMK1U*8$U(@LEL$9TR5,VJC:CL][^B3H/F)@V3.AJ7KX*,2]?D9:.=BK6Q72T
M(V8?;1(Y3F.]/E XI(=#8+9YP0FIJEDYAC: 7X(*;?115+>>LI6#NEK(*\,%
M8 AGJ?R>%9371[VN:5CW5II^V.ZLMKD2!%NO1Z'+5UFO$!9N'E,O61"!![MX
MM0$>)]BYTHJ@[@>ECT%M4Q%X=6\9FL)7=#YK J:H=10-#W7)Z!0>[#,#/O? 
MI_3^=0WUU@,&,!I8"QC 3MEZO+ $AKU+MAHH+$6A[I ]B^A^?%5!!+L[]CPC
M*!V7;#;!:3)+]IK 0\+RDDNF3G @X6XTK0 )JG6#W61ZGO$UZ C+2\+=7JH.
MTY9M+KT"3%B>$O86V&J@L!2%O_VU.NP+?5M81W];6-!><4.FW70ES#DCA3"O
M9!EC'5X(JP)SWJ4?IW/>;U<Y@>YHS!&A+KP_2PB@?YDS+EMLAZ(CZ%7VQU(N
M6U]W\)7M68R]K_%=YHF(,,QIZEU\[/?V#OS ]PING:KO[/DS3_E.>Z?G_7_Y
M?E"Y8]UW==/7$OV"FGYP^$K]FC7]7#V0RJY?LZ8?'+Y2OU9-/U?/+['S;=7X
M',U5E_"U:WRN'A)AY^O4^%P]-L+.MUWC<_6<F*=\O=]Z9Q?:/?=N"9/0O/.,
MKEFE@^-;9G3=*IVKQT4ML+RC?_8.3,=+[TD,K69G=,TJ'9R:G?5J?FU4 $B]
MDJ_6ZP+2[_SGX][^A>[5BJ_$@]:KE?JU:OHY>@Z37;YV33XXG6XIWU9-/CC5
M6^K7J>D'9U!0ZM>NZ0>G?DO]MFOZP1FTE/IU:OK!J=]2OYV:?JX>QV?7;[NF
M'YSZ+?7KUO2#,[0J]=NIZ;=N_5JV&;;#3MA>\9DD0=<'(D6W)@6<JCKL[YWV
M]$#ND.,)@3:.F]$UJW1P1G$SNE:5;MV5$\N#[8WUGO]J34*:4\T#[S?:?F ]
M#Z%,KQS'&\%6=\E)0TP3=9*]L2!$.$_YQL:6_3XJA,0-S3*53LNW/PL(H9S=
ML/2.+<GM(&6D@0:$(#DV6B!.LI1+1)D)B2E77B_E4VL*&QZYUU=XN=!/>8DB
M]?^]R*G2S;O.:1)[JE+S1(I9]2ZM*X'(/8ER_=7H2-()"3?\9NC[8;"%,(M1
M<ZLS69* KJ/B,A0T?32A+%<4J-E%@D0IB^N7U@Y^_GQT<H .]XY.>@>UB"6E
M,Y91&NTW7)2V<3])PJ#3#=&QNEZI*7-E?G&(FNVV/7L;>BMX0']SH:ICKDZ!
MBO3WKIF*&J9)DMY1-D(/#PL+S265"&U7*(VBG'/EN>_&RA++%%6T'%.!$LI(
M^&9)H7&,,V4/#^6>'1?%5C6%_M=Y!IV_)$\1<9JIZAUJAW.7\IM9"1?4;/!F
MU\,?=KV,$_7W.HVGZF4L)\F'_P)02P$"% ,*    "  4.?DVW46\Q?<*  "C
MB0  $@              I($     97AE8W5T:6]N7VQO9RYH=&UL4$L%!@  
0   !  $ 0    "<+      $! 
end

Mime
View raw message