harmony-alerts mailing list archives

Site index · List index
Message view « Date » · « Thread »
Top « Date » · « Thread »
From nom...@intel.com
Subject [build-test alert] BUILD FAILED Linux x86: reliability
Date Tue, 24 Jul 2007 10:03:45 GMT
BUILD FAILED:
	Ant Error Message:
/export/users/cc/cc-reliability/scripts/cc-exec-adaptor.xml:101: The following error occurred while executing this line: /export/users/cc/cc-reliability/adaptors/reliability/adaptor.xml:97: Some reliability tests failed on /export/users/cc/cc-reliability/build/checkouts/snapshot/hdk/jdk/jre/bin/java

Date of build:	07/24/2007 16:17:04
Time to build:	46 minutes 37 seconds
Last changed:	07/24/2007 16:16:34
Last log entry:	snapshot

***********************************************************
Errors/Warnings:	(685)
            
[java] Java Result: 104
[java] Java Result: 104
[java] Java Result: 104
[java] Java Result: 104
[java] Java Result: 104
[java] Java Result: 104
[java] Java Result: 104
[java] Java Result: 104
[java] Java Result: 104
[java] Java Result: 104
[java] Java Result: 104
[java] Java Result: 104
[java] Java Result: 104
[java] Timeout: killed the sub-process
[java] 	at org.apache.tools.ant.taskdefs.Java.fork(Java.java:754)
[java] 	at org.apache.tools.ant.taskdefs.Java.executeJava(Java.java:171)
[java] 	at org.apache.tools.ant.taskdefs.Java.execute(Java.java:84)
[java] 	at org.apache.tools.ant.UnknownElement.execute(UnknownElement.java:275)
[java] 	at org.apache.tools.ant.Task.perform(Task.java:364)
[java] 	at org.apache.tools.ant.taskdefs.Sequential.execute(Sequential.java:64)
[java] 	at net.sf.antcontrib.logic.IfTask.execute(IfTask.java:197)
[java] 	at sun.reflect.GeneratedMethodAccessor5.invoke(Unknown Source)
[java] 	at sun.reflect.DelegatingMethodAccessorImpl.invoke(DelegatingMethodAccessorImpl.java:25)
[java] 	at java.lang.reflect.Method.invoke(Method.java:585)
[java] 	at org.apache.tools.ant.TaskAdapter.execute(TaskAdapter.java:123)
[java] 	at org.apache.tools.ant.UnknownElement.execute(UnknownElement.java:275)
[java] 	at org.apache.tools.ant.Task.perform(Task.java:364)
[java] 	at org.apache.tools.ant.taskdefs.Sequential.execute(Sequential.java:64)
[java] 	at org.apache.tools.ant.UnknownElement.execute(UnknownElement.java:275)
[java] 	at org.apache.tools.ant.Task.perform(Task.java:364)
[java] 	at org.apache.tools.ant.taskdefs.MacroInstance.execute(MacroInstance.java:378)
[java] 	at org.apache.tools.ant.UnknownElement.execute(UnknownElement.java:275)
[java] 	at org.apache.tools.ant.Task.perform(Task.java:364)
[java] 	at org.apache.tools.ant.Target.execute(Target.java:341)
[java] 	at org.apache.tools.ant.Target.performTasks(Target.java:369)
[java] 	at org.apache.tools.ant.Project.executeSortedTargets(Project.java:1216)
[java] 	at org.apache.tools.ant.Project.executeTarget(Project.java:1185)
[java] 	at org.apache.tools.ant.helper.DefaultExecutor.executeTargets(DefaultExecutor.java:40)
[java] 	at org.apache.tools.ant.Project.executeTargets(Project.java:1068)
[java] 	at org.apache.tools.ant.Main.runBuild(Main.java:668)
[java] 	at org.apache.tools.ant.Main.startAnt(Main.java:187)
[java] 	at org.apache.tools.ant.launch.Launcher.run(Launcher.java:246)
[java] 	at org.apache.tools.ant.launch.Launcher.main(Launcher.java:67)
[java] Java Result: 104
[java] Java Result: 104
[java] Java Result: 104
[java] Java Result: 104
[java] Java Result: 104
[java] Java Result: 104
[java] Java Result: 104
[java] Timeout: killed the sub-process
[java] 	at org.apache.tools.ant.taskdefs.Java.fork(Java.java:754)
[java] 	at org.apache.tools.ant.taskdefs.Java.executeJava(Java.java:171)
[java] 	at org.apache.tools.ant.taskdefs.Java.execute(Java.java:84)
[java] 	at org.apache.tools.ant.UnknownElement.execute(UnknownElement.java:275)
[java] 	at org.apache.tools.ant.Task.perform(Task.java:364)
[java] 	at org.apache.tools.ant.taskdefs.Sequential.execute(Sequential.java:64)
[java] 	at net.sf.antcontrib.logic.IfTask.execute(IfTask.java:197)
[java] 	at sun.reflect.GeneratedMethodAccessor5.invoke(Unknown Source)
[java] 	at sun.reflect.DelegatingMethodAccessorImpl.invoke(DelegatingMethodAccessorImpl.java:25)
[java] 	at java.lang.reflect.Method.invoke(Method.java:585)
[java] 	at org.apache.tools.ant.TaskAdapter.execute(TaskAdapter.java:123)
[java] 	at org.apache.tools.ant.UnknownElement.execute(UnknownElement.java:275)
[java] 	at org.apache.tools.ant.Task.perform(Task.java:364)
[java] 	at org.apache.tools.ant.taskdefs.Sequential.execute(Sequential.java:64)
[java] 	at org.apache.tools.ant.UnknownElement.execute(UnknownElement.java:275)
[java] 	at org.apache.tools.ant.Task.perform(Task.java:364)
[java] 	at org.apache.tools.ant.taskdefs.MacroInstance.execute(MacroInstance.java:378)
[java] 	at org.apache.tools.ant.UnknownElement.execute(UnknownElement.java:275)
[java] 	at org.apache.tools.ant.Task.perform(Task.java:364)
[java] 	at org.apache.tools.ant.Target.execute(Target.java:341)
[java] 	at org.apache.tools.ant.Target.performTasks(Target.java:369)
[java] 	at org.apache.tools.ant.Project.executeSortedTargets(Project.java:1216)
[java] 	at org.apache.tools.ant.Project.executeTarget(Project.java:1185)
[java] 	at org.apache.tools.ant.helper.DefaultExecutor.executeTargets(DefaultExecutor.java:40)
[java] 	at org.apache.tools.ant.Project.executeTargets(Project.java:1068)
[java] 	at org.apache.tools.ant.Main.runBuild(Main.java:668)
[java] 	at org.apache.tools.ant.Main.startAnt(Main.java:187)
[java] 	at org.apache.tools.ant.launch.Launcher.run(Launcher.java:246)
[java] 	at org.apache.tools.ant.launch.Launcher.main(Launcher.java:67)
[java] Java Result: 104
[java] Timeout: killed the sub-process
[java] 	at org.apache.tools.ant.taskdefs.Java.fork(Java.java:754)
[java] 	at org.apache.tools.ant.taskdefs.Java.executeJava(Java.java:171)
[java] 	at org.apache.tools.ant.taskdefs.Java.execute(Java.java:84)
[java] 	at org.apache.tools.ant.UnknownElement.execute(UnknownElement.java:275)
[java] 	at org.apache.tools.ant.Task.perform(Task.java:364)
[java] 	at org.apache.tools.ant.taskdefs.Sequential.execute(Sequential.java:64)
[java] 	at net.sf.antcontrib.logic.IfTask.execute(IfTask.java:197)
[java] 	at sun.reflect.GeneratedMethodAccessor5.invoke(Unknown Source)
[java] 	at sun.reflect.DelegatingMethodAccessorImpl.invoke(DelegatingMethodAccessorImpl.java:25)
[java] 	at java.lang.reflect.Method.invoke(Method.java:585)
[java] 	at org.apache.tools.ant.TaskAdapter.execute(TaskAdapter.java:123)
[java] 	at org.apache.tools.ant.UnknownElement.execute(UnknownElement.java:275)
[java] 	at org.apache.tools.ant.Task.perform(Task.java:364)
[java] 	at org.apache.tools.ant.taskdefs.Sequential.execute(Sequential.java:64)
[java] 	at org.apache.tools.ant.UnknownElement.execute(UnknownElement.java:275)
[java] 	at org.apache.tools.ant.Task.perform(Task.java:364)
[java] 	at org.apache.tools.ant.taskdefs.MacroInstance.execute(MacroInstance.java:378)
[java] 	at org.apache.tools.ant.UnknownElement.execute(UnknownElement.java:275)
[java] 	at org.apache.tools.ant.Task.perform(Task.java:364)
[java] 	at org.apache.tools.ant.Target.execute(Target.java:341)
[java] 	at org.apache.tools.ant.Target.performTasks(Target.java:369)
[java] 	at org.apache.tools.ant.Project.executeSortedTargets(Project.java:1216)
[java] 	at org.apache.tools.ant.Project.executeTarget(Project.java:1185)
[java] 	at org.apache.tools.ant.helper.DefaultExecutor.executeTargets(DefaultExecutor.java:40)
[java] 	at org.apache.tools.ant.Project.executeTargets(Project.java:1068)
[java] 	at org.apache.tools.ant.Main.runBuild(Main.java:668)
[java] 	at org.apache.tools.ant.Main.startAnt(Main.java:187)
[java] 	at org.apache.tools.ant.launch.Launcher.run(Launcher.java:246)
[java] 	at org.apache.tools.ant.launch.Launcher.main(Launcher.java:67)
[java] Timeout: killed the sub-process
[java] 	at org.apache.tools.ant.taskdefs.Java.fork(Java.java:754)
[java] 	at org.apache.tools.ant.taskdefs.Java.executeJava(Java.java:171)
[java] 	at org.apache.tools.ant.taskdefs.Java.execute(Java.java:84)
[java] 	at org.apache.tools.ant.UnknownElement.execute(UnknownElement.java:275)
[java] 	at org.apache.tools.ant.Task.perform(Task.java:364)
[java] 	at org.apache.tools.ant.taskdefs.Sequential.execute(Sequential.java:64)
[java] 	at net.sf.antcontrib.logic.IfTask.execute(IfTask.java:197)
[java] 	at sun.reflect.GeneratedMethodAccessor5.invoke(Unknown Source)
[java] 	at sun.reflect.DelegatingMethodAccessorImpl.invoke(DelegatingMethodAccessorImpl.java:25)
[java] 	at java.lang.reflect.Method.invoke(Method.java:585)
[java] 	at org.apache.tools.ant.TaskAdapter.execute(TaskAdapter.java:123)
[java] 	at org.apache.tools.ant.UnknownElement.execute(UnknownElement.java:275)
[java] 	at org.apache.tools.ant.Task.perform(Task.java:364)
[java] 	at org.apache.tools.ant.taskdefs.Sequential.execute(Sequential.java:64)
[java] 	at org.apache.tools.ant.UnknownElement.execute(UnknownElement.java:275)
[java] 	at org.apache.tools.ant.Task.perform(Task.java:364)
[java] 	at org.apache.tools.ant.taskdefs.MacroInstance.execute(MacroInstance.java:378)
[java] 	at org.apache.tools.ant.UnknownElement.execute(UnknownElement.java:275)
[java] 	at org.apache.tools.ant.Task.perform(Task.java:364)
[java] 	at org.apache.tools.ant.Target.execute(Target.java:341)
[java] 	at org.apache.tools.ant.Target.performTasks(Target.java:369)
[java] 	at org.apache.tools.ant.Project.executeSortedTargets(Project.java:1216)
[java] 	at org.apache.tools.ant.Project.executeTarget(Project.java:1185)
[java] 	at org.apache.tools.ant.helper.DefaultExecutor.executeTargets(DefaultExecutor.java:40)
[java] 	at org.apache.tools.ant.Project.executeTargets(Project.java:1068)
[java] 	at org.apache.tools.ant.Main.runBuild(Main.java:668)
[java] 	at org.apache.tools.ant.Main.startAnt(Main.java:187)
[java] 	at org.apache.tools.ant.launch.Launcher.run(Launcher.java:246)
[java] 	at org.apache.tools.ant.launch.Launcher.main(Launcher.java:67)
[java] Timeout: killed the sub-process
[java] 	at org.apache.tools.ant.taskdefs.Java.fork(Java.java:754)
[java] 	at org.apache.tools.ant.taskdefs.Java.executeJava(Java.java:171)
[java] 	at org.apache.tools.ant.taskdefs.Java.execute(Java.java:84)
[java] 	at org.apache.tools.ant.UnknownElement.execute(UnknownElement.java:275)
[java] 	at org.apache.tools.ant.Task.perform(Task.java:364)
[java] 	at org.apache.tools.ant.taskdefs.Sequential.execute(Sequential.java:64)
[java] 	at net.sf.antcontrib.logic.IfTask.execute(IfTask.java:197)
[java] 	at sun.reflect.GeneratedMethodAccessor5.invoke(Unknown Source)
[java] 	at sun.reflect.DelegatingMethodAccessorImpl.invoke(DelegatingMethodAccessorImpl.java:25)
[java] 	at java.lang.reflect.Method.invoke(Method.java:585)
[java] 	at org.apache.tools.ant.TaskAdapter.execute(TaskAdapter.java:123)
[java] 	at org.apache.tools.ant.UnknownElement.execute(UnknownElement.java:275)
[java] 	at org.apache.tools.ant.Task.perform(Task.java:364)
[java] 	at org.apache.tools.ant.taskdefs.Sequential.execute(Sequential.java:64)
[java] 	at org.apache.tools.ant.UnknownElement.execute(UnknownElement.java:275)
[java] 	at org.apache.tools.ant.Task.perform(Task.java:364)
[java] 	at org.apache.tools.ant.taskdefs.MacroInstance.execute(MacroInstance.java:378)
[java] 	at org.apache.tools.ant.UnknownElement.execute(UnknownElement.java:275)
[java] 	at org.apache.tools.ant.Task.perform(Task.java:364)
[java] 	at org.apache.tools.ant.Target.execute(Target.java:341)
[java] 	at org.apache.tools.ant.Target.performTasks(Target.java:369)
[java] 	at org.apache.tools.ant.Project.executeSortedTargets(Project.java:1216)
[java] 	at org.apache.tools.ant.Project.executeTarget(Project.java:1185)
[java] 	at org.apache.tools.ant.helper.DefaultExecutor.executeTargets(DefaultExecutor.java:40)
[java] 	at org.apache.tools.ant.Project.executeTargets(Project.java:1068)
[java] 	at org.apache.tools.ant.Main.runBuild(Main.java:668)
[java] 	at org.apache.tools.ant.Main.startAnt(Main.java:187)
[java] 	at org.apache.tools.ant.launch.Launcher.run(Launcher.java:246)
[java] 	at org.apache.tools.ant.launch.Launcher.main(Launcher.java:67)
[java] Timeout: killed the sub-process
[java] 	at org.apache.tools.ant.taskdefs.Java.fork(Java.java:754)
[java] 	at org.apache.tools.ant.taskdefs.Java.executeJava(Java.java:171)
[java] 	at org.apache.tools.ant.taskdefs.Java.execute(Java.java:84)
[java] 	at org.apache.tools.ant.UnknownElement.execute(UnknownElement.java:275)
[java] 	at org.apache.tools.ant.Task.perform(Task.java:364)
[java] 	at org.apache.tools.ant.taskdefs.Sequential.execute(Sequential.java:64)
[java] 	at net.sf.antcontrib.logic.IfTask.execute(IfTask.java:197)
[java] 	at sun.reflect.GeneratedMethodAccessor5.invoke(Unknown Source)
[java] 	at sun.reflect.DelegatingMethodAccessorImpl.invoke(DelegatingMethodAccessorImpl.java:25)
[java] 	at java.lang.reflect.Method.invoke(Method.java:585)
[java] 	at org.apache.tools.ant.TaskAdapter.execute(TaskAdapter.java:123)
[java] 	at org.apache.tools.ant.UnknownElement.execute(UnknownElement.java:275)
[java] 	at org.apache.tools.ant.Task.perform(Task.java:364)
[java] 	at org.apache.tools.ant.taskdefs.Sequential.execute(Sequential.java:64)
[java] 	at org.apache.tools.ant.UnknownElement.execute(UnknownElement.java:275)
[java] 	at org.apache.tools.ant.Task.perform(Task.java:364)
[java] 	at org.apache.tools.ant.taskdefs.MacroInstance.execute(MacroInstance.java:378)
[java] 	at org.apache.tools.ant.UnknownElement.execute(UnknownElement.java:275)
[java] 	at org.apache.tools.ant.Task.perform(Task.java:364)
[java] 	at org.apache.tools.ant.Target.execute(Target.java:341)
[java] 	at org.apache.tools.ant.Target.performTasks(Target.java:369)
[java] 	at org.apache.tools.ant.Project.executeSortedTargets(Project.java:1216)
[java] 	at org.apache.tools.ant.Project.executeTarget(Project.java:1185)
[java] 	at org.apache.tools.ant.helper.DefaultExecutor.executeTargets(DefaultExecutor.java:40)
[java] 	at org.apache.tools.ant.Project.executeTargets(Project.java:1068)
[java] 	at org.apache.tools.ant.Main.runBuild(Main.java:668)
[java] 	at org.apache.tools.ant.Main.startAnt(Main.java:187)
[java] 	at org.apache.tools.ant.launch.Launcher.run(Launcher.java:246)
[java] 	at org.apache.tools.ant.launch.Launcher.main(Launcher.java:67)
[java] Java Result: 104
[java] Timeout: killed the sub-process
[java] 	at org.apache.tools.ant.taskdefs.Java.fork(Java.java:754)
[java] 	at org.apache.tools.ant.taskdefs.Java.executeJava(Java.java:171)
[java] 	at org.apache.tools.ant.taskdefs.Java.execute(Java.java:84)
[java] 	at org.apache.tools.ant.UnknownElement.execute(UnknownElement.java:275)
[java] 	at org.apache.tools.ant.Task.perform(Task.java:364)
[java] 	at org.apache.tools.ant.taskdefs.Sequential.execute(Sequential.java:64)
[java] 	at net.sf.antcontrib.logic.IfTask.execute(IfTask.java:197)
[java] 	at sun.reflect.GeneratedMethodAccessor5.invoke(Unknown Source)
[java] 	at sun.reflect.DelegatingMethodAccessorImpl.invoke(DelegatingMethodAccessorImpl.java:25)
[java] 	at java.lang.reflect.Method.invoke(Method.java:585)
[java] 	at org.apache.tools.ant.TaskAdapter.execute(TaskAdapter.java:123)
[java] 	at org.apache.tools.ant.UnknownElement.execute(UnknownElement.java:275)
[java] 	at org.apache.tools.ant.Task.perform(Task.java:364)
[java] 	at org.apache.tools.ant.taskdefs.Sequential.execute(Sequential.java:64)
[java] 	at org.apache.tools.ant.UnknownElement.execute(UnknownElement.java:275)
[java] 	at org.apache.tools.ant.Task.perform(Task.java:364)
[java] 	at org.apache.tools.ant.taskdefs.MacroInstance.execute(MacroInstance.java:378)
[java] 	at org.apache.tools.ant.UnknownElement.execute(UnknownElement.java:275)
[java] 	at org.apache.tools.ant.Task.perform(Task.java:364)
[java] 	at org.apache.tools.ant.Target.execute(Target.java:341)
[java] 	at org.apache.tools.ant.Target.performTasks(Target.java:369)
[java] 	at org.apache.tools.ant.Project.executeSortedTargets(Project.java:1216)
[java] 	at org.apache.tools.ant.Project.executeTarget(Project.java:1185)
[java] 	at org.apache.tools.ant.helper.DefaultExecutor.executeTargets(DefaultExecutor.java:40)
[java] 	at org.apache.tools.ant.Project.executeTargets(Project.java:1068)
[java] 	at org.apache.tools.ant.Main.runBuild(Main.java:668)
[java] 	at org.apache.tools.ant.Main.startAnt(Main.java:187)
[java] 	at org.apache.tools.ant.launch.Launcher.run(Launcher.java:246)
[java] 	at org.apache.tools.ant.launch.Launcher.main(Launcher.java:67)
[java] Timeout: killed the sub-process
[java] 	at org.apache.tools.ant.taskdefs.Java.fork(Java.java:754)
[java] 	at org.apache.tools.ant.taskdefs.Java.executeJava(Java.java:171)
[java] 	at org.apache.tools.ant.taskdefs.Java.execute(Java.java:84)
[java] 	at org.apache.tools.ant.UnknownElement.execute(UnknownElement.java:275)
[java] 	at org.apache.tools.ant.Task.perform(Task.java:364)
[java] 	at org.apache.tools.ant.taskdefs.Sequential.execute(Sequential.java:64)
[java] 	at net.sf.antcontrib.logic.IfTask.execute(IfTask.java:197)
[java] 	at sun.reflect.GeneratedMethodAccessor5.invoke(Unknown Source)
[java] 	at sun.reflect.DelegatingMethodAccessorImpl.invoke(DelegatingMethodAccessorImpl.java:25)
[java] 	at java.lang.reflect.Method.invoke(Method.java:585)
[java] 	at org.apache.tools.ant.TaskAdapter.execute(TaskAdapter.java:123)
[java] 	at org.apache.tools.ant.UnknownElement.execute(UnknownElement.java:275)
[java] 	at org.apache.tools.ant.Task.perform(Task.java:364)
[java] 	at org.apache.tools.ant.taskdefs.Sequential.execute(Sequential.java:64)
[java] 	at org.apache.tools.ant.UnknownElement.execute(UnknownElement.java:275)
[java] 	at org.apache.tools.ant.Task.perform(Task.java:364)
[java] 	at org.apache.tools.ant.taskdefs.MacroInstance.execute(MacroInstance.java:378)
[java] 	at org.apache.tools.ant.UnknownElement.execute(UnknownElement.java:275)
[java] 	at org.apache.tools.ant.Task.perform(Task.java:364)
[java] 	at org.apache.tools.ant.Target.execute(Target.java:341)
[java] 	at org.apache.tools.ant.Target.performTasks(Target.java:369)
[java] 	at org.apache.tools.ant.Project.executeSortedTargets(Project.java:1216)
[java] 	at org.apache.tools.ant.Project.executeTarget(Project.java:1185)
[java] 	at org.apache.tools.ant.helper.DefaultExecutor.executeTargets(DefaultExecutor.java:40)
[java] 	at org.apache.tools.ant.Project.executeTargets(Project.java:1068)
[java] 	at org.apache.tools.ant.Main.runBuild(Main.java:668)
[java] 	at org.apache.tools.ant.Main.startAnt(Main.java:187)
[java] 	at org.apache.tools.ant.launch.Launcher.run(Launcher.java:246)
[java] 	at org.apache.tools.ant.launch.Launcher.main(Launcher.java:67)
[java] Timeout: killed the sub-process
[java] 	at org.apache.tools.ant.taskdefs.Java.fork(Java.java:754)
[java] 	at org.apache.tools.ant.taskdefs.Java.executeJava(Java.java:171)
[java] 	at org.apache.tools.ant.taskdefs.Java.execute(Java.java:84)
[java] 	at org.apache.tools.ant.UnknownElement.execute(UnknownElement.java:275)
[java] 	at org.apache.tools.ant.Task.perform(Task.java:364)
[java] 	at org.apache.tools.ant.taskdefs.Sequential.execute(Sequential.java:64)
[java] 	at net.sf.antcontrib.logic.IfTask.execute(IfTask.java:197)
[java] 	at sun.reflect.GeneratedMethodAccessor5.invoke(Unknown Source)
[java] 	at sun.reflect.DelegatingMethodAccessorImpl.invoke(DelegatingMethodAccessorImpl.java:25)
[java] 	at java.lang.reflect.Method.invoke(Method.java:585)
[java] 	at org.apache.tools.ant.TaskAdapter.execute(TaskAdapter.java:123)
[java] 	at org.apache.tools.ant.UnknownElement.execute(UnknownElement.java:275)
[java] 	at org.apache.tools.ant.Task.perform(Task.java:364)
[java] 	at org.apache.tools.ant.taskdefs.Sequential.execute(Sequential.java:64)
[java] 	at org.apache.tools.ant.UnknownElement.execute(UnknownElement.java:275)
[java] 	at org.apache.tools.ant.Task.perform(Task.java:364)
[java] 	at org.apache.tools.ant.taskdefs.MacroInstance.execute(MacroInstance.java:378)
[java] 	at org.apache.tools.ant.UnknownElement.execute(UnknownElement.java:275)
[java] 	at org.apache.tools.ant.Task.perform(Task.java:364)
[java] 	at org.apache.tools.ant.Target.execute(Target.java:341)
[java] 	at org.apache.tools.ant.Target.performTasks(Target.java:369)
[java] 	at org.apache.tools.ant.Project.executeSortedTargets(Project.java:1216)
[java] 	at org.apache.tools.ant.Project.executeTarget(Project.java:1185)
[java] 	at org.apache.tools.ant.helper.DefaultExecutor.executeTargets(DefaultExecutor.java:40)
[java] 	at org.apache.tools.ant.Project.executeTargets(Project.java:1068)
[java] 	at org.apache.tools.ant.Main.runBuild(Main.java:668)
[java] 	at org.apache.tools.ant.Main.startAnt(Main.java:187)
[java] 	at org.apache.tools.ant.launch.Launcher.run(Launcher.java:246)
[java] 	at org.apache.tools.ant.launch.Launcher.main(Launcher.java:67)
[java] Timeout: killed the sub-process
[java] 	at org.apache.tools.ant.taskdefs.Java.fork(Java.java:754)
[java] 	at org.apache.tools.ant.taskdefs.Java.executeJava(Java.java:171)
[java] 	at org.apache.tools.ant.taskdefs.Java.execute(Java.java:84)
[java] 	at org.apache.tools.ant.UnknownElement.execute(UnknownElement.java:275)
[java] 	at org.apache.tools.ant.Task.perform(Task.java:364)
[java] 	at org.apache.tools.ant.taskdefs.Sequential.execute(Sequential.java:64)
[java] 	at net.sf.antcontrib.logic.IfTask.execute(IfTask.java:197)
[java] 	at sun.reflect.GeneratedMethodAccessor5.invoke(Unknown Source)
[java] 	at sun.reflect.DelegatingMethodAccessorImpl.invoke(DelegatingMethodAccessorImpl.java:25)
[java] 	at java.lang.reflect.Method.invoke(Method.java:585)
[java] 	at org.apache.tools.ant.TaskAdapter.execute(TaskAdapter.java:123)
[java] 	at org.apache.tools.ant.UnknownElement.execute(UnknownElement.java:275)
[java] 	at org.apache.tools.ant.Task.perform(Task.java:364)
[java] 	at org.apache.tools.ant.taskdefs.Sequential.execute(Sequential.java:64)
[java] 	at org.apache.tools.ant.UnknownElement.execute(UnknownElement.java:275)
[java] 	at org.apache.tools.ant.Task.perform(Task.java:364)
[java] 	at org.apache.tools.ant.taskdefs.MacroInstance.execute(MacroInstance.java:378)
[java] 	at org.apache.tools.ant.UnknownElement.execute(UnknownElement.java:275)
[java] 	at org.apache.tools.ant.Task.perform(Task.java:364)
[java] 	at org.apache.tools.ant.Target.execute(Target.java:341)
[java] 	at org.apache.tools.ant.Target.performTasks(Target.java:369)
[java] 	at org.apache.tools.ant.Project.executeSortedTargets(Project.java:1216)
[java] 	at org.apache.tools.ant.Project.executeTarget(Project.java:1185)
[java] 	at org.apache.tools.ant.helper.DefaultExecutor.executeTargets(DefaultExecutor.java:40)
[java] 	at org.apache.tools.ant.Project.executeTargets(Project.java:1068)
[java] 	at org.apache.tools.ant.Main.runBuild(Main.java:668)
[java] 	at org.apache.tools.ant.Main.startAnt(Main.java:187)
[java] 	at org.apache.tools.ant.launch.Launcher.run(Launcher.java:246)
[java] 	at org.apache.tools.ant.launch.Launcher.main(Launcher.java:67)
[java] Java Result: 104
[java] Timeout: killed the sub-process
[java] 	at org.apache.tools.ant.taskdefs.Java.fork(Java.java:754)
[java] 	at org.apache.tools.ant.taskdefs.Java.executeJava(Java.java:171)
[java] 	at org.apache.tools.ant.taskdefs.Java.execute(Java.java:84)
[java] 	at org.apache.tools.ant.UnknownElement.execute(UnknownElement.java:275)
[java] 	at org.apache.tools.ant.Task.perform(Task.java:364)
[java] 	at org.apache.tools.ant.taskdefs.Sequential.execute(Sequential.java:64)
[java] 	at net.sf.antcontrib.logic.IfTask.execute(IfTask.java:197)
[java] 	at sun.reflect.GeneratedMethodAccessor5.invoke(Unknown Source)
[java] 	at sun.reflect.DelegatingMethodAccessorImpl.invoke(DelegatingMethodAccessorImpl.java:25)
[java] 	at java.lang.reflect.Method.invoke(Method.java:585)
[java] 	at org.apache.tools.ant.TaskAdapter.execute(TaskAdapter.java:123)
[java] 	at org.apache.tools.ant.UnknownElement.execute(UnknownElement.java:275)
[java] 	at org.apache.tools.ant.Task.perform(Task.java:364)
[java] 	at org.apache.tools.ant.taskdefs.Sequential.execute(Sequential.java:64)
[java] 	at org.apache.tools.ant.UnknownElement.execute(UnknownElement.java:275)
[java] 	at org.apache.tools.ant.Task.perform(Task.java:364)
[java] 	at org.apache.tools.ant.taskdefs.MacroInstance.execute(MacroInstance.java:378)
[java] 	at org.apache.tools.ant.UnknownElement.execute(UnknownElement.java:275)
[java] 	at org.apache.tools.ant.Task.perform(Task.java:364)
[java] 	at org.apache.tools.ant.Target.execute(Target.java:341)
[java] 	at org.apache.tools.ant.Target.performTasks(Target.java:369)
[java] 	at org.apache.tools.ant.Project.executeSortedTargets(Project.java:1216)
[java] 	at org.apache.tools.ant.Project.executeTarget(Project.java:1185)
[java] 	at org.apache.tools.ant.helper.DefaultExecutor.executeTargets(DefaultExecutor.java:40)
[java] 	at org.apache.tools.ant.Project.executeTargets(Project.java:1068)
[java] 	at org.apache.tools.ant.Main.runBuild(Main.java:668)
[java] 	at org.apache.tools.ant.Main.startAnt(Main.java:187)
[java] 	at org.apache.tools.ant.launch.Launcher.run(Launcher.java:246)
[java] 	at org.apache.tools.ant.launch.Launcher.main(Launcher.java:67)
[java] Java Result: 104
[java] Java Result: 104
[java] Java Result: 104
[java] Timeout: killed the sub-process
[java] 	at org.apache.tools.ant.taskdefs.Java.fork(Java.java:754)
[java] 	at org.apache.tools.ant.taskdefs.Java.executeJava(Java.java:171)
[java] 	at org.apache.tools.ant.taskdefs.Java.execute(Java.java:84)
[java] 	at org.apache.tools.ant.UnknownElement.execute(UnknownElement.java:275)
[java] 	at org.apache.tools.ant.Task.perform(Task.java:364)
[java] 	at org.apache.tools.ant.taskdefs.Sequential.execute(Sequential.java:64)
[java] 	at net.sf.antcontrib.logic.IfTask.execute(IfTask.java:197)
[java] 	at sun.reflect.GeneratedMethodAccessor5.invoke(Unknown Source)
[java] 	at sun.reflect.DelegatingMethodAccessorImpl.invoke(DelegatingMethodAccessorImpl.java:25)
[java] 	at java.lang.reflect.Method.invoke(Method.java:585)
[java] 	at org.apache.tools.ant.TaskAdapter.execute(TaskAdapter.java:123)
[java] 	at org.apache.tools.ant.UnknownElement.execute(UnknownElement.java:275)
[java] 	at org.apache.tools.ant.Task.perform(Task.java:364)
[java] 	at org.apache.tools.ant.taskdefs.Sequential.execute(Sequential.java:64)
[java] 	at org.apache.tools.ant.UnknownElement.execute(UnknownElement.java:275)
[java] 	at org.apache.tools.ant.Task.perform(Task.java:364)
[java] 	at org.apache.tools.ant.taskdefs.MacroInstance.execute(MacroInstance.java:378)
[java] 	at org.apache.tools.ant.UnknownElement.execute(UnknownElement.java:275)
[java] 	at org.apache.tools.ant.Task.perform(Task.java:364)
[java] 	at org.apache.tools.ant.Target.execute(Target.java:341)
[java] 	at org.apache.tools.ant.Target.performTasks(Target.java:369)
[java] 	at org.apache.tools.ant.Project.executeSortedTargets(Project.java:1216)
[java] 	at org.apache.tools.ant.Project.executeTarget(Project.java:1185)
[java] 	at org.apache.tools.ant.helper.DefaultExecutor.executeTargets(DefaultExecutor.java:40)
[java] 	at org.apache.tools.ant.Project.executeTargets(Project.java:1068)
[java] 	at org.apache.tools.ant.Main.runBuild(Main.java:668)
[java] 	at org.apache.tools.ant.Main.startAnt(Main.java:187)
[java] 	at org.apache.tools.ant.launch.Launcher.run(Launcher.java:246)
[java] 	at org.apache.tools.ant.launch.Launcher.main(Launcher.java:67)
[java] Java Result: 104
[java] Timeout: killed the sub-process
[java] 	at org.apache.tools.ant.taskdefs.Java.fork(Java.java:754)
[java] 	at org.apache.tools.ant.taskdefs.Java.executeJava(Java.java:171)
[java] 	at org.apache.tools.ant.taskdefs.Java.execute(Java.java:84)
[java] 	at org.apache.tools.ant.UnknownElement.execute(UnknownElement.java:275)
[java] 	at org.apache.tools.ant.Task.perform(Task.java:364)
[java] 	at org.apache.tools.ant.taskdefs.Sequential.execute(Sequential.java:64)
[java] 	at net.sf.antcontrib.logic.IfTask.execute(IfTask.java:197)
[java] 	at sun.reflect.GeneratedMethodAccessor5.invoke(Unknown Source)
[java] 	at sun.reflect.DelegatingMethodAccessorImpl.invoke(DelegatingMethodAccessorImpl.java:25)
[java] 	at java.lang.reflect.Method.invoke(Method.java:585)
[java] 	at org.apache.tools.ant.TaskAdapter.execute(TaskAdapter.java:123)
[java] 	at org.apache.tools.ant.UnknownElement.execute(UnknownElement.java:275)
[java] 	at org.apache.tools.ant.Task.perform(Task.java:364)
[java] 	at org.apache.tools.ant.taskdefs.Sequential.execute(Sequential.java:64)
[java] 	at org.apache.tools.ant.UnknownElement.execute(UnknownElement.java:275)
[java] 	at org.apache.tools.ant.Task.perform(Task.java:364)
[java] 	at org.apache.tools.ant.taskdefs.MacroInstance.execute(MacroInstance.java:378)
[java] 	at org.apache.tools.ant.UnknownElement.execute(UnknownElement.java:275)
[java] 	at org.apache.tools.ant.Task.perform(Task.java:364)
[java] 	at org.apache.tools.ant.Target.execute(Target.java:341)
[java] 	at org.apache.tools.ant.Target.performTasks(Target.java:369)
[java] 	at org.apache.tools.ant.Project.executeSortedTargets(Project.java:1216)
[java] 	at org.apache.tools.ant.Project.executeTarget(Project.java:1185)
[java] 	at org.apache.tools.ant.helper.DefaultExecutor.executeTargets(DefaultExecutor.java:40)
[java] 	at org.apache.tools.ant.Project.executeTargets(Project.java:1068)
[java] 	at org.apache.tools.ant.Main.runBuild(Main.java:668)
[java] 	at org.apache.tools.ant.Main.startAnt(Main.java:187)
[java] 	at org.apache.tools.ant.launch.Launcher.run(Launcher.java:246)
[java] 	at org.apache.tools.ant.launch.Launcher.main(Launcher.java:67)
[java] Java Result: 104
[java] Java Result: 104
[java] Java Result: 105
[java] Java Result: 104
[java] Java Result: 104
[java] Java Result: 104
[java] Java Result: 104
[java] Java Result: 104
[java] Java Result: 104
[java] Java Result: 104
[java] Java Result: 104
[java] Java Result: 104
[java] Java Result: 104
[java] Java Result: 104
[java] Java Result: 104
[java] Java Result: 104
[java] Java Result: 104
[java] Java Result: 104
[java] Java Result: 104
[java] Timeout: killed the sub-process
[java] 	at org.apache.tools.ant.taskdefs.Java.fork(Java.java:754)
[java] 	at org.apache.tools.ant.taskdefs.Java.executeJava(Java.java:171)
[java] 	at org.apache.tools.ant.taskdefs.Java.execute(Java.java:84)
[java] 	at org.apache.tools.ant.UnknownElement.execute(UnknownElement.java:275)
[java] 	at org.apache.tools.ant.Task.perform(Task.java:364)
[java] 	at org.apache.tools.ant.taskdefs.Sequential.execute(Sequential.java:64)
[java] 	at net.sf.antcontrib.logic.IfTask.execute(IfTask.java:197)
[java] 	at sun.reflect.GeneratedMethodAccessor5.invoke(Unknown Source)
[java] 	at sun.reflect.DelegatingMethodAccessorImpl.invoke(DelegatingMethodAccessorImpl.java:25)
[java] 	at java.lang.reflect.Method.invoke(Method.java:585)
[java] 	at org.apache.tools.ant.TaskAdapter.execute(TaskAdapter.java:123)
[java] 	at org.apache.tools.ant.UnknownElement.execute(UnknownElement.java:275)
[java] 	at org.apache.tools.ant.Task.perform(Task.java:364)
[java] 	at org.apache.tools.ant.taskdefs.Sequential.execute(Sequential.java:64)
[java] 	at org.apache.tools.ant.UnknownElement.execute(UnknownElement.java:275)
[java] 	at org.apache.tools.ant.Task.perform(Task.java:364)
[java] 	at org.apache.tools.ant.taskdefs.MacroInstance.execute(MacroInstance.java:378)
[java] 	at org.apache.tools.ant.UnknownElement.execute(UnknownElement.java:275)
[java] 	at org.apache.tools.ant.Task.perform(Task.java:364)
[java] 	at org.apache.tools.ant.Target.execute(Target.java:341)
[java] 	at org.apache.tools.ant.Target.performTasks(Target.java:369)
[java] 	at org.apache.tools.ant.Project.executeSortedTargets(Project.java:1216)
[java] 	at org.apache.tools.ant.Project.executeTarget(Project.java:1185)
[java] 	at org.apache.tools.ant.helper.DefaultExecutor.executeTargets(DefaultExecutor.java:40)
[java] 	at org.apache.tools.ant.Project.executeTargets(Project.java:1068)
[java] 	at org.apache.tools.ant.Main.runBuild(Main.java:668)
[java] 	at org.apache.tools.ant.Main.startAnt(Main.java:187)
[java] 	at org.apache.tools.ant.launch.Launcher.run(Launcher.java:246)
[java] 	at org.apache.tools.ant.launch.Launcher.main(Launcher.java:67)
[java] Java Result: 139
[java] Timeout: killed the sub-process
[java] 	at org.apache.tools.ant.taskdefs.Java.fork(Java.java:754)
[java] 	at org.apache.tools.ant.taskdefs.Java.executeJava(Java.java:171)
[java] 	at org.apache.tools.ant.taskdefs.Java.execute(Java.java:84)
[java] 	at org.apache.tools.ant.UnknownElement.execute(UnknownElement.java:275)
[java] 	at org.apache.tools.ant.Task.perform(Task.java:364)
[java] 	at org.apache.tools.ant.taskdefs.Sequential.execute(Sequential.java:64)
[java] 	at net.sf.antcontrib.logic.IfTask.execute(IfTask.java:197)
[java] 	at sun.reflect.GeneratedMethodAccessor5.invoke(Unknown Source)
[java] 	at sun.reflect.DelegatingMethodAccessorImpl.invoke(DelegatingMethodAccessorImpl.java:25)
[java] 	at java.lang.reflect.Method.invoke(Method.java:585)
[java] 	at org.apache.tools.ant.TaskAdapter.execute(TaskAdapter.java:123)
[java] 	at org.apache.tools.ant.UnknownElement.execute(UnknownElement.java:275)
[java] 	at org.apache.tools.ant.Task.perform(Task.java:364)
[java] 	at org.apache.tools.ant.taskdefs.Sequential.execute(Sequential.java:64)
[java] 	at org.apache.tools.ant.UnknownElement.execute(UnknownElement.java:275)
[java] 	at org.apache.tools.ant.Task.perform(Task.java:364)
[java] 	at org.apache.tools.ant.taskdefs.MacroInstance.execute(MacroInstance.java:378)
[java] 	at org.apache.tools.ant.UnknownElement.execute(UnknownElement.java:275)
[java] 	at org.apache.tools.ant.Task.perform(Task.java:364)
[java] 	at org.apache.tools.ant.Target.execute(Target.java:341)
[java] 	at org.apache.tools.ant.Target.performTasks(Target.java:369)
[java] 	at org.apache.tools.ant.Project.executeSortedTargets(Project.java:1216)
[java] 	at org.apache.tools.ant.Project.executeTarget(Project.java:1185)
[java] 	at org.apache.tools.ant.helper.DefaultExecutor.executeTargets(DefaultExecutor.java:40)
[java] 	at org.apache.tools.ant.Project.executeTargets(Project.java:1068)
[java] 	at org.apache.tools.ant.Main.runBuild(Main.java:668)
[java] 	at org.apache.tools.ant.Main.startAnt(Main.java:187)
[java] 	at org.apache.tools.ant.launch.Launcher.run(Launcher.java:246)
[java] 	at org.apache.tools.ant.launch.Launcher.main(Launcher.java:67)
[java] Timeout: killed the sub-process
[java] 	at org.apache.tools.ant.taskdefs.Java.fork(Java.java:754)
[java] 	at org.apache.tools.ant.taskdefs.Java.executeJava(Java.java:171)
[java] 	at org.apache.tools.ant.taskdefs.Java.execute(Java.java:84)
[java] 	at org.apache.tools.ant.UnknownElement.execute(UnknownElement.java:275)
[java] 	at org.apache.tools.ant.Task.perform(Task.java:364)
[java] 	at org.apache.tools.ant.taskdefs.Sequential.execute(Sequential.java:64)
[java] 	at net.sf.antcontrib.logic.IfTask.execute(IfTask.java:197)
[java] 	at sun.reflect.GeneratedMethodAccessor5.invoke(Unknown Source)
[java] 	at sun.reflect.DelegatingMethodAccessorImpl.invoke(DelegatingMethodAccessorImpl.java:25)
[java] 	at java.lang.reflect.Method.invoke(Method.java:585)
[java] 	at org.apache.tools.ant.TaskAdapter.execute(TaskAdapter.java:123)
[java] 	at org.apache.tools.ant.UnknownElement.execute(UnknownElement.java:275)
[java] 	at org.apache.tools.ant.Task.perform(Task.java:364)
[java] 	at org.apache.tools.ant.taskdefs.Sequential.execute(Sequential.java:64)
[java] 	at org.apache.tools.ant.UnknownElement.execute(UnknownElement.java:275)
[java] 	at org.apache.tools.ant.Task.perform(Task.java:364)
[java] 	at org.apache.tools.ant.taskdefs.MacroInstance.execute(MacroInstance.java:378)
[java] 	at org.apache.tools.ant.UnknownElement.execute(UnknownElement.java:275)
[java] 	at org.apache.tools.ant.Task.perform(Task.java:364)
[java] 	at org.apache.tools.ant.Target.execute(Target.java:341)
[java] 	at org.apache.tools.ant.Target.performTasks(Target.java:369)
[java] 	at org.apache.tools.ant.Project.executeSortedTargets(Project.java:1216)
[java] 	at org.apache.tools.ant.Project.executeTarget(Project.java:1185)
[java] 	at org.apache.tools.ant.helper.DefaultExecutor.executeTargets(DefaultExecutor.java:40)
[java] 	at org.apache.tools.ant.Project.executeTargets(Project.java:1068)
[java] 	at org.apache.tools.ant.Main.runBuild(Main.java:668)
[java] 	at org.apache.tools.ant.Main.startAnt(Main.java:187)
[java] 	at org.apache.tools.ant.launch.Launcher.run(Launcher.java:246)
[java] 	at org.apache.tools.ant.launch.Launcher.main(Launcher.java:67)
[java] Java Result: 104
[java] Timeout: killed the sub-process
[java] 	at org.apache.tools.ant.taskdefs.Java.fork(Java.java:754)
[java] 	at org.apache.tools.ant.taskdefs.Java.executeJava(Java.java:171)
[java] 	at org.apache.tools.ant.taskdefs.Java.execute(Java.java:84)
[java] 	at org.apache.tools.ant.UnknownElement.execute(UnknownElement.java:275)
[java] 	at org.apache.tools.ant.Task.perform(Task.java:364)
[java] 	at org.apache.tools.ant.taskdefs.Sequential.execute(Sequential.java:64)
[java] 	at net.sf.antcontrib.logic.IfTask.execute(IfTask.java:197)
[java] 	at sun.reflect.GeneratedMethodAccessor5.invoke(Unknown Source)
[java] 	at sun.reflect.DelegatingMethodAccessorImpl.invoke(DelegatingMethodAccessorImpl.java:25)
[java] 	at java.lang.reflect.Method.invoke(Method.java:585)
[java] 	at org.apache.tools.ant.TaskAdapter.execute(TaskAdapter.java:123)
[java] 	at org.apache.tools.ant.UnknownElement.execute(UnknownElement.java:275)
[java] 	at org.apache.tools.ant.Task.perform(Task.java:364)
[java] 	at org.apache.tools.ant.taskdefs.Sequential.execute(Sequential.java:64)
[java] 	at org.apache.tools.ant.UnknownElement.execute(UnknownElement.java:275)
[java] 	at org.apache.tools.ant.Task.perform(Task.java:364)
[java] 	at org.apache.tools.ant.taskdefs.MacroInstance.execute(MacroInstance.java:378)
[java] 	at org.apache.tools.ant.UnknownElement.execute(UnknownElement.java:275)
[java] 	at org.apache.tools.ant.Task.perform(Task.java:364)
[java] 	at org.apache.tools.ant.Target.execute(Target.java:341)
[java] 	at org.apache.tools.ant.Target.performTasks(Target.java:369)
[java] 	at org.apache.tools.ant.Project.executeSortedTargets(Project.java:1216)
[java] 	at org.apache.tools.ant.Project.executeTarget(Project.java:1185)
[java] 	at org.apache.tools.ant.helper.DefaultExecutor.executeTargets(DefaultExecutor.java:40)
[java] 	at org.apache.tools.ant.Project.executeTargets(Project.java:1068)
[java] 	at org.apache.tools.ant.Main.runBuild(Main.java:668)
[java] 	at org.apache.tools.ant.Main.startAnt(Main.java:187)
[java] 	at org.apache.tools.ant.launch.Launcher.run(Launcher.java:246)
[java] 	at org.apache.tools.ant.launch.Launcher.main(Launcher.java:67)
[java] Java Result: 104
[java] Timeout: killed the sub-process
[java] 	at org.apache.tools.ant.taskdefs.Java.fork(Java.java:754)
[java] 	at org.apache.tools.ant.taskdefs.Java.executeJava(Java.java:171)
[java] 	at org.apache.tools.ant.taskdefs.Java.execute(Java.java:84)
[java] 	at org.apache.tools.ant.UnknownElement.execute(UnknownElement.java:275)
[java] 	at org.apache.tools.ant.Task.perform(Task.java:364)
[java] 	at org.apache.tools.ant.taskdefs.Sequential.execute(Sequential.java:64)
[java] 	at net.sf.antcontrib.logic.IfTask.execute(IfTask.java:197)
[java] 	at sun.reflect.GeneratedMethodAccessor5.invoke(Unknown Source)
[java] 	at sun.reflect.DelegatingMethodAccessorImpl.invoke(DelegatingMethodAccessorImpl.java:25)
[java] 	at java.lang.reflect.Method.invoke(Method.java:585)
[java] 	at org.apache.tools.ant.TaskAdapter.execute(TaskAdapter.java:123)
[java] 	at org.apache.tools.ant.UnknownElement.execute(UnknownElement.java:275)
[java] 	at org.apache.tools.ant.Task.perform(Task.java:364)
[java] 	at org.apache.tools.ant.taskdefs.Sequential.execute(Sequential.java:64)
[java] 	at org.apache.tools.ant.UnknownElement.execute(UnknownElement.java:275)
[java] 	at org.apache.tools.ant.Task.perform(Task.java:364)
[java] 	at org.apache.tools.ant.taskdefs.MacroInstance.execute(MacroInstance.java:378)
[java] 	at org.apache.tools.ant.UnknownElement.execute(UnknownElement.java:275)
[java] 	at org.apache.tools.ant.Task.perform(Task.java:364)
[java] 	at org.apache.tools.ant.Target.execute(Target.java:341)
[java] 	at org.apache.tools.ant.Target.performTasks(Target.java:369)
[java] 	at org.apache.tools.ant.Project.executeSortedTargets(Project.java:1216)
[java] 	at org.apache.tools.ant.Project.executeTarget(Project.java:1185)
[java] 	at org.apache.tools.ant.helper.DefaultExecutor.executeTargets(DefaultExecutor.java:40)
[java] 	at org.apache.tools.ant.Project.executeTargets(Project.java:1068)
[java] 	at org.apache.tools.ant.Main.runBuild(Main.java:668)
[java] 	at org.apache.tools.ant.Main.startAnt(Main.java:187)
[java] 	at org.apache.tools.ant.launch.Launcher.run(Launcher.java:246)
[java] 	at org.apache.tools.ant.launch.Launcher.main(Launcher.java:67)
[java] Java Result: 104
[java] Timeout: killed the sub-process
[java] 	at org.apache.tools.ant.taskdefs.Java.fork(Java.java:754)
[java] 	at org.apache.tools.ant.taskdefs.Java.executeJava(Java.java:171)
[java] 	at org.apache.tools.ant.taskdefs.Java.execute(Java.java:84)
[java] 	at org.apache.tools.ant.UnknownElement.execute(UnknownElement.java:275)
[java] 	at org.apache.tools.ant.Task.perform(Task.java:364)
[java] 	at org.apache.tools.ant.taskdefs.Sequential.execute(Sequential.java:64)
[java] 	at net.sf.antcontrib.logic.IfTask.execute(IfTask.java:197)
[java] 	at sun.reflect.GeneratedMethodAccessor5.invoke(Unknown Source)
[java] 	at sun.reflect.DelegatingMethodAccessorImpl.invoke(DelegatingMethodAccessorImpl.java:25)
[java] 	at java.lang.reflect.Method.invoke(Method.java:585)
[java] 	at org.apache.tools.ant.TaskAdapter.execute(TaskAdapter.java:123)
[java] 	at org.apache.tools.ant.UnknownElement.execute(UnknownElement.java:275)
[java] 	at org.apache.tools.ant.Task.perform(Task.java:364)
[java] 	at org.apache.tools.ant.taskdefs.Sequential.execute(Sequential.java:64)
[java] 	at org.apache.tools.ant.UnknownElement.execute(UnknownElement.java:275)
[java] 	at org.apache.tools.ant.Task.perform(Task.java:364)
[java] 	at org.apache.tools.ant.taskdefs.MacroInstance.execute(MacroInstance.java:378)
[java] 	at org.apache.tools.ant.UnknownElement.execute(UnknownElement.java:275)
[java] 	at org.apache.tools.ant.Task.perform(Task.java:364)
[java] 	at org.apache.tools.ant.Target.execute(Target.java:341)
[java] 	at org.apache.tools.ant.Target.performTasks(Target.java:369)
[java] 	at org.apache.tools.ant.Project.executeSortedTargets(Project.java:1216)
[java] 	at org.apache.tools.ant.Project.executeTarget(Project.java:1185)
[java] 	at org.apache.tools.ant.helper.DefaultExecutor.executeTargets(DefaultExecutor.java:40)
[java] 	at org.apache.tools.ant.Project.executeTargets(Project.java:1068)
[java] 	at org.apache.tools.ant.Main.runBuild(Main.java:668)
[java] 	at org.apache.tools.ant.Main.startAnt(Main.java:187)
[java] 	at org.apache.tools.ant.launch.Launcher.run(Launcher.java:246)
[java] 	at org.apache.tools.ant.launch.Launcher.main(Launcher.java:67)
[java] Timeout: killed the sub-process
[java] 	at org.apache.tools.ant.taskdefs.Java.fork(Java.java:754)
[java] 	at org.apache.tools.ant.taskdefs.Java.executeJava(Java.java:171)
[java] 	at org.apache.tools.ant.taskdefs.Java.execute(Java.java:84)
[java] 	at org.apache.tools.ant.UnknownElement.execute(UnknownElement.java:275)
[java] 	at org.apache.tools.ant.Task.perform(Task.java:364)
[java] 	at org.apache.tools.ant.taskdefs.Sequential.execute(Sequential.java:64)
[java] 	at net.sf.antcontrib.logic.IfTask.execute(IfTask.java:197)
[java] 	at sun.reflect.GeneratedMethodAccessor5.invoke(Unknown Source)
[java] 	at sun.reflect.DelegatingMethodAccessorImpl.invoke(DelegatingMethodAccessorImpl.java:25)
[java] 	at java.lang.reflect.Method.invoke(Method.java:585)
[java] 	at org.apache.tools.ant.TaskAdapter.execute(TaskAdapter.java:123)
[java] 	at org.apache.tools.ant.UnknownElement.execute(UnknownElement.java:275)
[java] 	at org.apache.tools.ant.Task.perform(Task.java:364)
[java] 	at org.apache.tools.ant.taskdefs.Sequential.execute(Sequential.java:64)
[java] 	at org.apache.tools.ant.UnknownElement.execute(UnknownElement.java:275)
[java] 	at org.apache.tools.ant.Task.perform(Task.java:364)
[java] 	at org.apache.tools.ant.taskdefs.MacroInstance.execute(MacroInstance.java:378)
[java] 	at org.apache.tools.ant.UnknownElement.execute(UnknownElement.java:275)
[java] 	at org.apache.tools.ant.Task.perform(Task.java:364)
[java] 	at org.apache.tools.ant.Target.execute(Target.java:341)
[java] 	at org.apache.tools.ant.Target.performTasks(Target.java:369)
[java] 	at org.apache.tools.ant.Project.executeSortedTargets(Project.java:1216)
[java] 	at org.apache.tools.ant.Project.executeTarget(Project.java:1185)
[java] 	at org.apache.tools.ant.helper.DefaultExecutor.executeTargets(DefaultExecutor.java:40)
[java] 	at org.apache.tools.ant.Project.executeTargets(Project.java:1068)
[java] 	at org.apache.tools.ant.Main.runBuild(Main.java:668)
[java] 	at org.apache.tools.ant.Main.startAnt(Main.java:187)
[java] 	at org.apache.tools.ant.launch.Launcher.run(Launcher.java:246)
[java] 	at org.apache.tools.ant.launch.Launcher.main(Launcher.java:67)
[java] Java Result: 104
[java] Java Result: 104
[java] Timeout: killed the sub-process
[java] 	at org.apache.tools.ant.taskdefs.Java.fork(Java.java:754)
[java] 	at org.apache.tools.ant.taskdefs.Java.executeJava(Java.java:171)
[java] 	at org.apache.tools.ant.taskdefs.Java.execute(Java.java:84)
[java] 	at org.apache.tools.ant.UnknownElement.execute(UnknownElement.java:275)
[java] 	at org.apache.tools.ant.Task.perform(Task.java:364)
[java] 	at org.apache.tools.ant.taskdefs.Sequential.execute(Sequential.java:64)
[java] 	at net.sf.antcontrib.logic.IfTask.execute(IfTask.java:197)
[java] 	at sun.reflect.GeneratedMethodAccessor5.invoke(Unknown Source)
[java] 	at sun.reflect.DelegatingMethodAccessorImpl.invoke(DelegatingMethodAccessorImpl.java:25)
[java] 	at java.lang.reflect.Method.invoke(Method.java:585)
[java] 	at org.apache.tools.ant.TaskAdapter.execute(TaskAdapter.java:123)
[java] 	at org.apache.tools.ant.UnknownElement.execute(UnknownElement.java:275)
[java] 	at org.apache.tools.ant.Task.perform(Task.java:364)
[java] 	at org.apache.tools.ant.taskdefs.Sequential.execute(Sequential.java:64)
[java] 	at org.apache.tools.ant.UnknownElement.execute(UnknownElement.java:275)
[java] 	at org.apache.tools.ant.Task.perform(Task.java:364)
[java] 	at org.apache.tools.ant.taskdefs.MacroInstance.execute(MacroInstance.java:378)
[java] 	at org.apache.tools.ant.UnknownElement.execute(UnknownElement.java:275)
[java] 	at org.apache.tools.ant.Task.perform(Task.java:364)
[java] 	at org.apache.tools.ant.Target.execute(Target.java:341)
[java] 	at org.apache.tools.ant.Target.performTasks(Target.java:369)
[java] 	at org.apache.tools.ant.Project.executeSortedTargets(Project.java:1216)
[java] 	at org.apache.tools.ant.Project.executeTarget(Project.java:1185)
[java] 	at org.apache.tools.ant.helper.DefaultExecutor.executeTargets(DefaultExecutor.java:40)
[java] 	at org.apache.tools.ant.Project.executeTargets(Project.java:1068)
[java] 	at org.apache.tools.ant.Main.runBuild(Main.java:668)
[java] 	at org.apache.tools.ant.Main.startAnt(Main.java:187)
[java] 	at org.apache.tools.ant.launch.Launcher.run(Launcher.java:246)
[java] 	at org.apache.tools.ant.launch.Launcher.main(Launcher.java:67)
[java] Java Result: 104
[java] Java Result: 104
The execution FAILED with the following exception:
The following error occurred while executing this line:
/export/users/cc/cc-reliability/adaptors/reliability/adaptor.xml:97: Some reliability tests failed on /export/users/cc/cc-reliability/build/checkouts/snapshot/hdk/jdk/jre/bin/java

***********************************************************
Unit Tests: (75)
        
error: test api.kernel.hooks.AddRmPropertiesHooksTest
error: test api.kernel.management.SystemResourceOrientedTest
error: test api.kernel.string.InternThreadingTest
error: test api.kernel.thread.RecursiveThreadTest.RecursiveTest
error: test api.kernel.thread.Synchronization.SynchroTest
error: test api.kernel.thread.ThreadArrayTest.ThreadArrayTest
error: test api.kernel.thread.ThreadSuspendResume.ThreadSuspendResume
error: test api.kernel.thread.VolatileVariableTest.DekkerTest
error: test api.kernel.thread.VolatileVariableTest.PetersonTest
error: test api.kernel.thread.WeakReferenceandThreadTest.WeakReferenceandThreadTest
error: test api.kernel.threadgroup.EnumerateTest
error: test api.net.DatagramTest
error: test api.net.HttpConnectionTest
error: test api.net.MultiConnectTest
error: test api.net.SingleConnectTest
error: test api.nio.channels.filechannel.CopyFilesTest
error: test api.nio.charset.DecodingModesTest
error: test api.nio.charset.EncodingModesTest
error: test api.util.ConcurrentTest
error: test vm.classloading.ClassCastTest
error: test vm.exceptions.ExceptionsTest
error: test vm.finalization.FinalizeThrowRestoreTest
error: test vm.stack.StackUnwindTest
Unit Test Error Details:	(23)
                
Test: testClass: api.kernel.hooks.AddRmPropertiesHooksTestOK
The GC did not provide gc_add_weak_root_set_entry()
Test: testClass: api.kernel.management.SystemResourceOrientedTestThe GC did not provide gc_add_weak_root_set_entry()
OK
OK
OK
OK
OK
OK
OK
OK
OK
OK
OK
Test: testClass: api.kernel.string.InternThreadingTestThe GC did not provide gc_add_weak_root_set_entry()
OK
OK
OK
OK
OK
OK
Test: testClass: api.kernel.thread.RecursiveThreadTest.RecursiveTestOK
The GC did not provide gc_add_weak_root_set_entry()
OK
OK
Uncaught exception in Thread-345:
java.lang.OutOfMemoryError: Failed to create new thread
	at java.lang.Thread.start(Thread.java:744)
	at org.apache.harmony.test.reliability.api.kernel.thread.RecursiveThreadTest.recurThread.run(Unknown Source)
Test: testClass: api.kernel.thread.Synchronization.SynchroTestOK
The GC did not provide gc_add_weak_root_set_entry()
OK
OK
OK
OK
OK
OK
OK
OK
OK
OK
OK
OK
OK
OK
OK
OK
OK
OK
OK
OK
OK
OK
OK
OK
OK
OK
OK
OK
OK
OK
OK
OK
OK
OK
OK
OK
OK
OK
OK
OK
OK
OK
OK
OK
OK
OK
Test: testClass: api.kernel.thread.ThreadArrayTest.ThreadArrayTestThe GC did not provide gc_add_weak_root_set_entry()
Test: testClass: api.kernel.thread.ThreadSuspendResume.ThreadSuspendResumeThe GC did not provide gc_add_weak_root_set_entry()
Test: testClass: api.kernel.thread.VolatileVariableTest.DekkerTestOK
The GC did not provide gc_add_weak_root_set_entry()
OK
OK
OK
OK
OK
OK
OK
OK
OK
OK
OK
OK
OK
OK
OK
OK
OK
OK
OK
OK
OK
OK
OK
OK
OK
OK
OK
OK
OK
OK
OK
OK
OK
OK
OK
OK
OK
OK
OK
OK
OK
OK
OK
OK
OK
OK
OK
OK
OK
OK
OK
OK
OK
OK
OK
OK
OK
OK
OK
OK
OK
OK
OK
OK
OK
OK
OK
OK
OK
OK
OK
OK
OK
OK
OK
OK
OK
OK
OK
OK
OK
OK
OK
OK
OK
OK
OK
OK
OK
OK
OK
OK
OK
OK
OK
OK
OK
OK
OK
OK
OK
OK
OK
OK
OK
OK
OK
OK
OK
OK
OK
OK
OK
OK
OK
OK
OK
OK
OK
OK
OK
OK
OK
OK
OK
OK
OK
OK
OK
OK
OK
OK
OK
OK
OK
OK
OK
OK
OK
OK
OK
OK
OK
OK
OK
OK
OK
OK
OK
OK
OK
OK
OK
OK
OK
OK
OK
OK
OK
OK
OK
OK
OK
OK
OK
OK
Test: testClass: api.kernel.thread.VolatileVariableTest.PetersonTestOK
The GC did not provide gc_add_weak_root_set_entry()
OK
OK
OK
OK
OK
OK
OK
OK
OK
OK
OK
OK
OK
OK
OK
OK
OK
OK
OK
OK
OK
OK
OK
OK
OK
OK
OK
OK
OK
OK
OK
OK
OK
OK
OK
OK
OK
OK
OK
OK
OK
OK
OK
OK
OK
OK
OK
OK
OK
OK
OK
OK
OK
OK
OK
OK
OK
OK
OK
OK
OK
OK
OK
OK
OK
OK
OK
OK
OK
OK
OK
OK
OK
OK
OK
OK
OK
OK
OK
OK
OK
OK
OK
OK
OK
OK
OK
OK
OK
OK
OK
OK
OK
OK
OK
OK
OK
OK
OK
OK
OK
OK
OK
OK
OK
OK
OK
OK
OK
OK
OK
OK
OK
OK
OK
OK
OK
OK
OK
OK
OK
OK
OK
OK
OK
OK
OK
OK
OK
OK
OK
OK
OK
OK
OK
OK
OK
OK
OK
OK
OK
OK
OK
OK
OK
OK
OK
OK
OK
OK
OK
OK
OK
OK
OK
OK
OK
OK
OK
OK
OK
OK
OK
OK
OK
OK
Test: testClass: api.kernel.thread.WeakReferenceandThreadTest.WeakReferenceandThreadTestThe GC did not provide gc_add_weak_root_set_entry()
OK
OK
OK
OK
OK
OK
Test: testClass: api.kernel.threadgroup.EnumerateTestThe GC did not provide gc_add_weak_root_set_entry()
OK
Test: testClass: api.net.DatagramTestThe GC did not provide gc_add_weak_root_set_entry()
Test: testClass: api.net.HttpConnectionTest
Test: testClass: api.net.MultiConnectTestThe GC did not provide gc_add_weak_root_set_entry()
Test: testClass: api.net.SingleConnectTestServer thread 56 could not accept request: The address is not available
The GC did not provide gc_add_weak_root_set_entry()
Test: testClass: api.nio.channels.filechannel.CopyFilesTestOK
The GC did not provide gc_add_weak_root_set_entry()
OK
OK
OK
OK
OK
OK
OK
OK
OK
OK
OK
OK
OK
OK
OK
OK
OK
OK
OK
OK
OK
OK
OK
OK
OK
OK
OK
OK
OK
OK
OK
OK
java.lang.OutOfMemoryError: Failed to create new thread
	at java.lang.Thread.start(Thread.java:744)
	at org.apache.harmony.test.reliability.api.nio.channels.filechannel.CopyFilesTest.copy(Unknown Source)
	at org.apache.harmony.test.reliability.api.nio.channels.filechannel.CopyFilesTest.test(Unknown Source)
	at org.apache.harmony.test.reliability.share.LongRunningTestStarter.test(Unknown Source)
	at org.apache.harmony.test.reliability.share.ReliabilityTestStarter.test(Unknown Source)
	at org.apache.harmony.test.reliability.share.ReliabilityTestStarter.main(Unknown Source)
Exception thrown: java.lang.OutOfMemoryError: Failed to create new thread
Failed
*** iteration: 33
test result is 105
Test FAILED
Test: testClass: api.nio.charset.DecodingModesTestSIGABRT in VM code.
Stack trace:
Test: testClass: api.nio.charset.EncodingModesTestThe GC did not provide gc_add_weak_root_set_entry()
Test: testClass: api.util.ConcurrentTest
Test: testClass: vm.classloading.ClassCastTestThe GC did not provide gc_add_weak_root_set_entry()
Failed to test class: org.omg.SendingContext.RunTimeOperations Issue:java.lang.IllegalMonitorStateException
java.lang.IllegalMonitorStateException
	at java.lang.Class.initReflectionData(Class.java:741)
	at java.lang.Class.getName(Class.java:506)
	at org.apache.harmony.test.reliability.vm.classloading.ClassCastTest.testContent(Unknown Source)
	at org.apache.harmony.test.reliability.share.ClassMultiTestBase.run(Unknown Source)
	at java.lang.Thread.run(Thread.java:662)
Failed to test class: java.awt.geom.RectangularShape Issue:java.lang.IllegalMonitorStateException
java.lang.IllegalMonitorStateException
	at java.lang.Class.initReflectionData(Class.java:741)
	at java.lang.Class.getName(Class.java:506)
	at org.apache.harmony.test.reliability.vm.classloading.ClassCastTest.testContent(Unknown Source)
	at org.apache.harmony.test.reliability.share.ClassMultiTestBase.run(Unknown Source)
	at java.lang.Thread.run(Thread.java:662)
Failed to test class: java.lang.CharSequence Issue:java.lang.IllegalMonitorStateException
java.lang.IllegalMonitorStateException
	at java.lang.Class.initReflectionData(Class.java:741)
	at java.lang.Class.getName(Class.java:506)
	at org.apache.harmony.test.reliability.vm.classloading.ClassCastTest.testContent(Unknown Source)
	at org.apache.harmony.test.reliability.share.ClassMultiTestBase.run(Unknown Source)
	at java.lang.Thread.run(Thread.java:662)
Test: testClass: vm.exceptions.ExceptionsTestThe GC did not provide gc_add_weak_root_set_entry()
PASSED
PASSED
PASSED
Test: testClass: vm.finalization.FinalizeThrowRestoreTestThe GC did not provide gc_add_weak_root_set_entry()
OK
OK
OK
OK
OK
OK
OK
OK
Test: testClass: vm.stack.StackUnwindTest

***********************************************************
Modifications since last successful build:	(5)
            
add cc-snapshot log20070724161634Lbuild.5 07/24/2007 16:16:34snapshot
add cc-snapshot log20070720170220Lbuild.4 07/20/2007 17:02:20snapshot
add cc-snapshot log20070719185009Lbuild.3 07/19/2007 18:50:09snapshot
add cc-snapshot log20070712182841Lbuild.2 07/12/2007 18:28:41snapshot
add cc-snapshot log20070711124837Lbuild.1 07/11/2007 12:48:37snapshot

begin 644 execution_log.zip
M4$L#! H    ( '6(^#:;RT_B @H  ,S_   2    97AE8W5T:6]N7VQO9RYH
M=&UL[9UM4]LZ%L=?;S^%W^Q<]@4.4![:+,L,#8&F [<= NW,[70ZBJTD:F3)
M5U: ]-/OD9W0A())E(?=-O\[W,:RK?\Y.CZ6?U(<^[!K$WETV-+QX.@P-?SH
MD 69'4C^GS_:6MG-3'SGU>#5UC___<?1"]-7U1>!^^_S-W;#O@1O^D+&;2%I
M%]H6WB5R8G.^F/1B8;X$-<.9Y7% A6I0X7>I-K;2S[C)*E%$?YN&2\%:0@H[
MJ+2<;L7PK"]M5AG?LK.U=;!)?SN[7[=VMP\FS$T4G#\L%>%WD59_<BKXS*.N
M_A)<]I42JA-8GMEJ,-P]_$ND=67-H&&Y(9^ONN1Z3+M=T5Z/2!7+[^C?X#+W
MN!IL;^W.:/,XEMS4+FLO=Y9IY8R:UE#O^[9IJ4W),DTU5%N>\+8\XY9$N%VF
MK=6UZB\I6JY5E!9F!78H;B<BLD(K9@;+MN?T*8+4M,[@G-_PG\_E!1O[R R=
MUY*?<]6Q73]KCY[S/6X4ER$SG6R6<W^L6GB<IA\O:N<?F%E>0HW;J]_QJ*YN
M5F$J;Y?1*3=6\,S?8EGH.37'(_2N6DA;7306[U17ZYY/0N3UJ(>.+Y,?<7OK
M5I8&[THD7/=)JB>DI"N?[?(@Z[<V4Z,CGF5/UOL'LX$V'?*<15T>6JUE%C)E
M0\NR7DR=0N@B$+:UZ6WD2ZY:]6!O]U_S2KKP]RUWRV/*VP?;BU(>4WWEX^ZU
MZBE]J^J2)YR*(]4'JW/]G8,]#P-7Y'5(1YB"FVSDA5SLY?Y<P6WRO_ODF&#R
MWN6Q5;F%YPPH;L.L[60CPC(C6J'4'1&%C7;NY4AV6"R.V^N#<LV,3@]#%S,>
MV?",JQQVX@MNNSH^CER*:K,7"G6C>_<A#IJZ;R(^O>X)E[S#+)U7D\*-))4C
M[=)]BH/YS+%T2Z%DJG-OMU :61B6<JV]5[Z)<1RSE*[[]\$>7U=$?.<EDGJ&
MI/Z=PG'!(J,;*K-,1?S>Z\FUA9V#5[]]5*X(-+@=.U'R8B&XZW,U&2H,_7/N
M99.J^Z\]5.EJ_LUU%D,_FS0DY7$AFVV,-@[/[.W]^0T4T@^4M[WZHRZ7% SJ
M7MN,.*B>ZVLS:2C;>+@YM[B[M:B6/ S2UKY/:E\P0=>+OLHG$S;R4M%[^*O1
M^6;LL;)C:MNOGKD:/JHF65]%W? \_Z!XDYL;]X7B;-OU28R'N@GY^4!X_U%_
MIT?59M?&M^IY3)U_5%$8';-7T[3>U%C&ES.ZT"V7=!XD7U0,W^<?-:G5' [.
M;O!4*";%]Y7:/.,VDBS+WK*L&^EX20<DC7J=ZM1[9\2OJN-Q^(J*(5U/N<J$
M%3?+#N6]04(\M5);4\TY8H2)$29&F!AA(JG7(1P886*$B1$F1IA^NHL:80XQ
MM9E_S O&9:,$FR.PQRBAJ-@QNI^&==5/BB_QP='@:'!TB2XX&DF]%N$ 1X.C
MP='@:#_=17%T0:EA,=';[&<I5['#Y(0_M@[H^BNAZW2'_I)T3>:^Q,C+;H0R
MMJYLO/+K\0.@N,PBH/B73.K?*1R 8D QH!A0[*<[-10#6O]OH?57O0H#+<LL
M BU_R:3^G<(!M 1: BV!EGZZ"YYO;0Y(R&@EOC/WL^I1&;<' %>!JV6ZP%4D
M]5J$ [@*7 6N E?]=%>'JSM^M]S.8KWX8OK8&)8_?.AA&< ,8 8P Y@!S !F
M #. &< \HS2 >>' _%%+NIY*/GJV9,ZM)[S7>^9YG4!6("N0%<B*I%Z'< !9
M@:Q 5B"KG^XJD/4#IPM5ILN?K0!H!;0"6@&M2.IU" >@%= *: 6T^NDN&%H_
M<=:[Y&UN.'4[3,5COV%_>A- %B +D 7( F0!L@!9@"Q =D9I@.Q4(#M1^/FQ
MLOK63;/Z/5FVJ!LV+8MZ5X9%O'X7I79);U%,F&*=O+OR</9'Y; YR"Q/R(.<
M2-X;02LYB!Q$#B(OU061(ZG7(AP@<A YB!Q$[J<[)Y%'.DF%Y,:#<4=5PW?"
MUH;+2T'Q*5YN9_G=3)CN]@_?&,YZ#>OH19NOQU*>ZXA)_C1?ES9@"H.4^,<W
M3$@WBAG:^EK34BXP8DKH,.HRD_&9XC%6C7J&2+NWWUWH^)DWU&.<@G$*QBD8
MIR"IUR$<&*=@G()Q"L8I?KISWP(SCJAU%1&E+NN=T \L 89]E0'#@&' ,)+Z
M-PP'8!@P#!@&#/OI+A2&/QFM.K6B\"=+RM]>5HK%93/*2G&9>4PIY_7"MJ#+
M=%$(:\7G:>-]<\D$_XAMG0Y.J3S3/4-[B[#LK Y;?L'2E3><;*8\?C.P_$V_
MW>;F5!/7+2%36KGZS(DRK!;^<)!)J2,BU!-AJ,=99KR>MKU:J^X[-+;JIG[H
MVV)A%69=)U58:THQ3_KYF/QD6'K&5Q+>2:.KL'BB^RW)5][04ZF97;G5AEJ]
MS7.ZQJ[<:+-+B+H@JT_UV%-\N?YPI_(&D/^-]XOV<\9OLXF*WC%S;61-T]4O
M<D_O7=KQ(EMOK4VGM(190LP28I80LX1(ZG4(!V8),4N(64+,$OKISC]+Z.[F
M9)9U#$MFX-^7KV>T<4'UQ!" 0;^@7]!OF2[H%TF]%N$ _8)^0;^@7S_=A=!O
MDU9)#C0%F@)-@:9 4Z IT!1H"C0%FO[/T?1/;FO2/0QL0?=)W"0ND%%OVALE
M1OL7CU.[5K="X:ED(&00<JDN"!E)O1;A "&#D$'((&0_79^GDA&01I)EF=3,
M_>)^!HX=KW9_A=;*_69?+N.^WX<F:ZY08QEFF,'/X.=27? SDGHMP@%^!C^#
MG\'/?KJ>_-P6BDGQ/:??&?AYO%IX6A3X3&^L\ ?I1VU?N7=]D!SE:/FOA,'4
M8&HP-9@:2;T.X0!3@ZG!U&!J/UU/IN9W$4\=G4[]4*.)2F']?A$D"Y(%R9;I
M@F21U&L1#I L2!8D"Y+UT_4DV4XT \%VHO 39[U+ZJV6-/-+%LYJ"WQ0W$TR
MQ;/L^E;(61XEY_8/:UI%?6.HSP3" ^&!\&6Z0'@D]5J$ P@/A ?" ^']='U?
MVYS1T3#"#F9AV%$=ZL&+A?Q^Y4LNV5RW=3SAGQ$SWX+R4T7R=%AJ29Y[.]L;
M&\H=+1DFO+ENG)\$S>M:K=YLGEZ?3VR\TI;)P!+E5X/=_2 1BDZ,+'BY%U"$
MM8ISPO\<$]Q8_B5PD.,0)]C>VPK<JQBRH&UT$E3X74K]3J5/+<XJ441_FX9+
MP5I"TK&IM-Q943%Y6[+*^!:*PR@"D4X'7P+W-HM)"U;/J__BBD8MQ4E/!R(X
M/6Z<UT^"6V&[^7BFK:74M\[H_5<<U;S*V 9CM ETE ^9XN"V2YZ-%-TA[XHL
MD$+QZHOG7&6.M;29]'*X,KQ+9/7U094 ->'!V YY3E&LF7!C,&K"= &A\S#J
MT>@MJV2*I5E7VTHW[E6^N?\-K[2$JK@L>'%884>'E=1P^K>EXP%]=&TBC_X+
M4$L! A0#"@    @ =8CX-IO+3^(""@  S/\  !(              *2!    
I &5X96-U=&EO;E]L;V<N:'1M;%!+!08      0 ! $     R"@     ! 
end

Mime
View raw message