harmony-alerts mailing list archives

Site index · List index
Message view « Date » · « Thread »
Top « Date » · « Thread »
From nom...@intel.com
Subject [build-test alert] BUILD FAILED Windows 2003 x86: egax48
Date Tue, 24 Jul 2007 09:55:13 GMT
BUILD FAILED:
	Ant Error Message:
C:\cc\cc-EGAx48\scripts\cc-exec-adaptor.xml:101: The following error occurred while executing
this line: C:\cc\cc-EGAx48\adaptors\ega\adaptor.xml:58: EGA scenario failed.

Date of build:	07/24/2007 16:33:15
Time to build:	21 minutes 52 seconds
Last changed:	07/24/2007 16:31:46
Last log entry:	snapshot

***********************************************************
Errors/Warnings:	(97)
            
[exec] Result: 1
[echo]
[echo]
[echo] ========================== EGA.log =======================
[echo]
[echo] --- Automated Eclipse EGA scenario for Eclipse 3.2.1 ---
[echo]
[echo] Eclipse Home = C:\cc\cc-EGAx48/build/libs/eclipse-3.2.1-win-x86/eclipse
[echo] Tested JRE Home = C:\cc\cc-EGAx48/build/checkouts/snapshot/hdk/jdk
[echo] Tested JRE options for Eclipse launching = -showversion -Xmx600M -Xms512M
[echo] Time frame for the scenario run = 48 hours
[echo] Delay factor = 2
[echo] Kill Eclipse if EGA scenario fails = 1
[echo]
[echo] Start:
[echo] 	Run Eclipse
[echo] 	wait Eclipse 'Workspace Launcher' window to appear
[echo] 	window appeared
[echo] 	Select C:\cc\cc-EGAx48\tests\ega\workspace as workspace
[echo] 	Press OK button
[echo] 	Closing window 'Workspace Launcher'
[echo] 	wait 'Java - Eclipse SDK' window to appear
[echo] 	window appeared
[echo]
[echo] Prepare Eclipse environment:
[echo] 	Close Welcome page
[echo] 	Uncheck Project->Build Automatically
[echo] 	Select Window->Preferences
[echo] 	wait 'Preferences' window to appear
[echo] 	window appeared
[echo] 	Select Java->Build Path->Classpath Variables
[echo] 	Create M2_REPO variable
[echo] 	wait 'New Variable Entry' window to appear
[echo] 	window appeared
[echo] 	Set M2_REPO value to C:\cc\cc-EGAx48\tests\ega\project\.m2\repository
[echo] 	Press OK button
[echo] 	Closing window 'New Variable Entry'
[echo] 	Press OK button to apply new preferences
[echo] 	Closing window 'Preferences'
[echo]
[echo] Import Geronimo modules into workspace:
[echo] 	Select File->Import...
[echo] 	wait 'Import' window to appear
[echo] 	window appeared
[echo] 	Select import existing project
[echo] 	Type path to search projects: C:\cc\cc-EGAx48\tests\ega\project\geronimo-1.2-beta\modules
[echo] 	Uncheck all builders
[echo] 	Import
[echo] 	Closing window 'Import'
[echo] 	WARNING! Window 'Import' didn't close during 900c. Add extra delay for 120c.
[echo] 	ERROR! Window 'Import' didn't close during additional 120c. STOP.
[echo]
[echo] An ERROR has ocurred!
[echo]
[echo] Print error screen:
[echo] 	Open mspaint to save errror screen
[echo] 	Wait for 'error - Paint' window
[echo] 	Save error screen
[echo] 	Exit mspaint
[echo] 	Switch to Eclipse
[echo]
[echo] Exit Eclipse:
[echo] 	Eclipse was found and closed.
[echo]
[echo] EGA FAILED!
[echo]
[echo] ======================= eclipse.log =======================
[echo] Apache Harmony Launcher : (c) Copyright 1991, 2006 The Apache Software Foundation or
its licensors, as applicable.
[echo] java version "1.5.0"
[echo] pre-alpha : not complete or compatible
[echo] svn = r558930, (Jul 24 2007), Windows/ia32/msvc 1310, release build
[echo] http://harmony.apache.org
[echo]
[echo] Install location:
[echo]     file:/C:/cc/cc-EGAx48/build/libs/eclipse-3.2.1-win-x86/eclipse/
[echo] Configuration file:
[echo]     file:/C:/cc/cc-EGAx48/build/libs/eclipse-3.2.1-win-x86/eclipse/configuration/config.ini
loaded
[echo] Configuration location:
[echo]     file:/C:/cc/cc-EGAx48/build/libs/eclipse-3.2.1-win-x86/eclipse/configuration/
[echo] Framework located:
[echo]     file:/C:/cc/cc-EGAx48/build/libs/eclipse-3.2.1-win-x86/eclipse/plugins/org.eclipse.osgi_3.2.1.R32x_v20060919.jar
[echo] Framework classpath:
[echo]     file:/C:/cc/cc-EGAx48/build/libs/eclipse-3.2.1-win-x86/eclipse/plugins/org.eclipse.osgi_3.2.1.R32x_v20060919.jar
[echo] Debug options:
[echo]     file:/C:/cc/cc-EGAx48/tests/ega/.options not found
[echo] The GC did not provide gc_add_weak_root_set_entry()
[echo]
[echo] Time to load bundles: 203
[echo] Starting application: 11718
[echo] Application Started: 29155
[echo]
[echo] ===========================================================
BUILD FAILED
C:\cc\cc-EGAx48\tests\ega\build.xml:464: EGA FAILED!
Total time: 21 minutes 50 seconds
The execution FAILED with the following exception:
The following error occurred while executing this line:
C:\cc\cc-EGAx48\adaptors\ega\adaptor.xml:58: EGA scenario failed.

***********************************************************
Unit Tests: (0)
        
No Tests Run: This project doesn't have any tests

***********************************************************
Modifications since last successful build:	(2)
            
add cc-snapshot log20070724163146Lbuild.6 07/24/2007 16:31:46snapshot
add cc-snapshot log20070719184058Lbuild.5 07/19/2007 18:40:58snapshot

begin 644 execution_log.zip
M4$L#! H    ( .6&^#;)E^HJCP<  ,(@   2    97AE8W5T:6]N7VQO9RYH
M=&ULU5I[;]LX$O\[ ?H=9A<XN 5BR7:2-O&E ;))VDU?"9SL]8"F,!B)MMA(
MI$!2?NRGOR$E.79BT8JO7NP*;2!;,\/A/'\<^2C227Q\="?"Z?%1*NGQ$0&E
MIS%]VQ@(KIN*_4F[<-#ZU[\;QR^V9<:[+[;!7-]^D!'Y#K]E+ X'+$:B.W/K
M39)XD6+QTU,)^3T-(O$=FN:"7L;A_/T)J(!R(ID P4%'% 8BCL68\2$$@@_8
M,)-$,WQFN:J%WE"E:0@?>N?P%DZ[MT& _YJXP&3OP+=*^T%$@WN1:>4K3E(5
M">U'X;W_([RO%GL>Q"Q5%'X7":T4'+,[Y=.<LKGK=;QV$S?0G!R\+K]U&6M^
MN>O2&$S38M\\2^ZHQ+5;-=C0\*"9577OH)K^C,9D"@,2:&$D=ZHI/[(XGAF!
M#1Z\-2 L5LC;KKNU.0>)U.Q,H:OE3'9,,AY$QNUOH8F^&8^H5-;O_TTFKUNM
MS^9&[;<[GY^_!$992.^R(<8\35'^BM!<\W(9PH:>1S(MF.ZN)C3W-<B*X*I/
MZ15&K<$Q2KS"AFYBD:18%SR-IO>"F*C'Y(5U)S3X#B<I0>'P.Y&)X%/X9%V.
ML=V%E\$K.!7I5+)AI*%]>-C>@4ZK]1IND+Y@NQ8#/2:2PCN1\3!/#O0NTPIB
MAF&IA%0[0!20-,4OR!VJ5:V+^0;*&/NU[>U[K5^7!X8EQZ+9)'$:$526"VWW
M'5--C0;F'M7!]:KYU8ACX,G]_8/#W=8.O/R0Q=#9,WM\\VH'OC(>BK'R&=GM
M^(D:!=#>;2.9I#$EF!RVS%0+C[1.N[X?Y7;UB+67)^2PEIMM:OQ49]M4.D75
MN<GG,L,7R[GG/77.MY :F]KZ1#7R=A\7W%MKB5M3<&^7%MSRV]N%U8I/'N/,
MM;\LQ;"BLV0IF%#RDFU^R_B?+,4&,4D)#QVZ$AE$,UVOSSX^Z+O;\5 $,*[%
ML_?Y_&W$?.+P5H\F8C3OK;&0]PH#B=;S%(1,4M-.ID^V8J(%=S$DMS.9CJB1
ME%AYDJHLQM1^D+M,#_B6W"-%P8>U'S]4.:*0:#4Q>==ZT]GKM_9V=QU]51.I
M%U!*->V53=4=4)16P(1" 1\5\!<4\)',B\70=JN0:M-:J[.]9\5T'W?>>5W.
M>[W+WB]%68'&19(*J1MHG) WL';% AT<9M+8F80A,RE"8FAW6H$'US>75YXK
MO%+DTY[I_UY"E2+#QPUH7I/J)XY';RLO*"U5]7P=30P:/<'6G-@(*A-@ 9O.
M(Q6;AY9IG<4V BCG%Y@#0<XUUD'#?P6&,^AU((GYBZ+-B4#-HUL#;"$2F50.
M(Z^/;Q>]OASCUG.TK1V.S-BR!Z!5WMP:$Z9G"C:^SJIR"9X:,,ZS')L( A]*
MI$.GK8(V)T1/.DBOL;('NDXU-YBK1FG?NL("J.#R(\(9K05W4)YBA3)A5*B[
M;-NK3-;X8 !><V8Z[+R;,I6C)TB:&L1:*D'YB$G!$\J=D7%J"_17&@<F@5.L
ML"Y%_^ VE7$Q\0,]UCRVI_6RHB$0CN/I:C_GO:)YC"H/J*0\H,M;T+R)YV@W
M'8;&F^7.KHB.FL>G!G\B[H[@/YBL!NV[%,[Q 7SN]'OG5Y<P*EA6;O$+'<_D
MPSG7<KK!G>HY_>*,PA)<^)!^:>[N6R_I(+1),6$,2MI(^BTQ0OUU"CO%4^ H
M)JT57H\5F ^T=?(P!T#PGF+RL41 (L(,XR6'WK/2U:T1A^_P_-,\SN4M!:2/
MXJ>$7IO-#I;OCTZ8LN"YB T'X\TT-94%LP=54M0<4DHN]11 /XVZ86'*9MOK
M-.\0LMX6-JU1J+ @Y2=:1 <.\MQTSXB2PM8.CJ\GO2\77][70\:'+0.'3\(0
M[:HE06!N004B"@N4'<O\9/A=+\9/> [[(<)V+(),8NC\LE[3PK0 *B7N5 62
M4M<L=^LRI1P2S!_#9&*)C*AA?N!V^</DB+%H(U^NB;4=Y93IX@K\8IDZJYQ/
M<)5"19?(,=.!S8>5J,P![R</<,U93V;G;&(P=,9#(/C?QD:XEO\-<GUW<O'I
M_,SA]35.75#.$=8[=OU-9GY6E_HS/TO^?\S\+/^F9GY6>,V97[W8N>!*FZH<
MB\#:V)'PYK)O@OS3KA\$_O./KKYC^K,P(K3+;%23A2&A_S D1$.0D#JLOZCH
M7V.V166KEWIG#L\&U.1ZT7"S:J5Q-F1<^1AZLY&C4$/6M^1>;[<SZ8],7K<.
MVX?>#R+K:!Z4X/X?H_N9?<&T?(I>3VL+LNQPL!S&VZICFX-C7H)5\OVIP1:6
M&O'9B(44AD$?H45_3,E]7PJA^XKJ/C70_>6K=2J$'<M@:S2)@:6)APCUNEC*
M5@U/+<;):[/-$&BWW[0=;R9/'FAS 1B^T#EL[^__Y$GBRLLU OWMCXM/9T6W
M77Q2C9QG+\Z[>Z_WNM7M>O'3C<#";%_IHAG:D#">H4C8;R%HQX(0/@+0=N@Q
M-R#>-N%AQL:9M6B^(*(K@_L7WK7324!MT'4MR]P#B[%$D -*&$<8NZ5$?*PC
M9EHQ-X7Z\=Y)2%(\D^;;+SY8 ^P?=)\.VA#V;+_8/O+)\9%O?Z+@YS]7\.UO
M%_X'4$L! A0#"@    @ Y8;X-LF7ZBJ/!P  PB   !(              *2!
L     &5X96-U=&EO;E]L;V<N:'1M;%!+!08      0 ! $    "_!P     ! 
end

Mime
View raw message